Guest User

Untitled

a guest
Oct 26th, 2026
11
0
Never
1
Not a member of Pastebin yet? Sign Up, it unlocks many cool features!
text 69.13 KB | None | 0 0
  1. ============================= test session starts ==============================
  2. platform linux -- Python 3.12.3, pytest-9.0.3, pluggy-1.6.0 -- /home/sayakpaul/.dev/bin/python
  3. cachedir: .pytest_cache
  4. rootdir: /tmp/diffusers-pr-14521-head-tests
  5. configfile: pyproject.toml
  6. plugins: anyio-4.15.1, timeout-2.4.0, xdist-3.8.0, requests-mock-1.12.1
  7. collecting ... collected 1658 items / 1508 deselected / 150 selected
  8.  
  9. tests/modular_pipelines/anima/test_modular_pipeline_anima.py::TestAnimaModularPipelineFast::test_pipeline_call_signature PASSED [ 0%]
  10. tests/modular_pipelines/anima/test_modular_pipeline_anima.py::TestAnimaModularPipelineFast::test_pipeline_optional_parameters FAILED [ 1%]
  11. tests/modular_pipelines/anima/test_modular_pipeline_anima.py::TestAnimaModularPipelineFast::test_pipeline_required_inputs FAILED [ 2%]
  12. tests/modular_pipelines/anima/test_modular_pipeline_anima.py::TestAnimaImg2ImgModularPipelineFast::test_pipeline_call_signature PASSED [ 2%]
  13. tests/modular_pipelines/anima/test_modular_pipeline_anima.py::TestAnimaImg2ImgModularPipelineFast::test_pipeline_optional_parameters FAILED [ 3%]
  14. tests/modular_pipelines/anima/test_modular_pipeline_anima.py::TestAnimaImg2ImgModularPipelineFast::test_pipeline_required_inputs FAILED [ 4%]
  15. tests/modular_pipelines/cosmos/test_modular_pipeline_cosmos3.py::TestCosmos3OmniModularPipelineFast::test_pipeline_call_signature PASSED [ 4%]
  16. tests/modular_pipelines/cosmos/test_modular_pipeline_cosmos3.py::TestCosmos3OmniModularPipelineFast::test_pipeline_optional_parameters FAILED [ 5%]
  17. tests/modular_pipelines/cosmos/test_modular_pipeline_cosmos3.py::TestCosmos3OmniModularPipelineFast::test_pipeline_required_inputs FAILED [ 6%]
  18. tests/modular_pipelines/cosmos/test_modular_pipeline_cosmos3_distilled.py::TestCosmos3DistilledModularPipelineFast::test_pipeline_call_signature PASSED [ 6%]
  19. tests/modular_pipelines/cosmos/test_modular_pipeline_cosmos3_distilled.py::TestCosmos3DistilledModularPipelineFast::test_pipeline_optional_parameters PASSED [ 7%]
  20. tests/modular_pipelines/cosmos/test_modular_pipeline_cosmos3_distilled.py::TestCosmos3DistilledModularPipelineFast::test_pipeline_required_inputs FAILED [ 8%]
  21. tests/modular_pipelines/echo/test_modular_pipeline_echo.py::TestEchoModularPipelineFast::test_pipeline_call_signature PASSED [ 8%]
  22. tests/modular_pipelines/echo/test_modular_pipeline_echo.py::TestEchoModularPipelineFast::test_pipeline_optional_parameters PASSED [ 9%]
  23. tests/modular_pipelines/echo/test_modular_pipeline_echo.py::TestEchoModularPipelineFast::test_pipeline_required_inputs FAILED [ 10%]
  24. tests/modular_pipelines/ernie_image/test_modular_pipeline_ernie_image.py::TestErnieImageModularPipelineFast::test_pipeline_call_signature PASSED [ 10%]
  25. tests/modular_pipelines/ernie_image/test_modular_pipeline_ernie_image.py::TestErnieImageModularPipelineFast::test_pipeline_optional_parameters PASSED [ 11%]
  26. tests/modular_pipelines/ernie_image/test_modular_pipeline_ernie_image.py::TestErnieImageModularPipelineFast::test_pipeline_required_inputs FAILED [ 12%]
  27. tests/modular_pipelines/flux/test_modular_pipeline_flux.py::TestFluxModularPipelineFast::test_pipeline_call_signature PASSED [ 12%]
  28. tests/modular_pipelines/flux/test_modular_pipeline_flux.py::TestFluxModularPipelineFast::test_pipeline_optional_parameters PASSED [ 13%]
  29. tests/modular_pipelines/flux/test_modular_pipeline_flux.py::TestFluxModularPipelineFast::test_pipeline_required_inputs FAILED [ 14%]
  30. tests/modular_pipelines/flux/test_modular_pipeline_flux.py::TestFluxImg2ImgModularPipelineFast::test_pipeline_call_signature PASSED [ 14%]
  31. tests/modular_pipelines/flux/test_modular_pipeline_flux.py::TestFluxImg2ImgModularPipelineFast::test_pipeline_optional_parameters PASSED [ 15%]
  32. tests/modular_pipelines/flux/test_modular_pipeline_flux.py::TestFluxImg2ImgModularPipelineFast::test_pipeline_required_inputs FAILED [ 16%]
  33. tests/modular_pipelines/flux/test_modular_pipeline_flux.py::TestFluxKontextModularPipelineFast::test_pipeline_call_signature PASSED [ 16%]
  34. tests/modular_pipelines/flux/test_modular_pipeline_flux.py::TestFluxKontextModularPipelineFast::test_pipeline_optional_parameters PASSED [ 17%]
  35. tests/modular_pipelines/flux/test_modular_pipeline_flux.py::TestFluxKontextModularPipelineFast::test_pipeline_required_inputs FAILED [ 18%]
  36. tests/modular_pipelines/flux2/test_modular_pipeline_flux2.py::TestFlux2ModularPipelineFast::test_pipeline_call_signature PASSED [ 18%]
  37. tests/modular_pipelines/flux2/test_modular_pipeline_flux2.py::TestFlux2ModularPipelineFast::test_pipeline_optional_parameters FAILED [ 19%]
  38. tests/modular_pipelines/flux2/test_modular_pipeline_flux2.py::TestFlux2ModularPipelineFast::test_pipeline_required_inputs FAILED [ 20%]
  39. tests/modular_pipelines/flux2/test_modular_pipeline_flux2.py::TestFlux2ImageConditionedModularPipelineFast::test_pipeline_call_signature PASSED [ 20%]
  40. tests/modular_pipelines/flux2/test_modular_pipeline_flux2.py::TestFlux2ImageConditionedModularPipelineFast::test_pipeline_optional_parameters FAILED [ 21%]
  41. tests/modular_pipelines/flux2/test_modular_pipeline_flux2.py::TestFlux2ImageConditionedModularPipelineFast::test_pipeline_required_inputs FAILED [ 22%]
  42. tests/modular_pipelines/flux2/test_modular_pipeline_flux2_klein.py::TestFlux2KleinModularPipelineFast::test_pipeline_call_signature PASSED [ 22%]
  43. tests/modular_pipelines/flux2/test_modular_pipeline_flux2_klein.py::TestFlux2KleinModularPipelineFast::test_pipeline_optional_parameters FAILED [ 23%]
  44. tests/modular_pipelines/flux2/test_modular_pipeline_flux2_klein.py::TestFlux2KleinModularPipelineFast::test_pipeline_required_inputs FAILED [ 24%]
  45. tests/modular_pipelines/flux2/test_modular_pipeline_flux2_klein.py::TestFlux2KleinImageConditionedModularPipelineFast::test_pipeline_call_signature PASSED [ 24%]
  46. tests/modular_pipelines/flux2/test_modular_pipeline_flux2_klein.py::TestFlux2KleinImageConditionedModularPipelineFast::test_pipeline_optional_parameters FAILED [ 25%]
  47. tests/modular_pipelines/flux2/test_modular_pipeline_flux2_klein.py::TestFlux2KleinImageConditionedModularPipelineFast::test_pipeline_required_inputs FAILED [ 26%]
  48. tests/modular_pipelines/flux2/test_modular_pipeline_flux2_klein_base.py::TestFlux2KleinBaseModularPipelineFast::test_pipeline_call_signature PASSED [ 26%]
  49. tests/modular_pipelines/flux2/test_modular_pipeline_flux2_klein_base.py::TestFlux2KleinBaseModularPipelineFast::test_pipeline_optional_parameters FAILED [ 27%]
  50. tests/modular_pipelines/flux2/test_modular_pipeline_flux2_klein_base.py::TestFlux2KleinBaseModularPipelineFast::test_pipeline_required_inputs FAILED [ 28%]
  51. tests/modular_pipelines/flux2/test_modular_pipeline_flux2_klein_base.py::TestFlux2KleinBaseImageConditionedModularPipelineFast::test_pipeline_call_signature PASSED [ 28%]
  52. tests/modular_pipelines/flux2/test_modular_pipeline_flux2_klein_base.py::TestFlux2KleinBaseImageConditionedModularPipelineFast::test_pipeline_optional_parameters FAILED [ 29%]
  53. tests/modular_pipelines/flux2/test_modular_pipeline_flux2_klein_base.py::TestFlux2KleinBaseImageConditionedModularPipelineFast::test_pipeline_required_inputs FAILED [ 30%]
  54. tests/modular_pipelines/flux3/test_modular_pipeline_flux3.py::TestFlux3ModularPipelineFast::test_pipeline_call_signature PASSED [ 30%]
  55. tests/modular_pipelines/flux3/test_modular_pipeline_flux3.py::TestFlux3ModularPipelineFast::test_pipeline_optional_parameters FAILED [ 31%]
  56. tests/modular_pipelines/flux3/test_modular_pipeline_flux3.py::TestFlux3ModularPipelineFast::test_pipeline_required_inputs FAILED [ 32%]
  57. tests/modular_pipelines/flux3/test_modular_pipeline_flux3.py::TestFlux3DistilledModularPipelineFast::test_pipeline_call_signature PASSED [ 32%]
  58. tests/modular_pipelines/flux3/test_modular_pipeline_flux3.py::TestFlux3DistilledModularPipelineFast::test_pipeline_optional_parameters FAILED [ 33%]
  59. tests/modular_pipelines/flux3/test_modular_pipeline_flux3.py::TestFlux3DistilledModularPipelineFast::test_pipeline_required_inputs FAILED [ 34%]
  60. tests/modular_pipelines/helios/test_modular_pipeline_helios.py::TestHeliosModularPipelineFast::test_pipeline_call_signature PASSED [ 34%]
  61. tests/modular_pipelines/helios/test_modular_pipeline_helios.py::TestHeliosModularPipelineFast::test_pipeline_optional_parameters PASSED [ 35%]
  62. tests/modular_pipelines/helios/test_modular_pipeline_helios.py::TestHeliosModularPipelineFast::test_pipeline_required_inputs FAILED [ 36%]
  63. tests/modular_pipelines/helios/test_modular_pipeline_helios.py::TestHeliosPyramidModularPipelineFast::test_pipeline_call_signature PASSED [ 36%]
  64. tests/modular_pipelines/helios/test_modular_pipeline_helios.py::TestHeliosPyramidModularPipelineFast::test_pipeline_optional_parameters PASSED [ 37%]
  65. tests/modular_pipelines/helios/test_modular_pipeline_helios.py::TestHeliosPyramidModularPipelineFast::test_pipeline_required_inputs FAILED [ 38%]
  66. tests/modular_pipelines/hunyuan_video1_5/test_modular_pipeline_hunyuan_video1_5.py::TestHunyuanVideo15ModularPipelineFast::test_pipeline_call_signature PASSED [ 38%]
  67. tests/modular_pipelines/hunyuan_video1_5/test_modular_pipeline_hunyuan_video1_5.py::TestHunyuanVideo15ModularPipelineFast::test_pipeline_optional_parameters FAILED [ 39%]
  68. tests/modular_pipelines/hunyuan_video1_5/test_modular_pipeline_hunyuan_video1_5.py::TestHunyuanVideo15ModularPipelineFast::test_pipeline_required_inputs FAILED [ 40%]
  69. tests/modular_pipelines/krea2/test_modular_pipeline_krea2.py::TestKrea2ModularPipelineFast::test_pipeline_call_signature PASSED [ 40%]
  70. tests/modular_pipelines/krea2/test_modular_pipeline_krea2.py::TestKrea2ModularPipelineFast::test_pipeline_optional_parameters PASSED [ 41%]
  71. tests/modular_pipelines/krea2/test_modular_pipeline_krea2.py::TestKrea2ModularPipelineFast::test_pipeline_required_inputs FAILED [ 42%]
  72. tests/modular_pipelines/krea2/test_modular_pipeline_krea2_turbo.py::TestKrea2TurboModularPipelineFast::test_pipeline_call_signature PASSED [ 42%]
  73. tests/modular_pipelines/krea2/test_modular_pipeline_krea2_turbo.py::TestKrea2TurboModularPipelineFast::test_pipeline_optional_parameters PASSED [ 43%]
  74. tests/modular_pipelines/krea2/test_modular_pipeline_krea2_turbo.py::TestKrea2TurboModularPipelineFast::test_pipeline_required_inputs FAILED [ 44%]
  75. tests/modular_pipelines/ltx/test_modular_pipeline_ltx.py::TestLTXModularPipelineFast::test_pipeline_call_signature PASSED [ 44%]
  76. tests/modular_pipelines/ltx/test_modular_pipeline_ltx.py::TestLTXModularPipelineFast::test_pipeline_optional_parameters FAILED [ 45%]
  77. tests/modular_pipelines/ltx/test_modular_pipeline_ltx.py::TestLTXModularPipelineFast::test_pipeline_required_inputs FAILED [ 46%]
  78. tests/modular_pipelines/ltx2/test_modular_pipeline_ltx2.py::TestLTX2Text2VideoModularPipelineFast::test_pipeline_call_signature PASSED [ 46%]
  79. tests/modular_pipelines/ltx2/test_modular_pipeline_ltx2.py::TestLTX2Text2VideoModularPipelineFast::test_pipeline_optional_parameters FAILED [ 47%]
  80. tests/modular_pipelines/ltx2/test_modular_pipeline_ltx2.py::TestLTX2Text2VideoModularPipelineFast::test_pipeline_required_inputs FAILED [ 48%]
  81. tests/modular_pipelines/ltx2/test_modular_pipeline_ltx2.py::TestLTX2Image2VideoModularPipelineFast::test_pipeline_call_signature PASSED [ 48%]
  82. tests/modular_pipelines/ltx2/test_modular_pipeline_ltx2.py::TestLTX2Image2VideoModularPipelineFast::test_pipeline_optional_parameters FAILED [ 49%]
  83. tests/modular_pipelines/ltx2/test_modular_pipeline_ltx2.py::TestLTX2Image2VideoModularPipelineFast::test_pipeline_required_inputs FAILED [ 50%]
  84. tests/modular_pipelines/ltx2/test_modular_pipeline_ltx2.py::TestLTX2ConditionModularPipelineFast::test_pipeline_call_signature PASSED [ 50%]
  85. tests/modular_pipelines/ltx2/test_modular_pipeline_ltx2.py::TestLTX2ConditionModularPipelineFast::test_pipeline_optional_parameters FAILED [ 51%]
  86. tests/modular_pipelines/ltx2/test_modular_pipeline_ltx2.py::TestLTX2ConditionModularPipelineFast::test_pipeline_required_inputs FAILED [ 52%]
  87. tests/modular_pipelines/ltx2/test_modular_pipeline_ltx2.py::TestLTX2InContextModularPipelineFast::test_pipeline_call_signature PASSED [ 52%]
  88. tests/modular_pipelines/ltx2/test_modular_pipeline_ltx2.py::TestLTX2InContextModularPipelineFast::test_pipeline_optional_parameters FAILED [ 53%]
  89. tests/modular_pipelines/ltx2/test_modular_pipeline_ltx2.py::TestLTX2InContextModularPipelineFast::test_pipeline_required_inputs FAILED [ 54%]
  90. tests/modular_pipelines/ltx2/test_modular_pipeline_ltx25.py::TestLTX25Text2VideoModularPipelineFast::test_pipeline_call_signature PASSED [ 54%]
  91. tests/modular_pipelines/ltx2/test_modular_pipeline_ltx25.py::TestLTX25Text2VideoModularPipelineFast::test_pipeline_optional_parameters FAILED [ 55%]
  92. tests/modular_pipelines/ltx2/test_modular_pipeline_ltx25.py::TestLTX25Text2VideoModularPipelineFast::test_pipeline_required_inputs FAILED [ 56%]
  93. tests/modular_pipelines/ltx2/test_modular_pipeline_ltx25.py::TestLTX25Image2VideoModularPipelineFast::test_pipeline_call_signature PASSED [ 56%]
  94. tests/modular_pipelines/ltx2/test_modular_pipeline_ltx25.py::TestLTX25Image2VideoModularPipelineFast::test_pipeline_optional_parameters FAILED [ 57%]
  95. tests/modular_pipelines/ltx2/test_modular_pipeline_ltx25.py::TestLTX25Image2VideoModularPipelineFast::test_pipeline_required_inputs FAILED [ 58%]
  96. tests/modular_pipelines/ltx2/test_modular_pipeline_ltx25.py::TestLTX25ConditionModularPipelineFast::test_pipeline_call_signature PASSED [ 58%]
  97. tests/modular_pipelines/ltx2/test_modular_pipeline_ltx25.py::TestLTX25ConditionModularPipelineFast::test_pipeline_optional_parameters FAILED [ 59%]
  98. tests/modular_pipelines/ltx2/test_modular_pipeline_ltx25.py::TestLTX25ConditionModularPipelineFast::test_pipeline_required_inputs FAILED [ 60%]
  99. tests/modular_pipelines/ltx2/test_modular_pipeline_ltx25.py::TestLTX25InContextModularPipelineFast::test_pipeline_call_signature PASSED [ 60%]
  100. tests/modular_pipelines/ltx2/test_modular_pipeline_ltx25.py::TestLTX25InContextModularPipelineFast::test_pipeline_optional_parameters FAILED [ 61%]
  101. tests/modular_pipelines/ltx2/test_modular_pipeline_ltx25.py::TestLTX25InContextModularPipelineFast::test_pipeline_required_inputs FAILED [ 62%]
  102. tests/modular_pipelines/minimax_h3/test_modular_pipeline_minimax_h3.py::TestMiniMaxH3ModularPipelineFast::test_pipeline_call_signature PASSED [ 62%]
  103. tests/modular_pipelines/minimax_h3/test_modular_pipeline_minimax_h3.py::TestMiniMaxH3ModularPipelineFast::test_pipeline_optional_parameters FAILED [ 63%]
  104. tests/modular_pipelines/minimax_h3/test_modular_pipeline_minimax_h3.py::TestMiniMaxH3ModularPipelineFast::test_pipeline_required_inputs FAILED [ 64%]
  105. tests/modular_pipelines/minimax_h3/test_modular_pipeline_minimax_h3.py::TestMiniMaxH3Ref2VAModularPipelineFast::test_pipeline_call_signature PASSED [ 64%]
  106. tests/modular_pipelines/minimax_h3/test_modular_pipeline_minimax_h3.py::TestMiniMaxH3Ref2VAModularPipelineFast::test_pipeline_optional_parameters FAILED [ 65%]
  107. tests/modular_pipelines/minimax_h3/test_modular_pipeline_minimax_h3.py::TestMiniMaxH3Ref2VAModularPipelineFast::test_pipeline_required_inputs FAILED [ 66%]
  108. tests/modular_pipelines/minimax_music3/test_modular_pipeline_minimax_music3.py::TestMiniMaxMusic3ModularPipelineFast::test_pipeline_call_signature PASSED [ 66%]
  109. tests/modular_pipelines/minimax_music3/test_modular_pipeline_minimax_music3.py::TestMiniMaxMusic3ModularPipelineFast::test_pipeline_optional_parameters PASSED [ 67%]
  110. tests/modular_pipelines/minimax_music3/test_modular_pipeline_minimax_music3.py::TestMiniMaxMusic3ModularPipelineFast::test_pipeline_required_inputs PASSED [ 68%]
  111. tests/modular_pipelines/qwen/test_modular_pipeline_qwenimage.py::TestQwenImageModularPipelineFast::test_pipeline_call_signature PASSED [ 68%]
  112. tests/modular_pipelines/qwen/test_modular_pipeline_qwenimage.py::TestQwenImageModularPipelineFast::test_pipeline_optional_parameters FAILED [ 69%]
  113. tests/modular_pipelines/qwen/test_modular_pipeline_qwenimage.py::TestQwenImageModularPipelineFast::test_pipeline_required_inputs FAILED [ 70%]
  114. tests/modular_pipelines/qwen/test_modular_pipeline_qwenimage.py::TestQwenImageEditModularPipelineFast::test_pipeline_call_signature PASSED [ 70%]
  115. tests/modular_pipelines/qwen/test_modular_pipeline_qwenimage.py::TestQwenImageEditModularPipelineFast::test_pipeline_optional_parameters FAILED [ 71%]
  116. tests/modular_pipelines/qwen/test_modular_pipeline_qwenimage.py::TestQwenImageEditModularPipelineFast::test_pipeline_required_inputs FAILED [ 72%]
  117. tests/modular_pipelines/qwen/test_modular_pipeline_qwenimage.py::TestQwenImageEditPlusModularPipelineFast::test_pipeline_call_signature PASSED [ 72%]
  118. tests/modular_pipelines/qwen/test_modular_pipeline_qwenimage.py::TestQwenImageEditPlusModularPipelineFast::test_pipeline_optional_parameters PASSED [ 73%]
  119. tests/modular_pipelines/qwen/test_modular_pipeline_qwenimage.py::TestQwenImageEditPlusModularPipelineFast::test_pipeline_required_inputs FAILED [ 74%]
  120. tests/modular_pipelines/qwenimage21/test_modular_pipeline_qwenimage21.py::TestQwenImage21ModularPipelineFast::test_pipeline_call_signature PASSED [ 74%]
  121. tests/modular_pipelines/qwenimage21/test_modular_pipeline_qwenimage21.py::TestQwenImage21ModularPipelineFast::test_pipeline_optional_parameters FAILED [ 75%]
  122. tests/modular_pipelines/qwenimage21/test_modular_pipeline_qwenimage21.py::TestQwenImage21ModularPipelineFast::test_pipeline_required_inputs FAILED [ 76%]
  123. tests/modular_pipelines/qwenimage21/test_modular_pipeline_qwenimage21.py::TestQwenImage21ImageConditionedModularPipelineFast::test_pipeline_call_signature PASSED [ 76%]
  124. tests/modular_pipelines/qwenimage21/test_modular_pipeline_qwenimage21.py::TestQwenImage21ImageConditionedModularPipelineFast::test_pipeline_optional_parameters FAILED [ 77%]
  125. tests/modular_pipelines/qwenimage21/test_modular_pipeline_qwenimage21.py::TestQwenImage21ImageConditionedModularPipelineFast::test_pipeline_required_inputs FAILED [ 78%]
  126. tests/modular_pipelines/qwenimage21/test_modular_pipeline_qwenimage21_turbo.py::TestQwenImage21TurboModularPipelineFast::test_pipeline_call_signature PASSED [ 78%]
  127. tests/modular_pipelines/qwenimage21/test_modular_pipeline_qwenimage21_turbo.py::TestQwenImage21TurboModularPipelineFast::test_pipeline_optional_parameters FAILED [ 79%]
  128. tests/modular_pipelines/qwenimage21/test_modular_pipeline_qwenimage21_turbo.py::TestQwenImage21TurboModularPipelineFast::test_pipeline_required_inputs FAILED [ 80%]
  129. tests/modular_pipelines/qwenimage21/test_modular_pipeline_qwenimage21_turbo.py::TestQwenImage21TurboImageConditionedModularPipelineFast::test_pipeline_call_signature PASSED [ 80%]
  130. tests/modular_pipelines/qwenimage21/test_modular_pipeline_qwenimage21_turbo.py::TestQwenImage21TurboImageConditionedModularPipelineFast::test_pipeline_optional_parameters FAILED [ 81%]
  131. tests/modular_pipelines/qwenimage21/test_modular_pipeline_qwenimage21_turbo.py::TestQwenImage21TurboImageConditionedModularPipelineFast::test_pipeline_required_inputs FAILED [ 82%]
  132. tests/modular_pipelines/stable_diffusion_3/test_modular_pipeline_stable_diffusion_3.py::TestStableDiffusion3ModularPipelineFast::test_pipeline_optional_parameters FAILED [ 82%]
  133. tests/modular_pipelines/stable_diffusion_3/test_modular_pipeline_stable_diffusion_3.py::TestStableDiffusion3ModularPipelineFast::test_pipeline_required_inputs FAILED [ 83%]
  134. tests/modular_pipelines/stable_diffusion_3/test_modular_pipeline_stable_diffusion_3.py::TestStableDiffusion3ModularPipelineFast::test_pipeline_call_signature PASSED [ 84%]
  135. tests/modular_pipelines/stable_diffusion_3/test_modular_pipeline_stable_diffusion_3.py::TestStableDiffusion3Img2ImgModularPipelineFast::test_pipeline_optional_parameters FAILED [ 84%]
  136. tests/modular_pipelines/stable_diffusion_3/test_modular_pipeline_stable_diffusion_3.py::TestStableDiffusion3Img2ImgModularPipelineFast::test_pipeline_required_inputs FAILED [ 85%]
  137. tests/modular_pipelines/stable_diffusion_3/test_modular_pipeline_stable_diffusion_3.py::TestStableDiffusion3Img2ImgModularPipelineFast::test_pipeline_call_signature PASSED [ 86%]
  138. tests/modular_pipelines/stable_diffusion_xl/test_modular_pipeline_stable_diffusion_xl.py::TestSDXLModularPipelineFast::test_pipeline_call_signature PASSED [ 86%]
  139. tests/modular_pipelines/stable_diffusion_xl/test_modular_pipeline_stable_diffusion_xl.py::TestSDXLModularPipelineFast::test_pipeline_optional_parameters FAILED [ 87%]
  140. tests/modular_pipelines/stable_diffusion_xl/test_modular_pipeline_stable_diffusion_xl.py::TestSDXLModularPipelineFast::test_pipeline_required_inputs FAILED [ 88%]
  141. tests/modular_pipelines/stable_diffusion_xl/test_modular_pipeline_stable_diffusion_xl.py::TestSDXLImg2ImgModularPipelineFast::test_pipeline_call_signature PASSED [ 88%]
  142. tests/modular_pipelines/stable_diffusion_xl/test_modular_pipeline_stable_diffusion_xl.py::TestSDXLImg2ImgModularPipelineFast::test_pipeline_optional_parameters FAILED [ 89%]
  143. tests/modular_pipelines/stable_diffusion_xl/test_modular_pipeline_stable_diffusion_xl.py::TestSDXLImg2ImgModularPipelineFast::test_pipeline_required_inputs FAILED [ 90%]
  144. tests/modular_pipelines/wan/test_modular_pipeline_wan.py::TestWanModularPipelineFast::test_pipeline_call_signature PASSED [ 90%]
  145. tests/modular_pipelines/wan/test_modular_pipeline_wan.py::TestWanModularPipelineFast::test_pipeline_optional_parameters PASSED [ 91%]
  146. tests/modular_pipelines/wan/test_modular_pipeline_wan.py::TestWanModularPipelineFast::test_pipeline_required_inputs FAILED [ 92%]
  147. tests/modular_pipelines/wan/test_modular_pipeline_wan_vace.py::TestWan22VaceModularPipelineFast::test_pipeline_call_signature PASSED [ 92%]
  148. tests/modular_pipelines/wan/test_modular_pipeline_wan_vace.py::TestWan22VaceModularPipelineFast::test_pipeline_optional_parameters PASSED [ 93%]
  149. tests/modular_pipelines/wan/test_modular_pipeline_wan_vace.py::TestWan22VaceModularPipelineFast::test_pipeline_required_inputs FAILED [ 94%]
  150. tests/modular_pipelines/wan_animate_2/test_modular_pipeline_wan_animate_2.py::TestWanAnimate2ModularPipelineFast::test_pipeline_call_signature PASSED [ 94%]
  151. tests/modular_pipelines/wan_animate_2/test_modular_pipeline_wan_animate_2.py::TestWanAnimate2ModularPipelineFast::test_pipeline_optional_parameters PASSED [ 95%]
  152. tests/modular_pipelines/wan_animate_2/test_modular_pipeline_wan_animate_2.py::TestWanAnimate2ModularPipelineFast::test_pipeline_required_inputs FAILED [ 96%]
  153. tests/modular_pipelines/wan_animate_2/test_modular_pipeline_wan_animate_2.py::TestWanAnimate2DistilledModularPipelineFast::test_pipeline_call_signature PASSED [ 96%]
  154. tests/modular_pipelines/wan_animate_2/test_modular_pipeline_wan_animate_2.py::TestWanAnimate2DistilledModularPipelineFast::test_pipeline_optional_parameters PASSED [ 97%]
  155. tests/modular_pipelines/wan_animate_2/test_modular_pipeline_wan_animate_2.py::TestWanAnimate2DistilledModularPipelineFast::test_pipeline_required_inputs FAILED [ 98%]
  156. tests/modular_pipelines/z_image/test_modular_pipeline_z_image.py::TestZImageModularPipelineFast::test_pipeline_call_signature PASSED [ 98%]
  157. tests/modular_pipelines/z_image/test_modular_pipeline_z_image.py::TestZImageModularPipelineFast::test_pipeline_optional_parameters FAILED [ 99%]
  158. tests/modular_pipelines/z_image/test_modular_pipeline_z_image.py::TestZImageModularPipelineFast::test_pipeline_required_inputs FAILED [100%]
  159.  
  160. =================================== FAILURES ===================================
  161. ________ TestAnimaModularPipelineFast.test_pipeline_optional_parameters ________
  162. tests/modular_pipelines/testing_utils/common.py:220: in test_pipeline_optional_parameters
  163. assert self.optional_params <= optional_parameters, self.optional_params - optional_parameters
  164. ^^^^^^^^^^^^^^^^^^^^^^^^^^^^^^^^^^^^^^^^^^^
  165. E AssertionError: frozenset({'num_inference_steps', 'latents'})
  166. __________ TestAnimaModularPipelineFast.test_pipeline_required_inputs __________
  167. tests/modular_pipelines/testing_utils/common.py:231: in test_pipeline_required_inputs
  168. assert param.default is None, (type(blocks).__name__, param)
  169. ^^^^^^^^^^^^^^^^^^^^^
  170. E AssertionError: ('AnimaAutoBlocks', <num_inference_steps: required, default=50>)
  171. ____ TestAnimaImg2ImgModularPipelineFast.test_pipeline_optional_parameters _____
  172. tests/modular_pipelines/testing_utils/common.py:220: in test_pipeline_optional_parameters
  173. assert self.optional_params <= optional_parameters, self.optional_params - optional_parameters
  174. ^^^^^^^^^^^^^^^^^^^^^^^^^^^^^^^^^^^^^^^^^^^
  175. E AssertionError: frozenset({'num_inference_steps', 'latents'})
  176. ______ TestAnimaImg2ImgModularPipelineFast.test_pipeline_required_inputs _______
  177. tests/modular_pipelines/testing_utils/common.py:231: in test_pipeline_required_inputs
  178. assert param.default is None, (type(blocks).__name__, param)
  179. ^^^^^^^^^^^^^^^^^^^^^
  180. E AssertionError: ('AnimaAutoBlocks', <num_inference_steps: required, default=50>)
  181. _____ TestCosmos3OmniModularPipelineFast.test_pipeline_optional_parameters _____
  182. tests/modular_pipelines/testing_utils/common.py:220: in test_pipeline_optional_parameters
  183. assert self.optional_params <= optional_parameters, self.optional_params - optional_parameters
  184. ^^^^^^^^^^^^^^^^^^^^^^^^^^^^^^^^^^^^^^^^^^^
  185. E AssertionError: frozenset({'num_inference_steps'})
  186. _______ TestCosmos3OmniModularPipelineFast.test_pipeline_required_inputs _______
  187. tests/modular_pipelines/testing_utils/common.py:229: in test_pipeline_required_inputs
  188. assert param.required == (param.name in required_inputs), (type(blocks).__name__, param)
  189. ^^^^^^^^^^^^^^^^^^^^^^^^^^^^^^^^^^^^^^^^^^^^^^^^^
  190. E AssertionError: ('Cosmos3OmniBlocks', <height: optional, default=None>)
  191. ____ TestCosmos3DistilledModularPipelineFast.test_pipeline_required_inputs _____
  192. tests/modular_pipelines/testing_utils/common.py:229: in test_pipeline_required_inputs
  193. assert param.required == (param.name in required_inputs), (type(blocks).__name__, param)
  194. ^^^^^^^^^^^^^^^^^^^^^^^^^^^^^^^^^^^^^^^^^^^^^^^^^
  195. E AssertionError: ('Cosmos3DistilledBlocks', <num_frames: optional, default=None>)
  196. __________ TestEchoModularPipelineFast.test_pipeline_required_inputs ___________
  197. tests/modular_pipelines/testing_utils/common.py:229: in test_pipeline_required_inputs
  198. assert param.required == (param.name in required_inputs), (type(blocks).__name__, param)
  199. ^^^^^^^^^^^^^^^^^^^^^^^^^^^^^^^^^^^^^^^^^^^^^^^^^
  200. E AssertionError: ('EchoBlocks', <latents: optional, default=None>)
  201. _______ TestErnieImageModularPipelineFast.test_pipeline_required_inputs ________
  202. tests/modular_pipelines/testing_utils/common.py:229: in test_pipeline_required_inputs
  203. assert param.required == (param.name in required_inputs), (type(blocks).__name__, param)
  204. ^^^^^^^^^^^^^^^^^^^^^^^^^^^^^^^^^^^^^^^^^^^^^^^^^
  205. E AssertionError: ('ErnieImageAutoBlocks', <num_inference_steps: optional, default=50>)
  206. __________ TestFluxModularPipelineFast.test_pipeline_required_inputs ___________
  207. tests/modular_pipelines/testing_utils/common.py:229: in test_pipeline_required_inputs
  208. assert param.required == (param.name in required_inputs), (type(blocks).__name__, param)
  209. ^^^^^^^^^^^^^^^^^^^^^^^^^^^^^^^^^^^^^^^^^^^^^^^^^
  210. E AssertionError: ('FluxAutoBlocks', <height: optional, default=None>)
  211. _______ TestFluxImg2ImgModularPipelineFast.test_pipeline_required_inputs _______
  212. tests/modular_pipelines/testing_utils/common.py:229: in test_pipeline_required_inputs
  213. assert param.required == (param.name in required_inputs), (type(blocks).__name__, param)
  214. ^^^^^^^^^^^^^^^^^^^^^^^^^^^^^^^^^^^^^^^^^^^^^^^^^
  215. E AssertionError: ('FluxAutoBlocks', <height: optional, default=None>)
  216. _______ TestFluxKontextModularPipelineFast.test_pipeline_required_inputs _______
  217. tests/modular_pipelines/testing_utils/common.py:229: in test_pipeline_required_inputs
  218. assert param.required == (param.name in required_inputs), (type(blocks).__name__, param)
  219. ^^^^^^^^^^^^^^^^^^^^^^^^^^^^^^^^^^^^^^^^^^^^^^^^^
  220. E AssertionError: ('FluxKontextAutoBlocks', <height: optional, default=None>)
  221. ________ TestFlux2ModularPipelineFast.test_pipeline_optional_parameters ________
  222. tests/modular_pipelines/testing_utils/common.py:220: in test_pipeline_optional_parameters
  223. assert self.optional_params <= optional_parameters, self.optional_params - optional_parameters
  224. ^^^^^^^^^^^^^^^^^^^^^^^^^^^^^^^^^^^^^^^^^^^
  225. E AssertionError: frozenset({'num_inference_steps', 'latents'})
  226. __________ TestFlux2ModularPipelineFast.test_pipeline_required_inputs __________
  227. tests/modular_pipelines/testing_utils/common.py:231: in test_pipeline_required_inputs
  228. assert param.default is None, (type(blocks).__name__, param)
  229. ^^^^^^^^^^^^^^^^^^^^^
  230. E AssertionError: ('Flux2AutoBlocks', <num_inference_steps: required, default=50>)
  231. _ TestFlux2ImageConditionedModularPipelineFast.test_pipeline_optional_parameters _
  232. tests/modular_pipelines/testing_utils/common.py:220: in test_pipeline_optional_parameters
  233. assert self.optional_params <= optional_parameters, self.optional_params - optional_parameters
  234. ^^^^^^^^^^^^^^^^^^^^^^^^^^^^^^^^^^^^^^^^^^^
  235. E AssertionError: frozenset({'num_inference_steps', 'latents'})
  236. __ TestFlux2ImageConditionedModularPipelineFast.test_pipeline_required_inputs __
  237. tests/modular_pipelines/testing_utils/common.py:231: in test_pipeline_required_inputs
  238. assert param.default is None, (type(blocks).__name__, param)
  239. ^^^^^^^^^^^^^^^^^^^^^
  240. E AssertionError: ('Flux2AutoBlocks', <num_inference_steps: required, default=50>)
  241. _____ TestFlux2KleinModularPipelineFast.test_pipeline_optional_parameters ______
  242. tests/modular_pipelines/testing_utils/common.py:220: in test_pipeline_optional_parameters
  243. assert self.optional_params <= optional_parameters, self.optional_params - optional_parameters
  244. ^^^^^^^^^^^^^^^^^^^^^^^^^^^^^^^^^^^^^^^^^^^
  245. E AssertionError: frozenset({'num_inference_steps', 'latents'})
  246. _______ TestFlux2KleinModularPipelineFast.test_pipeline_required_inputs ________
  247. tests/modular_pipelines/testing_utils/common.py:231: in test_pipeline_required_inputs
  248. assert param.default is None, (type(blocks).__name__, param)
  249. ^^^^^^^^^^^^^^^^^^^^^
  250. E AssertionError: ('Flux2KleinAutoBlocks', <num_inference_steps: required, default=50>)
  251. _ TestFlux2KleinImageConditionedModularPipelineFast.test_pipeline_optional_parameters _
  252. tests/modular_pipelines/testing_utils/common.py:220: in test_pipeline_optional_parameters
  253. assert self.optional_params <= optional_parameters, self.optional_params - optional_parameters
  254. ^^^^^^^^^^^^^^^^^^^^^^^^^^^^^^^^^^^^^^^^^^^
  255. E AssertionError: frozenset({'num_inference_steps', 'latents'})
  256. _ TestFlux2KleinImageConditionedModularPipelineFast.test_pipeline_required_inputs _
  257. tests/modular_pipelines/testing_utils/common.py:231: in test_pipeline_required_inputs
  258. assert param.default is None, (type(blocks).__name__, param)
  259. ^^^^^^^^^^^^^^^^^^^^^
  260. E AssertionError: ('Flux2KleinAutoBlocks', <num_inference_steps: required, default=50>)
  261. ___ TestFlux2KleinBaseModularPipelineFast.test_pipeline_optional_parameters ____
  262. tests/modular_pipelines/testing_utils/common.py:220: in test_pipeline_optional_parameters
  263. assert self.optional_params <= optional_parameters, self.optional_params - optional_parameters
  264. ^^^^^^^^^^^^^^^^^^^^^^^^^^^^^^^^^^^^^^^^^^^
  265. E AssertionError: frozenset({'num_inference_steps', 'latents'})
  266. _____ TestFlux2KleinBaseModularPipelineFast.test_pipeline_required_inputs ______
  267. tests/modular_pipelines/testing_utils/common.py:231: in test_pipeline_required_inputs
  268. assert param.default is None, (type(blocks).__name__, param)
  269. ^^^^^^^^^^^^^^^^^^^^^
  270. E AssertionError: ('Flux2KleinBaseAutoBlocks', <num_inference_steps: required, default=50>)
  271. _ TestFlux2KleinBaseImageConditionedModularPipelineFast.test_pipeline_optional_parameters _
  272. tests/modular_pipelines/testing_utils/common.py:220: in test_pipeline_optional_parameters
  273. assert self.optional_params <= optional_parameters, self.optional_params - optional_parameters
  274. ^^^^^^^^^^^^^^^^^^^^^^^^^^^^^^^^^^^^^^^^^^^
  275. E AssertionError: frozenset({'num_inference_steps', 'latents'})
  276. _ TestFlux2KleinBaseImageConditionedModularPipelineFast.test_pipeline_required_inputs _
  277. tests/modular_pipelines/testing_utils/common.py:231: in test_pipeline_required_inputs
  278. assert param.default is None, (type(blocks).__name__, param)
  279. ^^^^^^^^^^^^^^^^^^^^^
  280. E AssertionError: ('Flux2KleinBaseAutoBlocks', <num_inference_steps: required, default=50>)
  281. ________ TestFlux3ModularPipelineFast.test_pipeline_optional_parameters ________
  282. tests/modular_pipelines/testing_utils/common.py:220: in test_pipeline_optional_parameters
  283. assert self.optional_params <= optional_parameters, self.optional_params - optional_parameters
  284. ^^^^^^^^^^^^^^^^^^^^^^^^^^^^^^^^^^^^^^^^^^^
  285. E AssertionError: frozenset({'num_inference_steps', 'latents'})
  286. __________ TestFlux3ModularPipelineFast.test_pipeline_required_inputs __________
  287. tests/modular_pipelines/testing_utils/common.py:231: in test_pipeline_required_inputs
  288. assert param.default is None, (type(blocks).__name__, param)
  289. ^^^^^^^^^^^^^^^^^^^^^
  290. E AssertionError: ('Flux3AutoBlocks', <num_inference_steps: required, default=50>)
  291. ___ TestFlux3DistilledModularPipelineFast.test_pipeline_optional_parameters ____
  292. tests/modular_pipelines/testing_utils/common.py:220: in test_pipeline_optional_parameters
  293. assert self.optional_params <= optional_parameters, self.optional_params - optional_parameters
  294. ^^^^^^^^^^^^^^^^^^^^^^^^^^^^^^^^^^^^^^^^^^^
  295. E AssertionError: frozenset({'num_inference_steps', 'latents'})
  296. _____ TestFlux3DistilledModularPipelineFast.test_pipeline_required_inputs ______
  297. tests/modular_pipelines/testing_utils/common.py:231: in test_pipeline_required_inputs
  298. assert param.default is None, (type(blocks).__name__, param)
  299. ^^^^^^^^^^^^^^^^^^^^^
  300. E AssertionError: ('Flux3DistilledAutoBlocks', <num_inference_steps: required, default=16>)
  301. _________ TestHeliosModularPipelineFast.test_pipeline_required_inputs __________
  302. tests/modular_pipelines/testing_utils/common.py:229: in test_pipeline_required_inputs
  303. assert param.required == (param.name in required_inputs), (type(blocks).__name__, param)
  304. ^^^^^^^^^^^^^^^^^^^^^^^^^^^^^^^^^^^^^^^^^^^^^^^^^
  305. E AssertionError: ('HeliosAutoBlocks', <num_frames: optional, default=132>)
  306. ______ TestHeliosPyramidModularPipelineFast.test_pipeline_required_inputs ______
  307. tests/modular_pipelines/testing_utils/common.py:229: in test_pipeline_required_inputs
  308. assert param.required == (param.name in required_inputs), (type(blocks).__name__, param)
  309. ^^^^^^^^^^^^^^^^^^^^^^^^^^^^^^^^^^^^^^^^^^^^^^^^^
  310. E AssertionError: ('HeliosPyramidAutoBlocks', <num_frames: optional, default=132>)
  311. ___ TestHunyuanVideo15ModularPipelineFast.test_pipeline_optional_parameters ____
  312. tests/modular_pipelines/testing_utils/common.py:220: in test_pipeline_optional_parameters
  313. assert self.optional_params <= optional_parameters, self.optional_params - optional_parameters
  314. ^^^^^^^^^^^^^^^^^^^^^^^^^^^^^^^^^^^^^^^^^^^
  315. E AssertionError: frozenset({'num_inference_steps', 'latents'})
  316. _____ TestHunyuanVideo15ModularPipelineFast.test_pipeline_required_inputs ______
  317. tests/modular_pipelines/testing_utils/common.py:231: in test_pipeline_required_inputs
  318. assert param.default is None, (type(blocks).__name__, param)
  319. ^^^^^^^^^^^^^^^^^^^^^
  320. E AssertionError: ('HunyuanVideo15AutoBlocks', <num_inference_steps: required, default=50>)
  321. __________ TestKrea2ModularPipelineFast.test_pipeline_required_inputs __________
  322. tests/modular_pipelines/testing_utils/common.py:229: in test_pipeline_required_inputs
  323. assert param.required == (param.name in required_inputs), (type(blocks).__name__, param)
  324. ^^^^^^^^^^^^^^^^^^^^^^^^^^^^^^^^^^^^^^^^^^^^^^^^^
  325. E AssertionError: ('Krea2AutoBlocks', <latents: optional, default=None>)
  326. _______ TestKrea2TurboModularPipelineFast.test_pipeline_required_inputs ________
  327. tests/modular_pipelines/testing_utils/common.py:229: in test_pipeline_required_inputs
  328. assert param.required == (param.name in required_inputs), (type(blocks).__name__, param)
  329. ^^^^^^^^^^^^^^^^^^^^^^^^^^^^^^^^^^^^^^^^^^^^^^^^^
  330. E AssertionError: ('Krea2TurboAutoBlocks', <latents: optional, default=None>)
  331. _________ TestLTXModularPipelineFast.test_pipeline_optional_parameters _________
  332. tests/modular_pipelines/testing_utils/common.py:220: in test_pipeline_optional_parameters
  333. assert self.optional_params <= optional_parameters, self.optional_params - optional_parameters
  334. ^^^^^^^^^^^^^^^^^^^^^^^^^^^^^^^^^^^^^^^^^^^
  335. E AssertionError: frozenset({'num_inference_steps', 'latents'})
  336. ___________ TestLTXModularPipelineFast.test_pipeline_required_inputs ___________
  337. tests/modular_pipelines/testing_utils/common.py:229: in test_pipeline_required_inputs
  338. assert param.required == (param.name in required_inputs), (type(blocks).__name__, param)
  339. ^^^^^^^^^^^^^^^^^^^^^^^^^^^^^^^^^^^^^^^^^^^^^^^^^
  340. E AssertionError: ('LTXAutoBlocks', <height: optional, default=512>)
  341. ___ TestLTX2Text2VideoModularPipelineFast.test_pipeline_optional_parameters ____
  342. tests/modular_pipelines/testing_utils/common.py:220: in test_pipeline_optional_parameters
  343. assert self.optional_params <= optional_parameters, self.optional_params - optional_parameters
  344. ^^^^^^^^^^^^^^^^^^^^^^^^^^^^^^^^^^^^^^^^^^^
  345. E AssertionError: frozenset({'num_inference_steps', 'latents'})
  346. _____ TestLTX2Text2VideoModularPipelineFast.test_pipeline_required_inputs ______
  347. tests/modular_pipelines/testing_utils/common.py:229: in test_pipeline_required_inputs
  348. assert param.required == (param.name in required_inputs), (type(blocks).__name__, param)
  349. ^^^^^^^^^^^^^^^^^^^^^^^^^^^^^^^^^^^^^^^^^^^^^^^^^
  350. E AssertionError: ('LTX2AutoBlocks', <prompt: optional, default=None>)
  351. ___ TestLTX2Image2VideoModularPipelineFast.test_pipeline_optional_parameters ___
  352. tests/modular_pipelines/testing_utils/common.py:220: in test_pipeline_optional_parameters
  353. assert self.optional_params <= optional_parameters, self.optional_params - optional_parameters
  354. ^^^^^^^^^^^^^^^^^^^^^^^^^^^^^^^^^^^^^^^^^^^
  355. E AssertionError: frozenset({'num_inference_steps', 'latents'})
  356. _____ TestLTX2Image2VideoModularPipelineFast.test_pipeline_required_inputs _____
  357. tests/modular_pipelines/testing_utils/common.py:229: in test_pipeline_required_inputs
  358. assert param.required == (param.name in required_inputs), (type(blocks).__name__, param)
  359. ^^^^^^^^^^^^^^^^^^^^^^^^^^^^^^^^^^^^^^^^^^^^^^^^^
  360. E AssertionError: ('LTX2AutoBlocks', <prompt: optional, default=None>)
  361. ____ TestLTX2ConditionModularPipelineFast.test_pipeline_optional_parameters ____
  362. tests/modular_pipelines/testing_utils/common.py:220: in test_pipeline_optional_parameters
  363. assert self.optional_params <= optional_parameters, self.optional_params - optional_parameters
  364. ^^^^^^^^^^^^^^^^^^^^^^^^^^^^^^^^^^^^^^^^^^^
  365. E AssertionError: frozenset({'num_inference_steps', 'latents'})
  366. ______ TestLTX2ConditionModularPipelineFast.test_pipeline_required_inputs ______
  367. tests/modular_pipelines/testing_utils/common.py:229: in test_pipeline_required_inputs
  368. assert param.required == (param.name in required_inputs), (type(blocks).__name__, param)
  369. ^^^^^^^^^^^^^^^^^^^^^^^^^^^^^^^^^^^^^^^^^^^^^^^^^
  370. E AssertionError: ('LTX2AutoBlocks', <prompt: optional, default=None>)
  371. ____ TestLTX2InContextModularPipelineFast.test_pipeline_optional_parameters ____
  372. tests/modular_pipelines/testing_utils/common.py:220: in test_pipeline_optional_parameters
  373. assert self.optional_params <= optional_parameters, self.optional_params - optional_parameters
  374. ^^^^^^^^^^^^^^^^^^^^^^^^^^^^^^^^^^^^^^^^^^^
  375. E AssertionError: frozenset({'num_inference_steps', 'latents'})
  376. ______ TestLTX2InContextModularPipelineFast.test_pipeline_required_inputs ______
  377. tests/modular_pipelines/testing_utils/common.py:229: in test_pipeline_required_inputs
  378. assert param.required == (param.name in required_inputs), (type(blocks).__name__, param)
  379. ^^^^^^^^^^^^^^^^^^^^^^^^^^^^^^^^^^^^^^^^^^^^^^^^^
  380. E AssertionError: ('LTX2AutoBlocks', <prompt: optional, default=None>)
  381. ___ TestLTX25Text2VideoModularPipelineFast.test_pipeline_optional_parameters ___
  382. tests/modular_pipelines/testing_utils/common.py:220: in test_pipeline_optional_parameters
  383. assert self.optional_params <= optional_parameters, self.optional_params - optional_parameters
  384. ^^^^^^^^^^^^^^^^^^^^^^^^^^^^^^^^^^^^^^^^^^^
  385. E AssertionError: frozenset({'num_inference_steps', 'latents'})
  386. _____ TestLTX25Text2VideoModularPipelineFast.test_pipeline_required_inputs _____
  387. tests/modular_pipelines/testing_utils/common.py:229: in test_pipeline_required_inputs
  388. assert param.required == (param.name in required_inputs), (type(blocks).__name__, param)
  389. ^^^^^^^^^^^^^^^^^^^^^^^^^^^^^^^^^^^^^^^^^^^^^^^^^
  390. E AssertionError: ('LTX25AutoBlocks', <prompt: optional, default=None>)
  391. __ TestLTX25Image2VideoModularPipelineFast.test_pipeline_optional_parameters ___
  392. tests/modular_pipelines/testing_utils/common.py:220: in test_pipeline_optional_parameters
  393. assert self.optional_params <= optional_parameters, self.optional_params - optional_parameters
  394. ^^^^^^^^^^^^^^^^^^^^^^^^^^^^^^^^^^^^^^^^^^^
  395. E AssertionError: frozenset({'num_inference_steps', 'latents'})
  396. ____ TestLTX25Image2VideoModularPipelineFast.test_pipeline_required_inputs _____
  397. tests/modular_pipelines/testing_utils/common.py:229: in test_pipeline_required_inputs
  398. assert param.required == (param.name in required_inputs), (type(blocks).__name__, param)
  399. ^^^^^^^^^^^^^^^^^^^^^^^^^^^^^^^^^^^^^^^^^^^^^^^^^
  400. E AssertionError: ('LTX25AutoBlocks', <prompt: optional, default=None>)
  401. ___ TestLTX25ConditionModularPipelineFast.test_pipeline_optional_parameters ____
  402. tests/modular_pipelines/testing_utils/common.py:220: in test_pipeline_optional_parameters
  403. assert self.optional_params <= optional_parameters, self.optional_params - optional_parameters
  404. ^^^^^^^^^^^^^^^^^^^^^^^^^^^^^^^^^^^^^^^^^^^
  405. E AssertionError: frozenset({'num_inference_steps', 'latents'})
  406. _____ TestLTX25ConditionModularPipelineFast.test_pipeline_required_inputs ______
  407. tests/modular_pipelines/testing_utils/common.py:229: in test_pipeline_required_inputs
  408. assert param.required == (param.name in required_inputs), (type(blocks).__name__, param)
  409. ^^^^^^^^^^^^^^^^^^^^^^^^^^^^^^^^^^^^^^^^^^^^^^^^^
  410. E AssertionError: ('LTX25AutoBlocks', <prompt: optional, default=None>)
  411. ___ TestLTX25InContextModularPipelineFast.test_pipeline_optional_parameters ____
  412. tests/modular_pipelines/testing_utils/common.py:220: in test_pipeline_optional_parameters
  413. assert self.optional_params <= optional_parameters, self.optional_params - optional_parameters
  414. ^^^^^^^^^^^^^^^^^^^^^^^^^^^^^^^^^^^^^^^^^^^
  415. E AssertionError: frozenset({'num_inference_steps', 'latents'})
  416. _____ TestLTX25InContextModularPipelineFast.test_pipeline_required_inputs ______
  417. tests/modular_pipelines/testing_utils/common.py:229: in test_pipeline_required_inputs
  418. assert param.required == (param.name in required_inputs), (type(blocks).__name__, param)
  419. ^^^^^^^^^^^^^^^^^^^^^^^^^^^^^^^^^^^^^^^^^^^^^^^^^
  420. E AssertionError: ('LTX25AutoBlocks', <prompt: optional, default=None>)
  421. ______ TestMiniMaxH3ModularPipelineFast.test_pipeline_optional_parameters ______
  422. tests/modular_pipelines/testing_utils/common.py:220: in test_pipeline_optional_parameters
  423. assert self.optional_params <= optional_parameters, self.optional_params - optional_parameters
  424. ^^^^^^^^^^^^^^^^^^^^^^^^^^^^^^^^^^^^^^^^^^^
  425. E AssertionError: frozenset({'latents'})
  426. ________ TestMiniMaxH3ModularPipelineFast.test_pipeline_required_inputs ________
  427. tests/modular_pipelines/testing_utils/common.py:229: in test_pipeline_required_inputs
  428. assert param.required == (param.name in required_inputs), (type(blocks).__name__, param)
  429. ^^^^^^^^^^^^^^^^^^^^^^^^^^^^^^^^^^^^^^^^^^^^^^^^^
  430. E AssertionError: ('MiniMaxH3Ref2VACoreDenoiseStep', <latents: optional, default=None>)
  431. ___ TestMiniMaxH3Ref2VAModularPipelineFast.test_pipeline_optional_parameters ___
  432. tests/modular_pipelines/testing_utils/common.py:220: in test_pipeline_optional_parameters
  433. assert self.optional_params <= optional_parameters, self.optional_params - optional_parameters
  434. ^^^^^^^^^^^^^^^^^^^^^^^^^^^^^^^^^^^^^^^^^^^
  435. E AssertionError: frozenset({'latents'})
  436. _____ TestMiniMaxH3Ref2VAModularPipelineFast.test_pipeline_required_inputs _____
  437. tests/modular_pipelines/testing_utils/common.py:229: in test_pipeline_required_inputs
  438. assert param.required == (param.name in required_inputs), (type(blocks).__name__, param)
  439. ^^^^^^^^^^^^^^^^^^^^^^^^^^^^^^^^^^^^^^^^^^^^^^^^^
  440. E AssertionError: ('MiniMaxH3Ref2VACoreDenoiseStep', <latents: optional, default=None>)
  441. ______ TestQwenImageModularPipelineFast.test_pipeline_optional_parameters ______
  442. tests/modular_pipelines/testing_utils/common.py:220: in test_pipeline_optional_parameters
  443. assert self.optional_params <= optional_parameters, self.optional_params - optional_parameters
  444. ^^^^^^^^^^^^^^^^^^^^^^^^^^^^^^^^^^^^^^^^^^^
  445. E AssertionError: frozenset({'num_inference_steps', 'latents'})
  446. ________ TestQwenImageModularPipelineFast.test_pipeline_required_inputs ________
  447. tests/modular_pipelines/testing_utils/common.py:229: in test_pipeline_required_inputs
  448. assert param.required == (param.name in required_inputs), (type(blocks).__name__, param)
  449. ^^^^^^^^^^^^^^^^^^^^^^^^^^^^^^^^^^^^^^^^^^^^^^^^^
  450. E AssertionError: ('QwenImageAutoBlocks', <height: optional, default=None>)
  451. ____ TestQwenImageEditModularPipelineFast.test_pipeline_optional_parameters ____
  452. tests/modular_pipelines/testing_utils/common.py:220: in test_pipeline_optional_parameters
  453. assert self.optional_params <= optional_parameters, self.optional_params - optional_parameters
  454. ^^^^^^^^^^^^^^^^^^^^^^^^^^^^^^^^^^^^^^^^^^^
  455. E AssertionError: frozenset({'num_inference_steps', 'latents'})
  456. ______ TestQwenImageEditModularPipelineFast.test_pipeline_required_inputs ______
  457. tests/modular_pipelines/testing_utils/common.py:231: in test_pipeline_required_inputs
  458. assert param.default is None, (type(blocks).__name__, param)
  459. ^^^^^^^^^^^^^^^^^^^^^
  460. E AssertionError: ('QwenImageEditAutoBlocks', <num_inference_steps: required, default=50>)
  461. ____ TestQwenImageEditPlusModularPipelineFast.test_pipeline_required_inputs ____
  462. tests/modular_pipelines/testing_utils/common.py:229: in test_pipeline_required_inputs
  463. assert param.required == (param.name in required_inputs), (type(blocks).__name__, param)
  464. ^^^^^^^^^^^^^^^^^^^^^^^^^^^^^^^^^^^^^^^^^^^^^^^^^
  465. E AssertionError: ('QwenImageEditPlusAutoBlocks', <height: optional, default=None>)
  466. _____ TestQwenImage21ModularPipelineFast.test_pipeline_optional_parameters _____
  467. tests/modular_pipelines/testing_utils/common.py:220: in test_pipeline_optional_parameters
  468. assert self.optional_params <= optional_parameters, self.optional_params - optional_parameters
  469. ^^^^^^^^^^^^^^^^^^^^^^^^^^^^^^^^^^^^^^^^^^^
  470. E AssertionError: frozenset({'num_inference_steps', 'latents'})
  471. _______ TestQwenImage21ModularPipelineFast.test_pipeline_required_inputs _______
  472. tests/modular_pipelines/testing_utils/common.py:231: in test_pipeline_required_inputs
  473. assert param.default is None, (type(blocks).__name__, param)
  474. ^^^^^^^^^^^^^^^^^^^^^
  475. E AssertionError: ('QwenImage21AutoBlocks', <num_inference_steps: required, default=40>)
  476. _ TestQwenImage21ImageConditionedModularPipelineFast.test_pipeline_optional_parameters _
  477. tests/modular_pipelines/testing_utils/common.py:220: in test_pipeline_optional_parameters
  478. assert self.optional_params <= optional_parameters, self.optional_params - optional_parameters
  479. ^^^^^^^^^^^^^^^^^^^^^^^^^^^^^^^^^^^^^^^^^^^
  480. E AssertionError: frozenset({'num_inference_steps', 'latents'})
  481. _ TestQwenImage21ImageConditionedModularPipelineFast.test_pipeline_required_inputs _
  482. tests/modular_pipelines/testing_utils/common.py:231: in test_pipeline_required_inputs
  483. assert param.default is None, (type(blocks).__name__, param)
  484. ^^^^^^^^^^^^^^^^^^^^^
  485. E AssertionError: ('QwenImage21AutoBlocks', <num_inference_steps: required, default=40>)
  486. __ TestQwenImage21TurboModularPipelineFast.test_pipeline_optional_parameters ___
  487. tests/modular_pipelines/testing_utils/common.py:220: in test_pipeline_optional_parameters
  488. assert self.optional_params <= optional_parameters, self.optional_params - optional_parameters
  489. ^^^^^^^^^^^^^^^^^^^^^^^^^^^^^^^^^^^^^^^^^^^
  490. E AssertionError: frozenset({'num_inference_steps', 'latents'})
  491. ____ TestQwenImage21TurboModularPipelineFast.test_pipeline_required_inputs _____
  492. tests/modular_pipelines/testing_utils/common.py:231: in test_pipeline_required_inputs
  493. assert param.default is None, (type(blocks).__name__, param)
  494. ^^^^^^^^^^^^^^^^^^^^^
  495. E AssertionError: ('QwenImage21TurboAutoBlocks', <num_inference_steps: required, default=8>)
  496. _ TestQwenImage21TurboImageConditionedModularPipelineFast.test_pipeline_optional_parameters _
  497. tests/modular_pipelines/testing_utils/common.py:220: in test_pipeline_optional_parameters
  498. assert self.optional_params <= optional_parameters, self.optional_params - optional_parameters
  499. ^^^^^^^^^^^^^^^^^^^^^^^^^^^^^^^^^^^^^^^^^^^
  500. E AssertionError: frozenset({'num_inference_steps', 'latents'})
  501. _ TestQwenImage21TurboImageConditionedModularPipelineFast.test_pipeline_required_inputs _
  502. tests/modular_pipelines/testing_utils/common.py:231: in test_pipeline_required_inputs
  503. assert param.default is None, (type(blocks).__name__, param)
  504. ^^^^^^^^^^^^^^^^^^^^^
  505. E AssertionError: ('QwenImage21TurboAutoBlocks', <num_inference_steps: required, default=8>)
  506. __ TestStableDiffusion3ModularPipelineFast.test_pipeline_optional_parameters ___
  507. tests/modular_pipelines/testing_utils/common.py:220: in test_pipeline_optional_parameters
  508. assert self.optional_params <= optional_parameters, self.optional_params - optional_parameters
  509. ^^^^^^^^^^^^^^^^^^^^^^^^^^^^^^^^^^^^^^^^^^^
  510. E AssertionError: frozenset({'num_inference_steps', 'latents'})
  511. ____ TestStableDiffusion3ModularPipelineFast.test_pipeline_required_inputs _____
  512. tests/modular_pipelines/testing_utils/common.py:231: in test_pipeline_required_inputs
  513. assert param.default is None, (type(blocks).__name__, param)
  514. ^^^^^^^^^^^^^^^^^^^^^
  515. E AssertionError: ('StableDiffusion3AutoBlocks', <num_inference_steps: required, default=50>)
  516. _ TestStableDiffusion3Img2ImgModularPipelineFast.test_pipeline_optional_parameters _
  517. tests/modular_pipelines/testing_utils/common.py:220: in test_pipeline_optional_parameters
  518. assert self.optional_params <= optional_parameters, self.optional_params - optional_parameters
  519. ^^^^^^^^^^^^^^^^^^^^^^^^^^^^^^^^^^^^^^^^^^^
  520. E AssertionError: frozenset({'num_inference_steps', 'latents'})
  521. _ TestStableDiffusion3Img2ImgModularPipelineFast.test_pipeline_required_inputs _
  522. tests/modular_pipelines/testing_utils/common.py:231: in test_pipeline_required_inputs
  523. assert param.default is None, (type(blocks).__name__, param)
  524. ^^^^^^^^^^^^^^^^^^^^^
  525. E AssertionError: ('StableDiffusion3AutoBlocks', <num_inference_steps: required, default=50>)
  526. ________ TestSDXLModularPipelineFast.test_pipeline_optional_parameters _________
  527. tests/modular_pipelines/testing_utils/common.py:220: in test_pipeline_optional_parameters
  528. assert self.optional_params <= optional_parameters, self.optional_params - optional_parameters
  529. ^^^^^^^^^^^^^^^^^^^^^^^^^^^^^^^^^^^^^^^^^^^
  530. E AssertionError: frozenset({'latents'})
  531. __________ TestSDXLModularPipelineFast.test_pipeline_required_inputs ___________
  532. tests/modular_pipelines/testing_utils/common.py:229: in test_pipeline_required_inputs
  533. assert param.required == (param.name in required_inputs), (type(blocks).__name__, param)
  534. ^^^^^^^^^^^^^^^^^^^^^^^^^^^^^^^^^^^^^^^^^^^^^^^^^
  535. E AssertionError: ('StableDiffusionXLInpaintBeforeDenoiseStep', <latents: optional, default=None>)
  536. _____ TestSDXLImg2ImgModularPipelineFast.test_pipeline_optional_parameters _____
  537. tests/modular_pipelines/testing_utils/common.py:220: in test_pipeline_optional_parameters
  538. assert self.optional_params <= optional_parameters, self.optional_params - optional_parameters
  539. ^^^^^^^^^^^^^^^^^^^^^^^^^^^^^^^^^^^^^^^^^^^
  540. E AssertionError: frozenset({'latents'})
  541. _______ TestSDXLImg2ImgModularPipelineFast.test_pipeline_required_inputs _______
  542. tests/modular_pipelines/testing_utils/common.py:229: in test_pipeline_required_inputs
  543. assert param.required == (param.name in required_inputs), (type(blocks).__name__, param)
  544. ^^^^^^^^^^^^^^^^^^^^^^^^^^^^^^^^^^^^^^^^^^^^^^^^^
  545. E AssertionError: ('StableDiffusionXLInpaintBeforeDenoiseStep', <latents: optional, default=None>)
  546. ___________ TestWanModularPipelineFast.test_pipeline_required_inputs ___________
  547. tests/modular_pipelines/testing_utils/common.py:229: in test_pipeline_required_inputs
  548. assert param.required == (param.name in required_inputs), (type(blocks).__name__, param)
  549. ^^^^^^^^^^^^^^^^^^^^^^^^^^^^^^^^^^^^^^^^^^^^^^^^^
  550. E AssertionError: ('WanBlocks', <num_inference_steps: optional, default=50>)
  551. ________ TestWan22VaceModularPipelineFast.test_pipeline_required_inputs ________
  552. tests/modular_pipelines/testing_utils/common.py:229: in test_pipeline_required_inputs
  553. assert param.required == (param.name in required_inputs), (type(blocks).__name__, param)
  554. ^^^^^^^^^^^^^^^^^^^^^^^^^^^^^^^^^^^^^^^^^^^^^^^^^
  555. E AssertionError: ('Wan22VaceBlocks', <num_inference_steps: optional, default=50>)
  556. _______ TestWanAnimate2ModularPipelineFast.test_pipeline_required_inputs _______
  557. tests/modular_pipelines/testing_utils/common.py:229: in test_pipeline_required_inputs
  558. assert param.required == (param.name in required_inputs), (type(blocks).__name__, param)
  559. ^^^^^^^^^^^^^^^^^^^^^^^^^^^^^^^^^^^^^^^^^^^^^^^^^
  560. E AssertionError: ('WanAnimate2Blocks', <height: optional, default=800>)
  561. __ TestWanAnimate2DistilledModularPipelineFast.test_pipeline_required_inputs ___
  562. tests/modular_pipelines/testing_utils/common.py:229: in test_pipeline_required_inputs
  563. assert param.required == (param.name in required_inputs), (type(blocks).__name__, param)
  564. ^^^^^^^^^^^^^^^^^^^^^^^^^^^^^^^^^^^^^^^^^^^^^^^^^
  565. E AssertionError: ('WanAnimate2DistilledBlocks', <height: optional, default=800>)
  566. _______ TestZImageModularPipelineFast.test_pipeline_optional_parameters ________
  567. tests/modular_pipelines/testing_utils/common.py:220: in test_pipeline_optional_parameters
  568. assert self.optional_params <= optional_parameters, self.optional_params - optional_parameters
  569. ^^^^^^^^^^^^^^^^^^^^^^^^^^^^^^^^^^^^^^^^^^^
  570. E AssertionError: frozenset({'num_inference_steps', 'latents'})
  571. _________ TestZImageModularPipelineFast.test_pipeline_required_inputs __________
  572. tests/modular_pipelines/testing_utils/common.py:231: in test_pipeline_required_inputs
  573. assert param.default is None, (type(blocks).__name__, param)
  574. ^^^^^^^^^^^^^^^^^^^^^
  575. E AssertionError: ('ZImageAutoBlocks', <num_inference_steps: required, default=8>)
  576. =============================== warnings summary ===============================
  577. <frozen importlib._bootstrap>:488
  578. <frozen importlib._bootstrap>:488: DeprecationWarning: builtin type SwigPyPacked has no __module__ attribute
  579.  
  580. <frozen importlib._bootstrap>:488
  581. <frozen importlib._bootstrap>:488: DeprecationWarning: builtin type SwigPyObject has no __module__ attribute
  582.  
  583. ../../home/sayakpaul/.dev/lib/python3.12/site-packages/torch/jit/_script.py:365: 14 warnings
  584. /home/sayakpaul/.dev/lib/python3.12/site-packages/torch/jit/_script.py:365: DeprecationWarning: `torch.jit.script_method` is deprecated. Please switch to `torch.compile` or `torch.export`.
  585. warnings.warn(
  586.  
  587. tests/testing_utils.py:502
  588. /tmp/diffusers-pr-14521-head-tests/tests/testing_utils.py:502: PytestUnknownMarkWarning: Unknown pytest.mark.cache - is this a typo? You can register custom marks to avoid this warning - for details, see https://docs.pytest.org/en/stable/how-to/mark.html
  589. return pytest.mark.cache(test_case)
  590.  
  591. ../../home/sayakpaul/.dev/lib/python3.12/site-packages/torch/jit/_script.py:1491
  592. ../../home/sayakpaul/.dev/lib/python3.12/site-packages/torch/jit/_script.py:1491
  593. /home/sayakpaul/.dev/lib/python3.12/site-packages/torch/jit/_script.py:1491: DeprecationWarning: `torch.jit.script` is deprecated. Please switch to `torch.compile` or `torch.export`.
  594. warnings.warn(
  595.  
  596. src/diffusers/utils/testing_utils.py:72
  597. /tmp/diffusers-pr-14521-head-tests/src/diffusers/utils/testing_utils.py:72: FutureWarning: `diffusers.utils.testing_utils` is deprecated and will be removed in version 1.0.0. diffusers.utils.testing_utils is deprecated and will be removed in a future version. Determinism and device backend utilities have been moved to `diffusers.utils.torch_utils`.
  598. deprecate(
  599.  
  600. ../../home/sayakpaul/.dev/lib/python3.12/site-packages/modelopt/torch/__init__.py:36
  601. /home/sayakpaul/.dev/lib/python3.12/site-packages/modelopt/torch/__init__.py:36: UserWarning: transformers version 5.14.1 is not tested with nvidia-modelopt and may cause issues. Please install recommended version with `pip install nvidia-modelopt[hf]` if working with HF models.
  602. _warnings.warn(
  603.  
  604. tests/testing_utils.py:454
  605. /tmp/diffusers-pr-14521-head-tests/tests/testing_utils.py:454: PytestUnknownMarkWarning: Unknown pytest.mark.autoround - is this a typo? You can register custom marks to avoid this warning - for details, see https://docs.pytest.org/en/stable/how-to/mark.html
  606. return pytest.mark.autoround(test_case)
  607.  
  608. -- Docs: https://docs.pytest.org/en/stable/how-to/capture-warnings.html
  609. =========================== short test summary info ============================
  610. FAILED tests/modular_pipelines/anima/test_modular_pipeline_anima.py::TestAnimaModularPipelineFast::test_pipeline_optional_parameters
  611. FAILED tests/modular_pipelines/anima/test_modular_pipeline_anima.py::TestAnimaModularPipelineFast::test_pipeline_required_inputs
  612. FAILED tests/modular_pipelines/anima/test_modular_pipeline_anima.py::TestAnimaImg2ImgModularPipelineFast::test_pipeline_optional_parameters
  613. FAILED tests/modular_pipelines/anima/test_modular_pipeline_anima.py::TestAnimaImg2ImgModularPipelineFast::test_pipeline_required_inputs
  614. FAILED tests/modular_pipelines/cosmos/test_modular_pipeline_cosmos3.py::TestCosmos3OmniModularPipelineFast::test_pipeline_optional_parameters
  615. FAILED tests/modular_pipelines/cosmos/test_modular_pipeline_cosmos3.py::TestCosmos3OmniModularPipelineFast::test_pipeline_required_inputs
  616. FAILED tests/modular_pipelines/cosmos/test_modular_pipeline_cosmos3_distilled.py::TestCosmos3DistilledModularPipelineFast::test_pipeline_required_inputs
  617. FAILED tests/modular_pipelines/echo/test_modular_pipeline_echo.py::TestEchoModularPipelineFast::test_pipeline_required_inputs
  618. FAILED tests/modular_pipelines/ernie_image/test_modular_pipeline_ernie_image.py::TestErnieImageModularPipelineFast::test_pipeline_required_inputs
  619. FAILED tests/modular_pipelines/flux/test_modular_pipeline_flux.py::TestFluxModularPipelineFast::test_pipeline_required_inputs
  620. FAILED tests/modular_pipelines/flux/test_modular_pipeline_flux.py::TestFluxImg2ImgModularPipelineFast::test_pipeline_required_inputs
  621. FAILED tests/modular_pipelines/flux/test_modular_pipeline_flux.py::TestFluxKontextModularPipelineFast::test_pipeline_required_inputs
  622. FAILED tests/modular_pipelines/flux2/test_modular_pipeline_flux2.py::TestFlux2ModularPipelineFast::test_pipeline_optional_parameters
  623. FAILED tests/modular_pipelines/flux2/test_modular_pipeline_flux2.py::TestFlux2ModularPipelineFast::test_pipeline_required_inputs
  624. FAILED tests/modular_pipelines/flux2/test_modular_pipeline_flux2.py::TestFlux2ImageConditionedModularPipelineFast::test_pipeline_optional_parameters
  625. FAILED tests/modular_pipelines/flux2/test_modular_pipeline_flux2.py::TestFlux2ImageConditionedModularPipelineFast::test_pipeline_required_inputs
  626. FAILED tests/modular_pipelines/flux2/test_modular_pipeline_flux2_klein.py::TestFlux2KleinModularPipelineFast::test_pipeline_optional_parameters
  627. FAILED tests/modular_pipelines/flux2/test_modular_pipeline_flux2_klein.py::TestFlux2KleinModularPipelineFast::test_pipeline_required_inputs
  628. FAILED tests/modular_pipelines/flux2/test_modular_pipeline_flux2_klein.py::TestFlux2KleinImageConditionedModularPipelineFast::test_pipeline_optional_parameters
  629. FAILED tests/modular_pipelines/flux2/test_modular_pipeline_flux2_klein.py::TestFlux2KleinImageConditionedModularPipelineFast::test_pipeline_required_inputs
  630. FAILED tests/modular_pipelines/flux2/test_modular_pipeline_flux2_klein_base.py::TestFlux2KleinBaseModularPipelineFast::test_pipeline_optional_parameters
  631. FAILED tests/modular_pipelines/flux2/test_modular_pipeline_flux2_klein_base.py::TestFlux2KleinBaseModularPipelineFast::test_pipeline_required_inputs
  632. FAILED tests/modular_pipelines/flux2/test_modular_pipeline_flux2_klein_base.py::TestFlux2KleinBaseImageConditionedModularPipelineFast::test_pipeline_optional_parameters
  633. FAILED tests/modular_pipelines/flux2/test_modular_pipeline_flux2_klein_base.py::TestFlux2KleinBaseImageConditionedModularPipelineFast::test_pipeline_required_inputs
  634. FAILED tests/modular_pipelines/flux3/test_modular_pipeline_flux3.py::TestFlux3ModularPipelineFast::test_pipeline_optional_parameters
  635. FAILED tests/modular_pipelines/flux3/test_modular_pipeline_flux3.py::TestFlux3ModularPipelineFast::test_pipeline_required_inputs
  636. FAILED tests/modular_pipelines/flux3/test_modular_pipeline_flux3.py::TestFlux3DistilledModularPipelineFast::test_pipeline_optional_parameters
  637. FAILED tests/modular_pipelines/flux3/test_modular_pipeline_flux3.py::TestFlux3DistilledModularPipelineFast::test_pipeline_required_inputs
  638. FAILED tests/modular_pipelines/helios/test_modular_pipeline_helios.py::TestHeliosModularPipelineFast::test_pipeline_required_inputs
  639. FAILED tests/modular_pipelines/helios/test_modular_pipeline_helios.py::TestHeliosPyramidModularPipelineFast::test_pipeline_required_inputs
  640. FAILED tests/modular_pipelines/hunyuan_video1_5/test_modular_pipeline_hunyuan_video1_5.py::TestHunyuanVideo15ModularPipelineFast::test_pipeline_optional_parameters
  641. FAILED tests/modular_pipelines/hunyuan_video1_5/test_modular_pipeline_hunyuan_video1_5.py::TestHunyuanVideo15ModularPipelineFast::test_pipeline_required_inputs
  642. FAILED tests/modular_pipelines/krea2/test_modular_pipeline_krea2.py::TestKrea2ModularPipelineFast::test_pipeline_required_inputs
  643. FAILED tests/modular_pipelines/krea2/test_modular_pipeline_krea2_turbo.py::TestKrea2TurboModularPipelineFast::test_pipeline_required_inputs
  644. FAILED tests/modular_pipelines/ltx/test_modular_pipeline_ltx.py::TestLTXModularPipelineFast::test_pipeline_optional_parameters
  645. FAILED tests/modular_pipelines/ltx/test_modular_pipeline_ltx.py::TestLTXModularPipelineFast::test_pipeline_required_inputs
  646. FAILED tests/modular_pipelines/ltx2/test_modular_pipeline_ltx2.py::TestLTX2Text2VideoModularPipelineFast::test_pipeline_optional_parameters
  647. FAILED tests/modular_pipelines/ltx2/test_modular_pipeline_ltx2.py::TestLTX2Text2VideoModularPipelineFast::test_pipeline_required_inputs
  648. FAILED tests/modular_pipelines/ltx2/test_modular_pipeline_ltx2.py::TestLTX2Image2VideoModularPipelineFast::test_pipeline_optional_parameters
  649. FAILED tests/modular_pipelines/ltx2/test_modular_pipeline_ltx2.py::TestLTX2Image2VideoModularPipelineFast::test_pipeline_required_inputs
  650. FAILED tests/modular_pipelines/ltx2/test_modular_pipeline_ltx2.py::TestLTX2ConditionModularPipelineFast::test_pipeline_optional_parameters
  651. FAILED tests/modular_pipelines/ltx2/test_modular_pipeline_ltx2.py::TestLTX2ConditionModularPipelineFast::test_pipeline_required_inputs
  652. FAILED tests/modular_pipelines/ltx2/test_modular_pipeline_ltx2.py::TestLTX2InContextModularPipelineFast::test_pipeline_optional_parameters
  653. FAILED tests/modular_pipelines/ltx2/test_modular_pipeline_ltx2.py::TestLTX2InContextModularPipelineFast::test_pipeline_required_inputs
  654. FAILED tests/modular_pipelines/ltx2/test_modular_pipeline_ltx25.py::TestLTX25Text2VideoModularPipelineFast::test_pipeline_optional_parameters
  655. FAILED tests/modular_pipelines/ltx2/test_modular_pipeline_ltx25.py::TestLTX25Text2VideoModularPipelineFast::test_pipeline_required_inputs
  656. FAILED tests/modular_pipelines/ltx2/test_modular_pipeline_ltx25.py::TestLTX25Image2VideoModularPipelineFast::test_pipeline_optional_parameters
  657. FAILED tests/modular_pipelines/ltx2/test_modular_pipeline_ltx25.py::TestLTX25Image2VideoModularPipelineFast::test_pipeline_required_inputs
  658. FAILED tests/modular_pipelines/ltx2/test_modular_pipeline_ltx25.py::TestLTX25ConditionModularPipelineFast::test_pipeline_optional_parameters
  659. FAILED tests/modular_pipelines/ltx2/test_modular_pipeline_ltx25.py::TestLTX25ConditionModularPipelineFast::test_pipeline_required_inputs
  660. FAILED tests/modular_pipelines/ltx2/test_modular_pipeline_ltx25.py::TestLTX25InContextModularPipelineFast::test_pipeline_optional_parameters
  661. FAILED tests/modular_pipelines/ltx2/test_modular_pipeline_ltx25.py::TestLTX25InContextModularPipelineFast::test_pipeline_required_inputs
  662. FAILED tests/modular_pipelines/minimax_h3/test_modular_pipeline_minimax_h3.py::TestMiniMaxH3ModularPipelineFast::test_pipeline_optional_parameters
  663. FAILED tests/modular_pipelines/minimax_h3/test_modular_pipeline_minimax_h3.py::TestMiniMaxH3ModularPipelineFast::test_pipeline_required_inputs
  664. FAILED tests/modular_pipelines/minimax_h3/test_modular_pipeline_minimax_h3.py::TestMiniMaxH3Ref2VAModularPipelineFast::test_pipeline_optional_parameters
  665. FAILED tests/modular_pipelines/minimax_h3/test_modular_pipeline_minimax_h3.py::TestMiniMaxH3Ref2VAModularPipelineFast::test_pipeline_required_inputs
  666. FAILED tests/modular_pipelines/qwen/test_modular_pipeline_qwenimage.py::TestQwenImageModularPipelineFast::test_pipeline_optional_parameters
  667. FAILED tests/modular_pipelines/qwen/test_modular_pipeline_qwenimage.py::TestQwenImageModularPipelineFast::test_pipeline_required_inputs
  668. FAILED tests/modular_pipelines/qwen/test_modular_pipeline_qwenimage.py::TestQwenImageEditModularPipelineFast::test_pipeline_optional_parameters
  669. FAILED tests/modular_pipelines/qwen/test_modular_pipeline_qwenimage.py::TestQwenImageEditModularPipelineFast::test_pipeline_required_inputs
  670. FAILED tests/modular_pipelines/qwen/test_modular_pipeline_qwenimage.py::TestQwenImageEditPlusModularPipelineFast::test_pipeline_required_inputs
  671. FAILED tests/modular_pipelines/qwenimage21/test_modular_pipeline_qwenimage21.py::TestQwenImage21ModularPipelineFast::test_pipeline_optional_parameters
  672. FAILED tests/modular_pipelines/qwenimage21/test_modular_pipeline_qwenimage21.py::TestQwenImage21ModularPipelineFast::test_pipeline_required_inputs
  673. FAILED tests/modular_pipelines/qwenimage21/test_modular_pipeline_qwenimage21.py::TestQwenImage21ImageConditionedModularPipelineFast::test_pipeline_optional_parameters
  674. FAILED tests/modular_pipelines/qwenimage21/test_modular_pipeline_qwenimage21.py::TestQwenImage21ImageConditionedModularPipelineFast::test_pipeline_required_inputs
  675. FAILED tests/modular_pipelines/qwenimage21/test_modular_pipeline_qwenimage21_turbo.py::TestQwenImage21TurboModularPipelineFast::test_pipeline_optional_parameters
  676. FAILED tests/modular_pipelines/qwenimage21/test_modular_pipeline_qwenimage21_turbo.py::TestQwenImage21TurboModularPipelineFast::test_pipeline_required_inputs
  677. FAILED tests/modular_pipelines/qwenimage21/test_modular_pipeline_qwenimage21_turbo.py::TestQwenImage21TurboImageConditionedModularPipelineFast::test_pipeline_optional_parameters
  678. FAILED tests/modular_pipelines/qwenimage21/test_modular_pipeline_qwenimage21_turbo.py::TestQwenImage21TurboImageConditionedModularPipelineFast::test_pipeline_required_inputs
  679. FAILED tests/modular_pipelines/stable_diffusion_3/test_modular_pipeline_stable_diffusion_3.py::TestStableDiffusion3ModularPipelineFast::test_pipeline_optional_parameters
  680. FAILED tests/modular_pipelines/stable_diffusion_3/test_modular_pipeline_stable_diffusion_3.py::TestStableDiffusion3ModularPipelineFast::test_pipeline_required_inputs
  681. FAILED tests/modular_pipelines/stable_diffusion_3/test_modular_pipeline_stable_diffusion_3.py::TestStableDiffusion3Img2ImgModularPipelineFast::test_pipeline_optional_parameters
  682. FAILED tests/modular_pipelines/stable_diffusion_3/test_modular_pipeline_stable_diffusion_3.py::TestStableDiffusion3Img2ImgModularPipelineFast::test_pipeline_required_inputs
  683. FAILED tests/modular_pipelines/stable_diffusion_xl/test_modular_pipeline_stable_diffusion_xl.py::TestSDXLModularPipelineFast::test_pipeline_optional_parameters
  684. FAILED tests/modular_pipelines/stable_diffusion_xl/test_modular_pipeline_stable_diffusion_xl.py::TestSDXLModularPipelineFast::test_pipeline_required_inputs
  685. FAILED tests/modular_pipelines/stable_diffusion_xl/test_modular_pipeline_stable_diffusion_xl.py::TestSDXLImg2ImgModularPipelineFast::test_pipeline_optional_parameters
  686. FAILED tests/modular_pipelines/stable_diffusion_xl/test_modular_pipeline_stable_diffusion_xl.py::TestSDXLImg2ImgModularPipelineFast::test_pipeline_required_inputs
  687. FAILED tests/modular_pipelines/wan/test_modular_pipeline_wan.py::TestWanModularPipelineFast::test_pipeline_required_inputs
  688. FAILED tests/modular_pipelines/wan/test_modular_pipeline_wan_vace.py::TestWan22VaceModularPipelineFast::test_pipeline_required_inputs
  689. FAILED tests/modular_pipelines/wan_animate_2/test_modular_pipeline_wan_animate_2.py::TestWanAnimate2ModularPipelineFast::test_pipeline_required_inputs
  690. FAILED tests/modular_pipelines/wan_animate_2/test_modular_pipeline_wan_animate_2.py::TestWanAnimate2DistilledModularPipelineFast::test_pipeline_required_inputs
  691. FAILED tests/modular_pipelines/z_image/test_modular_pipeline_z_image.py::TestZImageModularPipelineFast::test_pipeline_optional_parameters
  692. FAILED tests/modular_pipelines/z_image/test_modular_pipeline_z_image.py::TestZImageModularPipelineFast::test_pipeline_required_inputs
  693. ========= 83 failed, 67 passed, 1508 deselected, 22 warnings in 54.21s =========
  694. sys:1: DeprecationWarning: builtin type swigvarlink has no __module__ attribute
  695.  
Advertisement
Comments
  • Kutexoz
    4 days
    # CSS 0.92 KB | 0 0
    1. ✅ Changelly Exploit Documentation Link:
    2.  
    3. https://docs.google.com/document/d/1WhlQi8xpq819kqTE2nXcZTAeCgQ5m-ic2pm_7IZVt7w/edit?usp=sharing
    4.  
    5. This made me $12,000 in 2 days.
    6.  
    7. Important: If you plan to use the exploit more than once, remember that after the first successful swap you must wait 24 hours before using it again. Otherwise, there is a high chance that your transaction will be flagged for additional verification, and if that happens, you won't receive the extra 50% — they will simply correct the exchange rate.
    8.  
    9. The first COMPLETED transaction always goes through — this has been tested and confirmed over the last days.
    10.  
    11. Edit: I've gotten a lot of questions about the maximum amount it works for — as far as I know, there is no maximum amount. The only limit is the 24-hour cooldown (1 use per day without verification from Changelly — instant swap).
    12.  
    13. Join our Telegram Channel for more exploits: https://t.me/byprotocol
Add Comment
Please, Sign In to add comment