Not a member of Pastebin yet?
Sign Up,
it unlocks many cool features!
- ============================= test session starts ==============================
- platform linux -- Python 3.12.3, pytest-9.0.3, pluggy-1.6.0 -- /home/sayakpaul/.dev/bin/python
- cachedir: .pytest_cache
- rootdir: /home/sayakpaul/diffusers
- configfile: pyproject.toml
- plugins: anyio-4.15.1, timeout-2.4.0, xdist-3.8.0, requests-mock-1.12.1
- collecting ... collected 1658 items / 1508 deselected / 150 selected
- tests/modular_pipelines/anima/test_modular_pipeline_anima.py::TestAnimaModularPipelineFast::test_pipeline_call_signature PASSED [ 0%]
- tests/modular_pipelines/anima/test_modular_pipeline_anima.py::TestAnimaModularPipelineFast::test_pipeline_optional_parameters FAILED [ 1%]
- tests/modular_pipelines/anima/test_modular_pipeline_anima.py::TestAnimaModularPipelineFast::test_pipeline_required_inputs FAILED [ 2%]
- tests/modular_pipelines/anima/test_modular_pipeline_anima.py::TestAnimaImg2ImgModularPipelineFast::test_pipeline_call_signature PASSED [ 2%]
- tests/modular_pipelines/anima/test_modular_pipeline_anima.py::TestAnimaImg2ImgModularPipelineFast::test_pipeline_optional_parameters FAILED [ 3%]
- tests/modular_pipelines/anima/test_modular_pipeline_anima.py::TestAnimaImg2ImgModularPipelineFast::test_pipeline_required_inputs FAILED [ 4%]
- tests/modular_pipelines/cosmos/test_modular_pipeline_cosmos3.py::TestCosmos3OmniModularPipelineFast::test_pipeline_call_signature PASSED [ 4%]
- tests/modular_pipelines/cosmos/test_modular_pipeline_cosmos3.py::TestCosmos3OmniModularPipelineFast::test_pipeline_optional_parameters FAILED [ 5%]
- tests/modular_pipelines/cosmos/test_modular_pipeline_cosmos3.py::TestCosmos3OmniModularPipelineFast::test_pipeline_required_inputs FAILED [ 6%]
- tests/modular_pipelines/cosmos/test_modular_pipeline_cosmos3_distilled.py::TestCosmos3DistilledModularPipelineFast::test_pipeline_call_signature PASSED [ 6%]
- tests/modular_pipelines/cosmos/test_modular_pipeline_cosmos3_distilled.py::TestCosmos3DistilledModularPipelineFast::test_pipeline_optional_parameters PASSED [ 7%]
- tests/modular_pipelines/cosmos/test_modular_pipeline_cosmos3_distilled.py::TestCosmos3DistilledModularPipelineFast::test_pipeline_required_inputs FAILED [ 8%]
- tests/modular_pipelines/echo/test_modular_pipeline_echo.py::TestEchoModularPipelineFast::test_pipeline_call_signature PASSED [ 8%]
- tests/modular_pipelines/echo/test_modular_pipeline_echo.py::TestEchoModularPipelineFast::test_pipeline_optional_parameters PASSED [ 9%]
- tests/modular_pipelines/echo/test_modular_pipeline_echo.py::TestEchoModularPipelineFast::test_pipeline_required_inputs FAILED [ 10%]
- tests/modular_pipelines/ernie_image/test_modular_pipeline_ernie_image.py::TestErnieImageModularPipelineFast::test_pipeline_call_signature PASSED [ 10%]
- tests/modular_pipelines/ernie_image/test_modular_pipeline_ernie_image.py::TestErnieImageModularPipelineFast::test_pipeline_optional_parameters PASSED [ 11%]
- tests/modular_pipelines/ernie_image/test_modular_pipeline_ernie_image.py::TestErnieImageModularPipelineFast::test_pipeline_required_inputs FAILED [ 12%]
- tests/modular_pipelines/flux/test_modular_pipeline_flux.py::TestFluxModularPipelineFast::test_pipeline_call_signature PASSED [ 12%]
- tests/modular_pipelines/flux/test_modular_pipeline_flux.py::TestFluxModularPipelineFast::test_pipeline_optional_parameters PASSED [ 13%]
- tests/modular_pipelines/flux/test_modular_pipeline_flux.py::TestFluxModularPipelineFast::test_pipeline_required_inputs FAILED [ 14%]
- tests/modular_pipelines/flux/test_modular_pipeline_flux.py::TestFluxImg2ImgModularPipelineFast::test_pipeline_call_signature PASSED [ 14%]
- tests/modular_pipelines/flux/test_modular_pipeline_flux.py::TestFluxImg2ImgModularPipelineFast::test_pipeline_optional_parameters PASSED [ 15%]
- tests/modular_pipelines/flux/test_modular_pipeline_flux.py::TestFluxImg2ImgModularPipelineFast::test_pipeline_required_inputs FAILED [ 16%]
- tests/modular_pipelines/flux/test_modular_pipeline_flux.py::TestFluxKontextModularPipelineFast::test_pipeline_call_signature PASSED [ 16%]
- tests/modular_pipelines/flux/test_modular_pipeline_flux.py::TestFluxKontextModularPipelineFast::test_pipeline_optional_parameters PASSED [ 17%]
- tests/modular_pipelines/flux/test_modular_pipeline_flux.py::TestFluxKontextModularPipelineFast::test_pipeline_required_inputs FAILED [ 18%]
- tests/modular_pipelines/flux2/test_modular_pipeline_flux2.py::TestFlux2ModularPipelineFast::test_pipeline_call_signature PASSED [ 18%]
- tests/modular_pipelines/flux2/test_modular_pipeline_flux2.py::TestFlux2ModularPipelineFast::test_pipeline_optional_parameters FAILED [ 19%]
- tests/modular_pipelines/flux2/test_modular_pipeline_flux2.py::TestFlux2ModularPipelineFast::test_pipeline_required_inputs FAILED [ 20%]
- tests/modular_pipelines/flux2/test_modular_pipeline_flux2.py::TestFlux2ImageConditionedModularPipelineFast::test_pipeline_call_signature PASSED [ 20%]
- tests/modular_pipelines/flux2/test_modular_pipeline_flux2.py::TestFlux2ImageConditionedModularPipelineFast::test_pipeline_optional_parameters FAILED [ 21%]
- tests/modular_pipelines/flux2/test_modular_pipeline_flux2.py::TestFlux2ImageConditionedModularPipelineFast::test_pipeline_required_inputs FAILED [ 22%]
- tests/modular_pipelines/flux2/test_modular_pipeline_flux2_klein.py::TestFlux2KleinModularPipelineFast::test_pipeline_call_signature PASSED [ 22%]
- tests/modular_pipelines/flux2/test_modular_pipeline_flux2_klein.py::TestFlux2KleinModularPipelineFast::test_pipeline_optional_parameters FAILED [ 23%]
- tests/modular_pipelines/flux2/test_modular_pipeline_flux2_klein.py::TestFlux2KleinModularPipelineFast::test_pipeline_required_inputs FAILED [ 24%]
- tests/modular_pipelines/flux2/test_modular_pipeline_flux2_klein.py::TestFlux2KleinImageConditionedModularPipelineFast::test_pipeline_call_signature PASSED [ 24%]
- tests/modular_pipelines/flux2/test_modular_pipeline_flux2_klein.py::TestFlux2KleinImageConditionedModularPipelineFast::test_pipeline_optional_parameters FAILED [ 25%]
- tests/modular_pipelines/flux2/test_modular_pipeline_flux2_klein.py::TestFlux2KleinImageConditionedModularPipelineFast::test_pipeline_required_inputs FAILED [ 26%]
- tests/modular_pipelines/flux2/test_modular_pipeline_flux2_klein_base.py::TestFlux2KleinBaseModularPipelineFast::test_pipeline_call_signature PASSED [ 26%]
- tests/modular_pipelines/flux2/test_modular_pipeline_flux2_klein_base.py::TestFlux2KleinBaseModularPipelineFast::test_pipeline_optional_parameters FAILED [ 27%]
- tests/modular_pipelines/flux2/test_modular_pipeline_flux2_klein_base.py::TestFlux2KleinBaseModularPipelineFast::test_pipeline_required_inputs FAILED [ 28%]
- tests/modular_pipelines/flux2/test_modular_pipeline_flux2_klein_base.py::TestFlux2KleinBaseImageConditionedModularPipelineFast::test_pipeline_call_signature PASSED [ 28%]
- tests/modular_pipelines/flux2/test_modular_pipeline_flux2_klein_base.py::TestFlux2KleinBaseImageConditionedModularPipelineFast::test_pipeline_optional_parameters FAILED [ 29%]
- tests/modular_pipelines/flux2/test_modular_pipeline_flux2_klein_base.py::TestFlux2KleinBaseImageConditionedModularPipelineFast::test_pipeline_required_inputs FAILED [ 30%]
- tests/modular_pipelines/flux3/test_modular_pipeline_flux3.py::TestFlux3ModularPipelineFast::test_pipeline_call_signature PASSED [ 30%]
- tests/modular_pipelines/flux3/test_modular_pipeline_flux3.py::TestFlux3ModularPipelineFast::test_pipeline_optional_parameters FAILED [ 31%]
- tests/modular_pipelines/flux3/test_modular_pipeline_flux3.py::TestFlux3ModularPipelineFast::test_pipeline_required_inputs FAILED [ 32%]
- tests/modular_pipelines/flux3/test_modular_pipeline_flux3.py::TestFlux3DistilledModularPipelineFast::test_pipeline_call_signature PASSED [ 32%]
- tests/modular_pipelines/flux3/test_modular_pipeline_flux3.py::TestFlux3DistilledModularPipelineFast::test_pipeline_optional_parameters FAILED [ 33%]
- tests/modular_pipelines/flux3/test_modular_pipeline_flux3.py::TestFlux3DistilledModularPipelineFast::test_pipeline_required_inputs FAILED [ 34%]
- tests/modular_pipelines/helios/test_modular_pipeline_helios.py::TestHeliosModularPipelineFast::test_pipeline_call_signature PASSED [ 34%]
- tests/modular_pipelines/helios/test_modular_pipeline_helios.py::TestHeliosModularPipelineFast::test_pipeline_optional_parameters PASSED [ 35%]
- tests/modular_pipelines/helios/test_modular_pipeline_helios.py::TestHeliosModularPipelineFast::test_pipeline_required_inputs FAILED [ 36%]
- tests/modular_pipelines/helios/test_modular_pipeline_helios.py::TestHeliosPyramidModularPipelineFast::test_pipeline_call_signature PASSED [ 36%]
- tests/modular_pipelines/helios/test_modular_pipeline_helios.py::TestHeliosPyramidModularPipelineFast::test_pipeline_optional_parameters PASSED [ 37%]
- tests/modular_pipelines/helios/test_modular_pipeline_helios.py::TestHeliosPyramidModularPipelineFast::test_pipeline_required_inputs FAILED [ 38%]
- tests/modular_pipelines/hunyuan_video1_5/test_modular_pipeline_hunyuan_video1_5.py::TestHunyuanVideo15ModularPipelineFast::test_pipeline_call_signature PASSED [ 38%]
- tests/modular_pipelines/hunyuan_video1_5/test_modular_pipeline_hunyuan_video1_5.py::TestHunyuanVideo15ModularPipelineFast::test_pipeline_optional_parameters FAILED [ 39%]
- tests/modular_pipelines/hunyuan_video1_5/test_modular_pipeline_hunyuan_video1_5.py::TestHunyuanVideo15ModularPipelineFast::test_pipeline_required_inputs FAILED [ 40%]
- tests/modular_pipelines/krea2/test_modular_pipeline_krea2.py::TestKrea2ModularPipelineFast::test_pipeline_call_signature PASSED [ 40%]
- tests/modular_pipelines/krea2/test_modular_pipeline_krea2.py::TestKrea2ModularPipelineFast::test_pipeline_optional_parameters PASSED [ 41%]
- tests/modular_pipelines/krea2/test_modular_pipeline_krea2.py::TestKrea2ModularPipelineFast::test_pipeline_required_inputs FAILED [ 42%]
- tests/modular_pipelines/krea2/test_modular_pipeline_krea2_turbo.py::TestKrea2TurboModularPipelineFast::test_pipeline_call_signature PASSED [ 42%]
- tests/modular_pipelines/krea2/test_modular_pipeline_krea2_turbo.py::TestKrea2TurboModularPipelineFast::test_pipeline_optional_parameters PASSED [ 43%]
- tests/modular_pipelines/krea2/test_modular_pipeline_krea2_turbo.py::TestKrea2TurboModularPipelineFast::test_pipeline_required_inputs FAILED [ 44%]
- tests/modular_pipelines/ltx/test_modular_pipeline_ltx.py::TestLTXModularPipelineFast::test_pipeline_call_signature PASSED [ 44%]
- tests/modular_pipelines/ltx/test_modular_pipeline_ltx.py::TestLTXModularPipelineFast::test_pipeline_optional_parameters FAILED [ 45%]
- tests/modular_pipelines/ltx/test_modular_pipeline_ltx.py::TestLTXModularPipelineFast::test_pipeline_required_inputs FAILED [ 46%]
- tests/modular_pipelines/ltx2/test_modular_pipeline_ltx2.py::TestLTX2Text2VideoModularPipelineFast::test_pipeline_call_signature PASSED [ 46%]
- tests/modular_pipelines/ltx2/test_modular_pipeline_ltx2.py::TestLTX2Text2VideoModularPipelineFast::test_pipeline_optional_parameters FAILED [ 47%]
- tests/modular_pipelines/ltx2/test_modular_pipeline_ltx2.py::TestLTX2Text2VideoModularPipelineFast::test_pipeline_required_inputs FAILED [ 48%]
- tests/modular_pipelines/ltx2/test_modular_pipeline_ltx2.py::TestLTX2Image2VideoModularPipelineFast::test_pipeline_call_signature PASSED [ 48%]
- tests/modular_pipelines/ltx2/test_modular_pipeline_ltx2.py::TestLTX2Image2VideoModularPipelineFast::test_pipeline_optional_parameters FAILED [ 49%]
- tests/modular_pipelines/ltx2/test_modular_pipeline_ltx2.py::TestLTX2Image2VideoModularPipelineFast::test_pipeline_required_inputs FAILED [ 50%]
- tests/modular_pipelines/ltx2/test_modular_pipeline_ltx2.py::TestLTX2ConditionModularPipelineFast::test_pipeline_call_signature PASSED [ 50%]
- tests/modular_pipelines/ltx2/test_modular_pipeline_ltx2.py::TestLTX2ConditionModularPipelineFast::test_pipeline_optional_parameters FAILED [ 51%]
- tests/modular_pipelines/ltx2/test_modular_pipeline_ltx2.py::TestLTX2ConditionModularPipelineFast::test_pipeline_required_inputs FAILED [ 52%]
- tests/modular_pipelines/ltx2/test_modular_pipeline_ltx2.py::TestLTX2InContextModularPipelineFast::test_pipeline_call_signature PASSED [ 52%]
- tests/modular_pipelines/ltx2/test_modular_pipeline_ltx2.py::TestLTX2InContextModularPipelineFast::test_pipeline_optional_parameters FAILED [ 53%]
- tests/modular_pipelines/ltx2/test_modular_pipeline_ltx2.py::TestLTX2InContextModularPipelineFast::test_pipeline_required_inputs FAILED [ 54%]
- tests/modular_pipelines/ltx2/test_modular_pipeline_ltx25.py::TestLTX25Text2VideoModularPipelineFast::test_pipeline_call_signature PASSED [ 54%]
- tests/modular_pipelines/ltx2/test_modular_pipeline_ltx25.py::TestLTX25Text2VideoModularPipelineFast::test_pipeline_optional_parameters FAILED [ 55%]
- tests/modular_pipelines/ltx2/test_modular_pipeline_ltx25.py::TestLTX25Text2VideoModularPipelineFast::test_pipeline_required_inputs FAILED [ 56%]
- tests/modular_pipelines/ltx2/test_modular_pipeline_ltx25.py::TestLTX25Image2VideoModularPipelineFast::test_pipeline_call_signature PASSED [ 56%]
- tests/modular_pipelines/ltx2/test_modular_pipeline_ltx25.py::TestLTX25Image2VideoModularPipelineFast::test_pipeline_optional_parameters FAILED [ 57%]
- tests/modular_pipelines/ltx2/test_modular_pipeline_ltx25.py::TestLTX25Image2VideoModularPipelineFast::test_pipeline_required_inputs FAILED [ 58%]
- tests/modular_pipelines/ltx2/test_modular_pipeline_ltx25.py::TestLTX25ConditionModularPipelineFast::test_pipeline_call_signature PASSED [ 58%]
- tests/modular_pipelines/ltx2/test_modular_pipeline_ltx25.py::TestLTX25ConditionModularPipelineFast::test_pipeline_optional_parameters FAILED [ 59%]
- tests/modular_pipelines/ltx2/test_modular_pipeline_ltx25.py::TestLTX25ConditionModularPipelineFast::test_pipeline_required_inputs FAILED [ 60%]
- tests/modular_pipelines/ltx2/test_modular_pipeline_ltx25.py::TestLTX25InContextModularPipelineFast::test_pipeline_call_signature PASSED [ 60%]
- tests/modular_pipelines/ltx2/test_modular_pipeline_ltx25.py::TestLTX25InContextModularPipelineFast::test_pipeline_optional_parameters FAILED [ 61%]
- tests/modular_pipelines/ltx2/test_modular_pipeline_ltx25.py::TestLTX25InContextModularPipelineFast::test_pipeline_required_inputs FAILED [ 62%]
- tests/modular_pipelines/minimax_h3/test_modular_pipeline_minimax_h3.py::TestMiniMaxH3ModularPipelineFast::test_pipeline_call_signature PASSED [ 62%]
- tests/modular_pipelines/minimax_h3/test_modular_pipeline_minimax_h3.py::TestMiniMaxH3ModularPipelineFast::test_pipeline_optional_parameters FAILED [ 63%]
- tests/modular_pipelines/minimax_h3/test_modular_pipeline_minimax_h3.py::TestMiniMaxH3ModularPipelineFast::test_pipeline_required_inputs FAILED [ 64%]
- tests/modular_pipelines/minimax_h3/test_modular_pipeline_minimax_h3.py::TestMiniMaxH3Ref2VAModularPipelineFast::test_pipeline_call_signature PASSED [ 64%]
- tests/modular_pipelines/minimax_h3/test_modular_pipeline_minimax_h3.py::TestMiniMaxH3Ref2VAModularPipelineFast::test_pipeline_optional_parameters FAILED [ 65%]
- tests/modular_pipelines/minimax_h3/test_modular_pipeline_minimax_h3.py::TestMiniMaxH3Ref2VAModularPipelineFast::test_pipeline_required_inputs FAILED [ 66%]
- tests/modular_pipelines/minimax_music3/test_modular_pipeline_minimax_music3.py::TestMiniMaxMusic3ModularPipelineFast::test_pipeline_call_signature PASSED [ 66%]
- tests/modular_pipelines/minimax_music3/test_modular_pipeline_minimax_music3.py::TestMiniMaxMusic3ModularPipelineFast::test_pipeline_optional_parameters PASSED [ 67%]
- tests/modular_pipelines/minimax_music3/test_modular_pipeline_minimax_music3.py::TestMiniMaxMusic3ModularPipelineFast::test_pipeline_required_inputs PASSED [ 68%]
- tests/modular_pipelines/qwen/test_modular_pipeline_qwenimage.py::TestQwenImageModularPipelineFast::test_pipeline_call_signature PASSED [ 68%]
- tests/modular_pipelines/qwen/test_modular_pipeline_qwenimage.py::TestQwenImageModularPipelineFast::test_pipeline_optional_parameters FAILED [ 69%]
- tests/modular_pipelines/qwen/test_modular_pipeline_qwenimage.py::TestQwenImageModularPipelineFast::test_pipeline_required_inputs FAILED [ 70%]
- tests/modular_pipelines/qwen/test_modular_pipeline_qwenimage.py::TestQwenImageEditModularPipelineFast::test_pipeline_call_signature PASSED [ 70%]
- tests/modular_pipelines/qwen/test_modular_pipeline_qwenimage.py::TestQwenImageEditModularPipelineFast::test_pipeline_optional_parameters FAILED [ 71%]
- tests/modular_pipelines/qwen/test_modular_pipeline_qwenimage.py::TestQwenImageEditModularPipelineFast::test_pipeline_required_inputs FAILED [ 72%]
- tests/modular_pipelines/qwen/test_modular_pipeline_qwenimage.py::TestQwenImageEditPlusModularPipelineFast::test_pipeline_call_signature PASSED [ 72%]
- tests/modular_pipelines/qwen/test_modular_pipeline_qwenimage.py::TestQwenImageEditPlusModularPipelineFast::test_pipeline_optional_parameters PASSED [ 73%]
- tests/modular_pipelines/qwen/test_modular_pipeline_qwenimage.py::TestQwenImageEditPlusModularPipelineFast::test_pipeline_required_inputs FAILED [ 74%]
- tests/modular_pipelines/qwenimage21/test_modular_pipeline_qwenimage21.py::TestQwenImage21ModularPipelineFast::test_pipeline_call_signature PASSED [ 74%]
- tests/modular_pipelines/qwenimage21/test_modular_pipeline_qwenimage21.py::TestQwenImage21ModularPipelineFast::test_pipeline_optional_parameters FAILED [ 75%]
- tests/modular_pipelines/qwenimage21/test_modular_pipeline_qwenimage21.py::TestQwenImage21ModularPipelineFast::test_pipeline_required_inputs FAILED [ 76%]
- tests/modular_pipelines/qwenimage21/test_modular_pipeline_qwenimage21.py::TestQwenImage21ImageConditionedModularPipelineFast::test_pipeline_call_signature PASSED [ 76%]
- tests/modular_pipelines/qwenimage21/test_modular_pipeline_qwenimage21.py::TestQwenImage21ImageConditionedModularPipelineFast::test_pipeline_optional_parameters FAILED [ 77%]
- tests/modular_pipelines/qwenimage21/test_modular_pipeline_qwenimage21.py::TestQwenImage21ImageConditionedModularPipelineFast::test_pipeline_required_inputs FAILED [ 78%]
- tests/modular_pipelines/qwenimage21/test_modular_pipeline_qwenimage21_turbo.py::TestQwenImage21TurboModularPipelineFast::test_pipeline_call_signature PASSED [ 78%]
- tests/modular_pipelines/qwenimage21/test_modular_pipeline_qwenimage21_turbo.py::TestQwenImage21TurboModularPipelineFast::test_pipeline_optional_parameters FAILED [ 79%]
- tests/modular_pipelines/qwenimage21/test_modular_pipeline_qwenimage21_turbo.py::TestQwenImage21TurboModularPipelineFast::test_pipeline_required_inputs FAILED [ 80%]
- tests/modular_pipelines/qwenimage21/test_modular_pipeline_qwenimage21_turbo.py::TestQwenImage21TurboImageConditionedModularPipelineFast::test_pipeline_call_signature PASSED [ 80%]
- tests/modular_pipelines/qwenimage21/test_modular_pipeline_qwenimage21_turbo.py::TestQwenImage21TurboImageConditionedModularPipelineFast::test_pipeline_optional_parameters FAILED [ 81%]
- tests/modular_pipelines/qwenimage21/test_modular_pipeline_qwenimage21_turbo.py::TestQwenImage21TurboImageConditionedModularPipelineFast::test_pipeline_required_inputs FAILED [ 82%]
- tests/modular_pipelines/stable_diffusion_3/test_modular_pipeline_stable_diffusion_3.py::TestStableDiffusion3ModularPipelineFast::test_pipeline_optional_parameters FAILED [ 82%]
- tests/modular_pipelines/stable_diffusion_3/test_modular_pipeline_stable_diffusion_3.py::TestStableDiffusion3ModularPipelineFast::test_pipeline_required_inputs FAILED [ 83%]
- tests/modular_pipelines/stable_diffusion_3/test_modular_pipeline_stable_diffusion_3.py::TestStableDiffusion3ModularPipelineFast::test_pipeline_call_signature PASSED [ 84%]
- tests/modular_pipelines/stable_diffusion_3/test_modular_pipeline_stable_diffusion_3.py::TestStableDiffusion3Img2ImgModularPipelineFast::test_pipeline_optional_parameters FAILED [ 84%]
- tests/modular_pipelines/stable_diffusion_3/test_modular_pipeline_stable_diffusion_3.py::TestStableDiffusion3Img2ImgModularPipelineFast::test_pipeline_required_inputs FAILED [ 85%]
- tests/modular_pipelines/stable_diffusion_3/test_modular_pipeline_stable_diffusion_3.py::TestStableDiffusion3Img2ImgModularPipelineFast::test_pipeline_call_signature PASSED [ 86%]
- tests/modular_pipelines/stable_diffusion_xl/test_modular_pipeline_stable_diffusion_xl.py::TestSDXLModularPipelineFast::test_pipeline_call_signature PASSED [ 86%]
- tests/modular_pipelines/stable_diffusion_xl/test_modular_pipeline_stable_diffusion_xl.py::TestSDXLModularPipelineFast::test_pipeline_optional_parameters FAILED [ 87%]
- tests/modular_pipelines/stable_diffusion_xl/test_modular_pipeline_stable_diffusion_xl.py::TestSDXLModularPipelineFast::test_pipeline_required_inputs FAILED [ 88%]
- tests/modular_pipelines/stable_diffusion_xl/test_modular_pipeline_stable_diffusion_xl.py::TestSDXLImg2ImgModularPipelineFast::test_pipeline_call_signature PASSED [ 88%]
- tests/modular_pipelines/stable_diffusion_xl/test_modular_pipeline_stable_diffusion_xl.py::TestSDXLImg2ImgModularPipelineFast::test_pipeline_optional_parameters FAILED [ 89%]
- tests/modular_pipelines/stable_diffusion_xl/test_modular_pipeline_stable_diffusion_xl.py::TestSDXLImg2ImgModularPipelineFast::test_pipeline_required_inputs FAILED [ 90%]
- tests/modular_pipelines/wan/test_modular_pipeline_wan.py::TestWanModularPipelineFast::test_pipeline_call_signature PASSED [ 90%]
- tests/modular_pipelines/wan/test_modular_pipeline_wan.py::TestWanModularPipelineFast::test_pipeline_optional_parameters PASSED [ 91%]
- tests/modular_pipelines/wan/test_modular_pipeline_wan.py::TestWanModularPipelineFast::test_pipeline_required_inputs FAILED [ 92%]
- tests/modular_pipelines/wan/test_modular_pipeline_wan_vace.py::TestWan22VaceModularPipelineFast::test_pipeline_call_signature PASSED [ 92%]
- tests/modular_pipelines/wan/test_modular_pipeline_wan_vace.py::TestWan22VaceModularPipelineFast::test_pipeline_optional_parameters PASSED [ 93%]
- tests/modular_pipelines/wan/test_modular_pipeline_wan_vace.py::TestWan22VaceModularPipelineFast::test_pipeline_required_inputs FAILED [ 94%]
- tests/modular_pipelines/wan_animate_2/test_modular_pipeline_wan_animate_2.py::TestWanAnimate2ModularPipelineFast::test_pipeline_call_signature PASSED [ 94%]
- tests/modular_pipelines/wan_animate_2/test_modular_pipeline_wan_animate_2.py::TestWanAnimate2ModularPipelineFast::test_pipeline_optional_parameters PASSED [ 95%]
- tests/modular_pipelines/wan_animate_2/test_modular_pipeline_wan_animate_2.py::TestWanAnimate2ModularPipelineFast::test_pipeline_required_inputs FAILED [ 96%]
- tests/modular_pipelines/wan_animate_2/test_modular_pipeline_wan_animate_2.py::TestWanAnimate2DistilledModularPipelineFast::test_pipeline_call_signature PASSED [ 96%]
- tests/modular_pipelines/wan_animate_2/test_modular_pipeline_wan_animate_2.py::TestWanAnimate2DistilledModularPipelineFast::test_pipeline_optional_parameters PASSED [ 97%]
- tests/modular_pipelines/wan_animate_2/test_modular_pipeline_wan_animate_2.py::TestWanAnimate2DistilledModularPipelineFast::test_pipeline_required_inputs FAILED [ 98%]
- tests/modular_pipelines/z_image/test_modular_pipeline_z_image.py::TestZImageModularPipelineFast::test_pipeline_call_signature PASSED [ 98%]
- tests/modular_pipelines/z_image/test_modular_pipeline_z_image.py::TestZImageModularPipelineFast::test_pipeline_optional_parameters FAILED [ 99%]
- tests/modular_pipelines/z_image/test_modular_pipeline_z_image.py::TestZImageModularPipelineFast::test_pipeline_required_inputs FAILED [100%]
- =================================== FAILURES ===================================
- ________ TestAnimaModularPipelineFast.test_pipeline_optional_parameters ________
- tests/modular_pipelines/testing_utils/common.py:220: in test_pipeline_optional_parameters
- assert self.optional_params <= optional_parameters, self.optional_params - optional_parameters
- ^^^^^^^^^^^^^^^^^^^^^^^^^^^^^^^^^^^^^^^^^^^
- E AssertionError: frozenset({'num_inference_steps', 'latents'})
- __________ TestAnimaModularPipelineFast.test_pipeline_required_inputs __________
- tests/modular_pipelines/testing_utils/common.py:231: in test_pipeline_required_inputs
- assert param.default is None, (type(blocks).__name__, param)
- ^^^^^^^^^^^^^^^^^^^^^
- E AssertionError: ('AnimaAutoBlocks', <num_inference_steps: required, default=50>)
- ____ TestAnimaImg2ImgModularPipelineFast.test_pipeline_optional_parameters _____
- tests/modular_pipelines/testing_utils/common.py:220: in test_pipeline_optional_parameters
- assert self.optional_params <= optional_parameters, self.optional_params - optional_parameters
- ^^^^^^^^^^^^^^^^^^^^^^^^^^^^^^^^^^^^^^^^^^^
- E AssertionError: frozenset({'num_inference_steps', 'latents'})
- ______ TestAnimaImg2ImgModularPipelineFast.test_pipeline_required_inputs _______
- tests/modular_pipelines/testing_utils/common.py:231: in test_pipeline_required_inputs
- assert param.default is None, (type(blocks).__name__, param)
- ^^^^^^^^^^^^^^^^^^^^^
- E AssertionError: ('AnimaAutoBlocks', <num_inference_steps: required, default=50>)
- _____ TestCosmos3OmniModularPipelineFast.test_pipeline_optional_parameters _____
- tests/modular_pipelines/testing_utils/common.py:220: in test_pipeline_optional_parameters
- assert self.optional_params <= optional_parameters, self.optional_params - optional_parameters
- ^^^^^^^^^^^^^^^^^^^^^^^^^^^^^^^^^^^^^^^^^^^
- E AssertionError: frozenset({'num_inference_steps'})
- _______ TestCosmos3OmniModularPipelineFast.test_pipeline_required_inputs _______
- tests/modular_pipelines/testing_utils/common.py:229: in test_pipeline_required_inputs
- assert param.required == (param.name in required_inputs), (type(blocks).__name__, param)
- ^^^^^^^^^^^^^^^^^^^^^^^^^^^^^^^^^^^^^^^^^^^^^^^^^
- E AssertionError: ('Cosmos3OmniBlocks', <height: optional, default=None>)
- ____ TestCosmos3DistilledModularPipelineFast.test_pipeline_required_inputs _____
- tests/modular_pipelines/testing_utils/common.py:229: in test_pipeline_required_inputs
- assert param.required == (param.name in required_inputs), (type(blocks).__name__, param)
- ^^^^^^^^^^^^^^^^^^^^^^^^^^^^^^^^^^^^^^^^^^^^^^^^^
- E AssertionError: ('Cosmos3DistilledBlocks', <num_frames: optional, default=None>)
- __________ TestEchoModularPipelineFast.test_pipeline_required_inputs ___________
- tests/modular_pipelines/testing_utils/common.py:229: in test_pipeline_required_inputs
- assert param.required == (param.name in required_inputs), (type(blocks).__name__, param)
- ^^^^^^^^^^^^^^^^^^^^^^^^^^^^^^^^^^^^^^^^^^^^^^^^^
- E AssertionError: ('EchoBlocks', <latents: optional, default=None>)
- _______ TestErnieImageModularPipelineFast.test_pipeline_required_inputs ________
- tests/modular_pipelines/testing_utils/common.py:229: in test_pipeline_required_inputs
- assert param.required == (param.name in required_inputs), (type(blocks).__name__, param)
- ^^^^^^^^^^^^^^^^^^^^^^^^^^^^^^^^^^^^^^^^^^^^^^^^^
- E AssertionError: ('ErnieImageAutoBlocks', <num_inference_steps: optional, default=50>)
- __________ TestFluxModularPipelineFast.test_pipeline_required_inputs ___________
- tests/modular_pipelines/testing_utils/common.py:229: in test_pipeline_required_inputs
- assert param.required == (param.name in required_inputs), (type(blocks).__name__, param)
- ^^^^^^^^^^^^^^^^^^^^^^^^^^^^^^^^^^^^^^^^^^^^^^^^^
- E AssertionError: ('FluxAutoBlocks', <height: optional, default=None>)
- _______ TestFluxImg2ImgModularPipelineFast.test_pipeline_required_inputs _______
- tests/modular_pipelines/testing_utils/common.py:229: in test_pipeline_required_inputs
- assert param.required == (param.name in required_inputs), (type(blocks).__name__, param)
- ^^^^^^^^^^^^^^^^^^^^^^^^^^^^^^^^^^^^^^^^^^^^^^^^^
- E AssertionError: ('FluxAutoBlocks', <height: optional, default=None>)
- _______ TestFluxKontextModularPipelineFast.test_pipeline_required_inputs _______
- tests/modular_pipelines/testing_utils/common.py:229: in test_pipeline_required_inputs
- assert param.required == (param.name in required_inputs), (type(blocks).__name__, param)
- ^^^^^^^^^^^^^^^^^^^^^^^^^^^^^^^^^^^^^^^^^^^^^^^^^
- E AssertionError: ('FluxKontextAutoBlocks', <height: optional, default=None>)
- ________ TestFlux2ModularPipelineFast.test_pipeline_optional_parameters ________
- tests/modular_pipelines/testing_utils/common.py:220: in test_pipeline_optional_parameters
- assert self.optional_params <= optional_parameters, self.optional_params - optional_parameters
- ^^^^^^^^^^^^^^^^^^^^^^^^^^^^^^^^^^^^^^^^^^^
- E AssertionError: frozenset({'num_inference_steps', 'latents'})
- __________ TestFlux2ModularPipelineFast.test_pipeline_required_inputs __________
- tests/modular_pipelines/testing_utils/common.py:231: in test_pipeline_required_inputs
- assert param.default is None, (type(blocks).__name__, param)
- ^^^^^^^^^^^^^^^^^^^^^
- E AssertionError: ('Flux2AutoBlocks', <num_inference_steps: required, default=50>)
- _ TestFlux2ImageConditionedModularPipelineFast.test_pipeline_optional_parameters _
- tests/modular_pipelines/testing_utils/common.py:220: in test_pipeline_optional_parameters
- assert self.optional_params <= optional_parameters, self.optional_params - optional_parameters
- ^^^^^^^^^^^^^^^^^^^^^^^^^^^^^^^^^^^^^^^^^^^
- E AssertionError: frozenset({'num_inference_steps', 'latents'})
- __ TestFlux2ImageConditionedModularPipelineFast.test_pipeline_required_inputs __
- tests/modular_pipelines/testing_utils/common.py:231: in test_pipeline_required_inputs
- assert param.default is None, (type(blocks).__name__, param)
- ^^^^^^^^^^^^^^^^^^^^^
- E AssertionError: ('Flux2AutoBlocks', <num_inference_steps: required, default=50>)
- _____ TestFlux2KleinModularPipelineFast.test_pipeline_optional_parameters ______
- tests/modular_pipelines/testing_utils/common.py:220: in test_pipeline_optional_parameters
- assert self.optional_params <= optional_parameters, self.optional_params - optional_parameters
- ^^^^^^^^^^^^^^^^^^^^^^^^^^^^^^^^^^^^^^^^^^^
- E AssertionError: frozenset({'num_inference_steps', 'latents'})
- _______ TestFlux2KleinModularPipelineFast.test_pipeline_required_inputs ________
- tests/modular_pipelines/testing_utils/common.py:231: in test_pipeline_required_inputs
- assert param.default is None, (type(blocks).__name__, param)
- ^^^^^^^^^^^^^^^^^^^^^
- E AssertionError: ('Flux2KleinAutoBlocks', <num_inference_steps: required, default=50>)
- _ TestFlux2KleinImageConditionedModularPipelineFast.test_pipeline_optional_parameters _
- tests/modular_pipelines/testing_utils/common.py:220: in test_pipeline_optional_parameters
- assert self.optional_params <= optional_parameters, self.optional_params - optional_parameters
- ^^^^^^^^^^^^^^^^^^^^^^^^^^^^^^^^^^^^^^^^^^^
- E AssertionError: frozenset({'num_inference_steps', 'latents'})
- _ TestFlux2KleinImageConditionedModularPipelineFast.test_pipeline_required_inputs _
- tests/modular_pipelines/testing_utils/common.py:231: in test_pipeline_required_inputs
- assert param.default is None, (type(blocks).__name__, param)
- ^^^^^^^^^^^^^^^^^^^^^
- E AssertionError: ('Flux2KleinAutoBlocks', <num_inference_steps: required, default=50>)
- ___ TestFlux2KleinBaseModularPipelineFast.test_pipeline_optional_parameters ____
- tests/modular_pipelines/testing_utils/common.py:220: in test_pipeline_optional_parameters
- assert self.optional_params <= optional_parameters, self.optional_params - optional_parameters
- ^^^^^^^^^^^^^^^^^^^^^^^^^^^^^^^^^^^^^^^^^^^
- E AssertionError: frozenset({'num_inference_steps', 'latents'})
- _____ TestFlux2KleinBaseModularPipelineFast.test_pipeline_required_inputs ______
- tests/modular_pipelines/testing_utils/common.py:231: in test_pipeline_required_inputs
- assert param.default is None, (type(blocks).__name__, param)
- ^^^^^^^^^^^^^^^^^^^^^
- E AssertionError: ('Flux2KleinBaseAutoBlocks', <num_inference_steps: required, default=50>)
- _ TestFlux2KleinBaseImageConditionedModularPipelineFast.test_pipeline_optional_parameters _
- tests/modular_pipelines/testing_utils/common.py:220: in test_pipeline_optional_parameters
- assert self.optional_params <= optional_parameters, self.optional_params - optional_parameters
- ^^^^^^^^^^^^^^^^^^^^^^^^^^^^^^^^^^^^^^^^^^^
- E AssertionError: frozenset({'num_inference_steps', 'latents'})
- _ TestFlux2KleinBaseImageConditionedModularPipelineFast.test_pipeline_required_inputs _
- tests/modular_pipelines/testing_utils/common.py:231: in test_pipeline_required_inputs
- assert param.default is None, (type(blocks).__name__, param)
- ^^^^^^^^^^^^^^^^^^^^^
- E AssertionError: ('Flux2KleinBaseAutoBlocks', <num_inference_steps: required, default=50>)
- ________ TestFlux3ModularPipelineFast.test_pipeline_optional_parameters ________
- tests/modular_pipelines/testing_utils/common.py:220: in test_pipeline_optional_parameters
- assert self.optional_params <= optional_parameters, self.optional_params - optional_parameters
- ^^^^^^^^^^^^^^^^^^^^^^^^^^^^^^^^^^^^^^^^^^^
- E AssertionError: frozenset({'num_inference_steps', 'latents'})
- __________ TestFlux3ModularPipelineFast.test_pipeline_required_inputs __________
- tests/modular_pipelines/testing_utils/common.py:231: in test_pipeline_required_inputs
- assert param.default is None, (type(blocks).__name__, param)
- ^^^^^^^^^^^^^^^^^^^^^
- E AssertionError: ('Flux3AutoBlocks', <num_inference_steps: required, default=50>)
- ___ TestFlux3DistilledModularPipelineFast.test_pipeline_optional_parameters ____
- tests/modular_pipelines/testing_utils/common.py:220: in test_pipeline_optional_parameters
- assert self.optional_params <= optional_parameters, self.optional_params - optional_parameters
- ^^^^^^^^^^^^^^^^^^^^^^^^^^^^^^^^^^^^^^^^^^^
- E AssertionError: frozenset({'num_inference_steps', 'latents'})
- _____ TestFlux3DistilledModularPipelineFast.test_pipeline_required_inputs ______
- tests/modular_pipelines/testing_utils/common.py:231: in test_pipeline_required_inputs
- assert param.default is None, (type(blocks).__name__, param)
- ^^^^^^^^^^^^^^^^^^^^^
- E AssertionError: ('Flux3DistilledAutoBlocks', <num_inference_steps: required, default=16>)
- _________ TestHeliosModularPipelineFast.test_pipeline_required_inputs __________
- tests/modular_pipelines/testing_utils/common.py:229: in test_pipeline_required_inputs
- assert param.required == (param.name in required_inputs), (type(blocks).__name__, param)
- ^^^^^^^^^^^^^^^^^^^^^^^^^^^^^^^^^^^^^^^^^^^^^^^^^
- E AssertionError: ('HeliosAutoBlocks', <num_frames: optional, default=132>)
- ______ TestHeliosPyramidModularPipelineFast.test_pipeline_required_inputs ______
- tests/modular_pipelines/testing_utils/common.py:229: in test_pipeline_required_inputs
- assert param.required == (param.name in required_inputs), (type(blocks).__name__, param)
- ^^^^^^^^^^^^^^^^^^^^^^^^^^^^^^^^^^^^^^^^^^^^^^^^^
- E AssertionError: ('HeliosPyramidAutoBlocks', <num_frames: optional, default=132>)
- ___ TestHunyuanVideo15ModularPipelineFast.test_pipeline_optional_parameters ____
- tests/modular_pipelines/testing_utils/common.py:220: in test_pipeline_optional_parameters
- assert self.optional_params <= optional_parameters, self.optional_params - optional_parameters
- ^^^^^^^^^^^^^^^^^^^^^^^^^^^^^^^^^^^^^^^^^^^
- E AssertionError: frozenset({'num_inference_steps', 'latents'})
- _____ TestHunyuanVideo15ModularPipelineFast.test_pipeline_required_inputs ______
- tests/modular_pipelines/testing_utils/common.py:231: in test_pipeline_required_inputs
- assert param.default is None, (type(blocks).__name__, param)
- ^^^^^^^^^^^^^^^^^^^^^
- E AssertionError: ('HunyuanVideo15AutoBlocks', <num_inference_steps: required, default=50>)
- __________ TestKrea2ModularPipelineFast.test_pipeline_required_inputs __________
- tests/modular_pipelines/testing_utils/common.py:229: in test_pipeline_required_inputs
- assert param.required == (param.name in required_inputs), (type(blocks).__name__, param)
- ^^^^^^^^^^^^^^^^^^^^^^^^^^^^^^^^^^^^^^^^^^^^^^^^^
- E AssertionError: ('Krea2AutoBlocks', <latents: optional, default=None>)
- _______ TestKrea2TurboModularPipelineFast.test_pipeline_required_inputs ________
- tests/modular_pipelines/testing_utils/common.py:229: in test_pipeline_required_inputs
- assert param.required == (param.name in required_inputs), (type(blocks).__name__, param)
- ^^^^^^^^^^^^^^^^^^^^^^^^^^^^^^^^^^^^^^^^^^^^^^^^^
- E AssertionError: ('Krea2TurboAutoBlocks', <latents: optional, default=None>)
- _________ TestLTXModularPipelineFast.test_pipeline_optional_parameters _________
- tests/modular_pipelines/testing_utils/common.py:220: in test_pipeline_optional_parameters
- assert self.optional_params <= optional_parameters, self.optional_params - optional_parameters
- ^^^^^^^^^^^^^^^^^^^^^^^^^^^^^^^^^^^^^^^^^^^
- E AssertionError: frozenset({'num_inference_steps', 'latents'})
- ___________ TestLTXModularPipelineFast.test_pipeline_required_inputs ___________
- tests/modular_pipelines/testing_utils/common.py:229: in test_pipeline_required_inputs
- assert param.required == (param.name in required_inputs), (type(blocks).__name__, param)
- ^^^^^^^^^^^^^^^^^^^^^^^^^^^^^^^^^^^^^^^^^^^^^^^^^
- E AssertionError: ('LTXAutoBlocks', <height: optional, default=512>)
- ___ TestLTX2Text2VideoModularPipelineFast.test_pipeline_optional_parameters ____
- tests/modular_pipelines/testing_utils/common.py:220: in test_pipeline_optional_parameters
- assert self.optional_params <= optional_parameters, self.optional_params - optional_parameters
- ^^^^^^^^^^^^^^^^^^^^^^^^^^^^^^^^^^^^^^^^^^^
- E AssertionError: frozenset({'num_inference_steps', 'latents'})
- _____ TestLTX2Text2VideoModularPipelineFast.test_pipeline_required_inputs ______
- tests/modular_pipelines/testing_utils/common.py:229: in test_pipeline_required_inputs
- assert param.required == (param.name in required_inputs), (type(blocks).__name__, param)
- ^^^^^^^^^^^^^^^^^^^^^^^^^^^^^^^^^^^^^^^^^^^^^^^^^
- E AssertionError: ('LTX2AutoBlocks', <prompt: optional, default=None>)
- ___ TestLTX2Image2VideoModularPipelineFast.test_pipeline_optional_parameters ___
- tests/modular_pipelines/testing_utils/common.py:220: in test_pipeline_optional_parameters
- assert self.optional_params <= optional_parameters, self.optional_params - optional_parameters
- ^^^^^^^^^^^^^^^^^^^^^^^^^^^^^^^^^^^^^^^^^^^
- E AssertionError: frozenset({'num_inference_steps', 'latents'})
- _____ TestLTX2Image2VideoModularPipelineFast.test_pipeline_required_inputs _____
- tests/modular_pipelines/testing_utils/common.py:229: in test_pipeline_required_inputs
- assert param.required == (param.name in required_inputs), (type(blocks).__name__, param)
- ^^^^^^^^^^^^^^^^^^^^^^^^^^^^^^^^^^^^^^^^^^^^^^^^^
- E AssertionError: ('LTX2AutoBlocks', <prompt: optional, default=None>)
- ____ TestLTX2ConditionModularPipelineFast.test_pipeline_optional_parameters ____
- tests/modular_pipelines/testing_utils/common.py:220: in test_pipeline_optional_parameters
- assert self.optional_params <= optional_parameters, self.optional_params - optional_parameters
- ^^^^^^^^^^^^^^^^^^^^^^^^^^^^^^^^^^^^^^^^^^^
- E AssertionError: frozenset({'num_inference_steps', 'latents'})
- ______ TestLTX2ConditionModularPipelineFast.test_pipeline_required_inputs ______
- tests/modular_pipelines/testing_utils/common.py:229: in test_pipeline_required_inputs
- assert param.required == (param.name in required_inputs), (type(blocks).__name__, param)
- ^^^^^^^^^^^^^^^^^^^^^^^^^^^^^^^^^^^^^^^^^^^^^^^^^
- E AssertionError: ('LTX2AutoBlocks', <prompt: optional, default=None>)
- ____ TestLTX2InContextModularPipelineFast.test_pipeline_optional_parameters ____
- tests/modular_pipelines/testing_utils/common.py:220: in test_pipeline_optional_parameters
- assert self.optional_params <= optional_parameters, self.optional_params - optional_parameters
- ^^^^^^^^^^^^^^^^^^^^^^^^^^^^^^^^^^^^^^^^^^^
- E AssertionError: frozenset({'num_inference_steps', 'latents'})
- ______ TestLTX2InContextModularPipelineFast.test_pipeline_required_inputs ______
- tests/modular_pipelines/testing_utils/common.py:229: in test_pipeline_required_inputs
- assert param.required == (param.name in required_inputs), (type(blocks).__name__, param)
- ^^^^^^^^^^^^^^^^^^^^^^^^^^^^^^^^^^^^^^^^^^^^^^^^^
- E AssertionError: ('LTX2AutoBlocks', <prompt: optional, default=None>)
- ___ TestLTX25Text2VideoModularPipelineFast.test_pipeline_optional_parameters ___
- tests/modular_pipelines/testing_utils/common.py:220: in test_pipeline_optional_parameters
- assert self.optional_params <= optional_parameters, self.optional_params - optional_parameters
- ^^^^^^^^^^^^^^^^^^^^^^^^^^^^^^^^^^^^^^^^^^^
- E AssertionError: frozenset({'num_inference_steps', 'latents'})
- _____ TestLTX25Text2VideoModularPipelineFast.test_pipeline_required_inputs _____
- tests/modular_pipelines/testing_utils/common.py:229: in test_pipeline_required_inputs
- assert param.required == (param.name in required_inputs), (type(blocks).__name__, param)
- ^^^^^^^^^^^^^^^^^^^^^^^^^^^^^^^^^^^^^^^^^^^^^^^^^
- E AssertionError: ('LTX25AutoBlocks', <prompt: optional, default=None>)
- __ TestLTX25Image2VideoModularPipelineFast.test_pipeline_optional_parameters ___
- tests/modular_pipelines/testing_utils/common.py:220: in test_pipeline_optional_parameters
- assert self.optional_params <= optional_parameters, self.optional_params - optional_parameters
- ^^^^^^^^^^^^^^^^^^^^^^^^^^^^^^^^^^^^^^^^^^^
- E AssertionError: frozenset({'num_inference_steps', 'latents'})
- ____ TestLTX25Image2VideoModularPipelineFast.test_pipeline_required_inputs _____
- tests/modular_pipelines/testing_utils/common.py:229: in test_pipeline_required_inputs
- assert param.required == (param.name in required_inputs), (type(blocks).__name__, param)
- ^^^^^^^^^^^^^^^^^^^^^^^^^^^^^^^^^^^^^^^^^^^^^^^^^
- E AssertionError: ('LTX25AutoBlocks', <prompt: optional, default=None>)
- ___ TestLTX25ConditionModularPipelineFast.test_pipeline_optional_parameters ____
- tests/modular_pipelines/testing_utils/common.py:220: in test_pipeline_optional_parameters
- assert self.optional_params <= optional_parameters, self.optional_params - optional_parameters
- ^^^^^^^^^^^^^^^^^^^^^^^^^^^^^^^^^^^^^^^^^^^
- E AssertionError: frozenset({'num_inference_steps', 'latents'})
- _____ TestLTX25ConditionModularPipelineFast.test_pipeline_required_inputs ______
- tests/modular_pipelines/testing_utils/common.py:229: in test_pipeline_required_inputs
- assert param.required == (param.name in required_inputs), (type(blocks).__name__, param)
- ^^^^^^^^^^^^^^^^^^^^^^^^^^^^^^^^^^^^^^^^^^^^^^^^^
- E AssertionError: ('LTX25AutoBlocks', <prompt: optional, default=None>)
- ___ TestLTX25InContextModularPipelineFast.test_pipeline_optional_parameters ____
- tests/modular_pipelines/testing_utils/common.py:220: in test_pipeline_optional_parameters
- assert self.optional_params <= optional_parameters, self.optional_params - optional_parameters
- ^^^^^^^^^^^^^^^^^^^^^^^^^^^^^^^^^^^^^^^^^^^
- E AssertionError: frozenset({'num_inference_steps', 'latents'})
- _____ TestLTX25InContextModularPipelineFast.test_pipeline_required_inputs ______
- tests/modular_pipelines/testing_utils/common.py:229: in test_pipeline_required_inputs
- assert param.required == (param.name in required_inputs), (type(blocks).__name__, param)
- ^^^^^^^^^^^^^^^^^^^^^^^^^^^^^^^^^^^^^^^^^^^^^^^^^
- E AssertionError: ('LTX25AutoBlocks', <prompt: optional, default=None>)
- ______ TestMiniMaxH3ModularPipelineFast.test_pipeline_optional_parameters ______
- tests/modular_pipelines/testing_utils/common.py:220: in test_pipeline_optional_parameters
- assert self.optional_params <= optional_parameters, self.optional_params - optional_parameters
- ^^^^^^^^^^^^^^^^^^^^^^^^^^^^^^^^^^^^^^^^^^^
- E AssertionError: frozenset({'latents'})
- ________ TestMiniMaxH3ModularPipelineFast.test_pipeline_required_inputs ________
- tests/modular_pipelines/testing_utils/common.py:231: in test_pipeline_required_inputs
- assert param.default is None, (type(blocks).__name__, param)
- ^^^^^^^^^^^^^^^^^^^^^
- E AssertionError: ('MiniMaxH3Blocks', <num_inference_steps: required, default=50>)
- ___ TestMiniMaxH3Ref2VAModularPipelineFast.test_pipeline_optional_parameters ___
- tests/modular_pipelines/testing_utils/common.py:220: in test_pipeline_optional_parameters
- assert self.optional_params <= optional_parameters, self.optional_params - optional_parameters
- ^^^^^^^^^^^^^^^^^^^^^^^^^^^^^^^^^^^^^^^^^^^
- E AssertionError: frozenset({'latents'})
- _____ TestMiniMaxH3Ref2VAModularPipelineFast.test_pipeline_required_inputs _____
- tests/modular_pipelines/testing_utils/common.py:231: in test_pipeline_required_inputs
- assert param.default is None, (type(blocks).__name__, param)
- ^^^^^^^^^^^^^^^^^^^^^
- E AssertionError: ('MiniMaxH3Blocks', <num_inference_steps: required, default=50>)
- ______ TestQwenImageModularPipelineFast.test_pipeline_optional_parameters ______
- tests/modular_pipelines/testing_utils/common.py:220: in test_pipeline_optional_parameters
- assert self.optional_params <= optional_parameters, self.optional_params - optional_parameters
- ^^^^^^^^^^^^^^^^^^^^^^^^^^^^^^^^^^^^^^^^^^^
- E AssertionError: frozenset({'num_inference_steps', 'latents'})
- ________ TestQwenImageModularPipelineFast.test_pipeline_required_inputs ________
- tests/modular_pipelines/testing_utils/common.py:229: in test_pipeline_required_inputs
- assert param.required == (param.name in required_inputs), (type(blocks).__name__, param)
- ^^^^^^^^^^^^^^^^^^^^^^^^^^^^^^^^^^^^^^^^^^^^^^^^^
- E AssertionError: ('QwenImageAutoBlocks', <height: optional, default=None>)
- ____ TestQwenImageEditModularPipelineFast.test_pipeline_optional_parameters ____
- tests/modular_pipelines/testing_utils/common.py:220: in test_pipeline_optional_parameters
- assert self.optional_params <= optional_parameters, self.optional_params - optional_parameters
- ^^^^^^^^^^^^^^^^^^^^^^^^^^^^^^^^^^^^^^^^^^^
- E AssertionError: frozenset({'num_inference_steps', 'latents'})
- ______ TestQwenImageEditModularPipelineFast.test_pipeline_required_inputs ______
- tests/modular_pipelines/testing_utils/common.py:231: in test_pipeline_required_inputs
- assert param.default is None, (type(blocks).__name__, param)
- ^^^^^^^^^^^^^^^^^^^^^
- E AssertionError: ('QwenImageEditAutoBlocks', <num_inference_steps: required, default=50>)
- ____ TestQwenImageEditPlusModularPipelineFast.test_pipeline_required_inputs ____
- tests/modular_pipelines/testing_utils/common.py:229: in test_pipeline_required_inputs
- assert param.required == (param.name in required_inputs), (type(blocks).__name__, param)
- ^^^^^^^^^^^^^^^^^^^^^^^^^^^^^^^^^^^^^^^^^^^^^^^^^
- E AssertionError: ('QwenImageEditPlusAutoBlocks', <height: optional, default=None>)
- _____ TestQwenImage21ModularPipelineFast.test_pipeline_optional_parameters _____
- tests/modular_pipelines/testing_utils/common.py:220: in test_pipeline_optional_parameters
- assert self.optional_params <= optional_parameters, self.optional_params - optional_parameters
- ^^^^^^^^^^^^^^^^^^^^^^^^^^^^^^^^^^^^^^^^^^^
- E AssertionError: frozenset({'num_inference_steps', 'latents'})
- _______ TestQwenImage21ModularPipelineFast.test_pipeline_required_inputs _______
- tests/modular_pipelines/testing_utils/common.py:231: in test_pipeline_required_inputs
- assert param.default is None, (type(blocks).__name__, param)
- ^^^^^^^^^^^^^^^^^^^^^
- E AssertionError: ('QwenImage21AutoBlocks', <num_inference_steps: required, default=40>)
- _ TestQwenImage21ImageConditionedModularPipelineFast.test_pipeline_optional_parameters _
- tests/modular_pipelines/testing_utils/common.py:220: in test_pipeline_optional_parameters
- assert self.optional_params <= optional_parameters, self.optional_params - optional_parameters
- ^^^^^^^^^^^^^^^^^^^^^^^^^^^^^^^^^^^^^^^^^^^
- E AssertionError: frozenset({'num_inference_steps', 'latents'})
- _ TestQwenImage21ImageConditionedModularPipelineFast.test_pipeline_required_inputs _
- tests/modular_pipelines/testing_utils/common.py:231: in test_pipeline_required_inputs
- assert param.default is None, (type(blocks).__name__, param)
- ^^^^^^^^^^^^^^^^^^^^^
- E AssertionError: ('QwenImage21AutoBlocks', <num_inference_steps: required, default=40>)
- __ TestQwenImage21TurboModularPipelineFast.test_pipeline_optional_parameters ___
- tests/modular_pipelines/testing_utils/common.py:220: in test_pipeline_optional_parameters
- assert self.optional_params <= optional_parameters, self.optional_params - optional_parameters
- ^^^^^^^^^^^^^^^^^^^^^^^^^^^^^^^^^^^^^^^^^^^
- E AssertionError: frozenset({'num_inference_steps', 'latents'})
- ____ TestQwenImage21TurboModularPipelineFast.test_pipeline_required_inputs _____
- tests/modular_pipelines/testing_utils/common.py:231: in test_pipeline_required_inputs
- assert param.default is None, (type(blocks).__name__, param)
- ^^^^^^^^^^^^^^^^^^^^^
- E AssertionError: ('QwenImage21TurboAutoBlocks', <num_inference_steps: required, default=8>)
- _ TestQwenImage21TurboImageConditionedModularPipelineFast.test_pipeline_optional_parameters _
- tests/modular_pipelines/testing_utils/common.py:220: in test_pipeline_optional_parameters
- assert self.optional_params <= optional_parameters, self.optional_params - optional_parameters
- ^^^^^^^^^^^^^^^^^^^^^^^^^^^^^^^^^^^^^^^^^^^
- E AssertionError: frozenset({'num_inference_steps', 'latents'})
- _ TestQwenImage21TurboImageConditionedModularPipelineFast.test_pipeline_required_inputs _
- tests/modular_pipelines/testing_utils/common.py:231: in test_pipeline_required_inputs
- assert param.default is None, (type(blocks).__name__, param)
- ^^^^^^^^^^^^^^^^^^^^^
- E AssertionError: ('QwenImage21TurboAutoBlocks', <num_inference_steps: required, default=8>)
- __ TestStableDiffusion3ModularPipelineFast.test_pipeline_optional_parameters ___
- tests/modular_pipelines/testing_utils/common.py:220: in test_pipeline_optional_parameters
- assert self.optional_params <= optional_parameters, self.optional_params - optional_parameters
- ^^^^^^^^^^^^^^^^^^^^^^^^^^^^^^^^^^^^^^^^^^^
- E AssertionError: frozenset({'num_inference_steps', 'latents'})
- ____ TestStableDiffusion3ModularPipelineFast.test_pipeline_required_inputs _____
- tests/modular_pipelines/testing_utils/common.py:231: in test_pipeline_required_inputs
- assert param.default is None, (type(blocks).__name__, param)
- ^^^^^^^^^^^^^^^^^^^^^
- E AssertionError: ('StableDiffusion3AutoBlocks', <num_inference_steps: required, default=50>)
- _ TestStableDiffusion3Img2ImgModularPipelineFast.test_pipeline_optional_parameters _
- tests/modular_pipelines/testing_utils/common.py:220: in test_pipeline_optional_parameters
- assert self.optional_params <= optional_parameters, self.optional_params - optional_parameters
- ^^^^^^^^^^^^^^^^^^^^^^^^^^^^^^^^^^^^^^^^^^^
- E AssertionError: frozenset({'num_inference_steps', 'latents'})
- _ TestStableDiffusion3Img2ImgModularPipelineFast.test_pipeline_required_inputs _
- tests/modular_pipelines/testing_utils/common.py:231: in test_pipeline_required_inputs
- assert param.default is None, (type(blocks).__name__, param)
- ^^^^^^^^^^^^^^^^^^^^^
- E AssertionError: ('StableDiffusion3AutoBlocks', <num_inference_steps: required, default=50>)
- ________ TestSDXLModularPipelineFast.test_pipeline_optional_parameters _________
- tests/modular_pipelines/testing_utils/common.py:220: in test_pipeline_optional_parameters
- assert self.optional_params <= optional_parameters, self.optional_params - optional_parameters
- ^^^^^^^^^^^^^^^^^^^^^^^^^^^^^^^^^^^^^^^^^^^
- E AssertionError: frozenset({'latents'})
- __________ TestSDXLModularPipelineFast.test_pipeline_required_inputs ___________
- tests/modular_pipelines/testing_utils/common.py:229: in test_pipeline_required_inputs
- assert param.required == (param.name in required_inputs), (type(blocks).__name__, param)
- ^^^^^^^^^^^^^^^^^^^^^^^^^^^^^^^^^^^^^^^^^^^^^^^^^
- E AssertionError: ('StableDiffusionXLInpaintBeforeDenoiseStep', <latents: optional, default=None>)
- _____ TestSDXLImg2ImgModularPipelineFast.test_pipeline_optional_parameters _____
- tests/modular_pipelines/testing_utils/common.py:220: in test_pipeline_optional_parameters
- assert self.optional_params <= optional_parameters, self.optional_params - optional_parameters
- ^^^^^^^^^^^^^^^^^^^^^^^^^^^^^^^^^^^^^^^^^^^
- E AssertionError: frozenset({'latents'})
- _______ TestSDXLImg2ImgModularPipelineFast.test_pipeline_required_inputs _______
- tests/modular_pipelines/testing_utils/common.py:229: in test_pipeline_required_inputs
- assert param.required == (param.name in required_inputs), (type(blocks).__name__, param)
- ^^^^^^^^^^^^^^^^^^^^^^^^^^^^^^^^^^^^^^^^^^^^^^^^^
- E AssertionError: ('StableDiffusionXLInpaintBeforeDenoiseStep', <latents: optional, default=None>)
- ___________ TestWanModularPipelineFast.test_pipeline_required_inputs ___________
- tests/modular_pipelines/testing_utils/common.py:229: in test_pipeline_required_inputs
- assert param.required == (param.name in required_inputs), (type(blocks).__name__, param)
- ^^^^^^^^^^^^^^^^^^^^^^^^^^^^^^^^^^^^^^^^^^^^^^^^^
- E AssertionError: ('WanBlocks', <num_inference_steps: optional, default=50>)
- ________ TestWan22VaceModularPipelineFast.test_pipeline_required_inputs ________
- tests/modular_pipelines/testing_utils/common.py:229: in test_pipeline_required_inputs
- assert param.required == (param.name in required_inputs), (type(blocks).__name__, param)
- ^^^^^^^^^^^^^^^^^^^^^^^^^^^^^^^^^^^^^^^^^^^^^^^^^
- E AssertionError: ('Wan22VaceBlocks', <num_inference_steps: optional, default=50>)
- _______ TestWanAnimate2ModularPipelineFast.test_pipeline_required_inputs _______
- tests/modular_pipelines/testing_utils/common.py:229: in test_pipeline_required_inputs
- assert param.required == (param.name in required_inputs), (type(blocks).__name__, param)
- ^^^^^^^^^^^^^^^^^^^^^^^^^^^^^^^^^^^^^^^^^^^^^^^^^
- E AssertionError: ('WanAnimate2Blocks', <height: optional, default=800>)
- __ TestWanAnimate2DistilledModularPipelineFast.test_pipeline_required_inputs ___
- tests/modular_pipelines/testing_utils/common.py:229: in test_pipeline_required_inputs
- assert param.required == (param.name in required_inputs), (type(blocks).__name__, param)
- ^^^^^^^^^^^^^^^^^^^^^^^^^^^^^^^^^^^^^^^^^^^^^^^^^
- E AssertionError: ('WanAnimate2DistilledBlocks', <height: optional, default=800>)
- _______ TestZImageModularPipelineFast.test_pipeline_optional_parameters ________
- tests/modular_pipelines/testing_utils/common.py:220: in test_pipeline_optional_parameters
- assert self.optional_params <= optional_parameters, self.optional_params - optional_parameters
- ^^^^^^^^^^^^^^^^^^^^^^^^^^^^^^^^^^^^^^^^^^^
- E AssertionError: frozenset({'num_inference_steps', 'latents'})
- _________ TestZImageModularPipelineFast.test_pipeline_required_inputs __________
- tests/modular_pipelines/testing_utils/common.py:231: in test_pipeline_required_inputs
- assert param.default is None, (type(blocks).__name__, param)
- ^^^^^^^^^^^^^^^^^^^^^
- E AssertionError: ('ZImageAutoBlocks', <num_inference_steps: required, default=8>)
- =============================== warnings summary ===============================
- <frozen importlib._bootstrap>:488
- <frozen importlib._bootstrap>:488: DeprecationWarning: builtin type SwigPyPacked has no __module__ attribute
- <frozen importlib._bootstrap>:488
- <frozen importlib._bootstrap>:488: DeprecationWarning: builtin type SwigPyObject has no __module__ attribute
- ../.dev/lib/python3.12/site-packages/torch/jit/_script.py:365: 14 warnings
- /home/sayakpaul/.dev/lib/python3.12/site-packages/torch/jit/_script.py:365: DeprecationWarning: `torch.jit.script_method` is deprecated. Please switch to `torch.compile` or `torch.export`.
- warnings.warn(
- tests/testing_utils.py:502
- /home/sayakpaul/diffusers/tests/testing_utils.py:502: PytestUnknownMarkWarning: Unknown pytest.mark.cache - is this a typo? You can register custom marks to avoid this warning - for details, see https://docs.pytest.org/en/stable/how-to/mark.html
- return pytest.mark.cache(test_case)
- ../.dev/lib/python3.12/site-packages/torch/jit/_script.py:1491
- ../.dev/lib/python3.12/site-packages/torch/jit/_script.py:1491
- /home/sayakpaul/.dev/lib/python3.12/site-packages/torch/jit/_script.py:1491: DeprecationWarning: `torch.jit.script` is deprecated. Please switch to `torch.compile` or `torch.export`.
- warnings.warn(
- src/diffusers/utils/testing_utils.py:72
- /home/sayakpaul/diffusers/src/diffusers/utils/testing_utils.py:72: FutureWarning: `diffusers.utils.testing_utils` is deprecated and will be removed in version 1.0.0. diffusers.utils.testing_utils is deprecated and will be removed in a future version. Determinism and device backend utilities have been moved to `diffusers.utils.torch_utils`.
- deprecate(
- ../.dev/lib/python3.12/site-packages/modelopt/torch/__init__.py:36
- /home/sayakpaul/.dev/lib/python3.12/site-packages/modelopt/torch/__init__.py:36: UserWarning: transformers version 5.14.1 is not tested with nvidia-modelopt and may cause issues. Please install recommended version with `pip install nvidia-modelopt[hf]` if working with HF models.
- _warnings.warn(
- tests/testing_utils.py:454
- /home/sayakpaul/diffusers/tests/testing_utils.py:454: PytestUnknownMarkWarning: Unknown pytest.mark.autoround - is this a typo? You can register custom marks to avoid this warning - for details, see https://docs.pytest.org/en/stable/how-to/mark.html
- return pytest.mark.autoround(test_case)
- -- Docs: https://docs.pytest.org/en/stable/how-to/capture-warnings.html
- =========================== short test summary info ============================
- FAILED tests/modular_pipelines/anima/test_modular_pipeline_anima.py::TestAnimaModularPipelineFast::test_pipeline_optional_parameters
- FAILED tests/modular_pipelines/anima/test_modular_pipeline_anima.py::TestAnimaModularPipelineFast::test_pipeline_required_inputs
- FAILED tests/modular_pipelines/anima/test_modular_pipeline_anima.py::TestAnimaImg2ImgModularPipelineFast::test_pipeline_optional_parameters
- FAILED tests/modular_pipelines/anima/test_modular_pipeline_anima.py::TestAnimaImg2ImgModularPipelineFast::test_pipeline_required_inputs
- FAILED tests/modular_pipelines/cosmos/test_modular_pipeline_cosmos3.py::TestCosmos3OmniModularPipelineFast::test_pipeline_optional_parameters
- FAILED tests/modular_pipelines/cosmos/test_modular_pipeline_cosmos3.py::TestCosmos3OmniModularPipelineFast::test_pipeline_required_inputs
- FAILED tests/modular_pipelines/cosmos/test_modular_pipeline_cosmos3_distilled.py::TestCosmos3DistilledModularPipelineFast::test_pipeline_required_inputs
- FAILED tests/modular_pipelines/echo/test_modular_pipeline_echo.py::TestEchoModularPipelineFast::test_pipeline_required_inputs
- FAILED tests/modular_pipelines/ernie_image/test_modular_pipeline_ernie_image.py::TestErnieImageModularPipelineFast::test_pipeline_required_inputs
- FAILED tests/modular_pipelines/flux/test_modular_pipeline_flux.py::TestFluxModularPipelineFast::test_pipeline_required_inputs
- FAILED tests/modular_pipelines/flux/test_modular_pipeline_flux.py::TestFluxImg2ImgModularPipelineFast::test_pipeline_required_inputs
- FAILED tests/modular_pipelines/flux/test_modular_pipeline_flux.py::TestFluxKontextModularPipelineFast::test_pipeline_required_inputs
- FAILED tests/modular_pipelines/flux2/test_modular_pipeline_flux2.py::TestFlux2ModularPipelineFast::test_pipeline_optional_parameters
- FAILED tests/modular_pipelines/flux2/test_modular_pipeline_flux2.py::TestFlux2ModularPipelineFast::test_pipeline_required_inputs
- FAILED tests/modular_pipelines/flux2/test_modular_pipeline_flux2.py::TestFlux2ImageConditionedModularPipelineFast::test_pipeline_optional_parameters
- FAILED tests/modular_pipelines/flux2/test_modular_pipeline_flux2.py::TestFlux2ImageConditionedModularPipelineFast::test_pipeline_required_inputs
- FAILED tests/modular_pipelines/flux2/test_modular_pipeline_flux2_klein.py::TestFlux2KleinModularPipelineFast::test_pipeline_optional_parameters
- FAILED tests/modular_pipelines/flux2/test_modular_pipeline_flux2_klein.py::TestFlux2KleinModularPipelineFast::test_pipeline_required_inputs
- FAILED tests/modular_pipelines/flux2/test_modular_pipeline_flux2_klein.py::TestFlux2KleinImageConditionedModularPipelineFast::test_pipeline_optional_parameters
- FAILED tests/modular_pipelines/flux2/test_modular_pipeline_flux2_klein.py::TestFlux2KleinImageConditionedModularPipelineFast::test_pipeline_required_inputs
- FAILED tests/modular_pipelines/flux2/test_modular_pipeline_flux2_klein_base.py::TestFlux2KleinBaseModularPipelineFast::test_pipeline_optional_parameters
- FAILED tests/modular_pipelines/flux2/test_modular_pipeline_flux2_klein_base.py::TestFlux2KleinBaseModularPipelineFast::test_pipeline_required_inputs
- FAILED tests/modular_pipelines/flux2/test_modular_pipeline_flux2_klein_base.py::TestFlux2KleinBaseImageConditionedModularPipelineFast::test_pipeline_optional_parameters
- FAILED tests/modular_pipelines/flux2/test_modular_pipeline_flux2_klein_base.py::TestFlux2KleinBaseImageConditionedModularPipelineFast::test_pipeline_required_inputs
- FAILED tests/modular_pipelines/flux3/test_modular_pipeline_flux3.py::TestFlux3ModularPipelineFast::test_pipeline_optional_parameters
- FAILED tests/modular_pipelines/flux3/test_modular_pipeline_flux3.py::TestFlux3ModularPipelineFast::test_pipeline_required_inputs
- FAILED tests/modular_pipelines/flux3/test_modular_pipeline_flux3.py::TestFlux3DistilledModularPipelineFast::test_pipeline_optional_parameters
- FAILED tests/modular_pipelines/flux3/test_modular_pipeline_flux3.py::TestFlux3DistilledModularPipelineFast::test_pipeline_required_inputs
- FAILED tests/modular_pipelines/helios/test_modular_pipeline_helios.py::TestHeliosModularPipelineFast::test_pipeline_required_inputs
- FAILED tests/modular_pipelines/helios/test_modular_pipeline_helios.py::TestHeliosPyramidModularPipelineFast::test_pipeline_required_inputs
- FAILED tests/modular_pipelines/hunyuan_video1_5/test_modular_pipeline_hunyuan_video1_5.py::TestHunyuanVideo15ModularPipelineFast::test_pipeline_optional_parameters
- FAILED tests/modular_pipelines/hunyuan_video1_5/test_modular_pipeline_hunyuan_video1_5.py::TestHunyuanVideo15ModularPipelineFast::test_pipeline_required_inputs
- FAILED tests/modular_pipelines/krea2/test_modular_pipeline_krea2.py::TestKrea2ModularPipelineFast::test_pipeline_required_inputs
- FAILED tests/modular_pipelines/krea2/test_modular_pipeline_krea2_turbo.py::TestKrea2TurboModularPipelineFast::test_pipeline_required_inputs
- FAILED tests/modular_pipelines/ltx/test_modular_pipeline_ltx.py::TestLTXModularPipelineFast::test_pipeline_optional_parameters
- FAILED tests/modular_pipelines/ltx/test_modular_pipeline_ltx.py::TestLTXModularPipelineFast::test_pipeline_required_inputs
- FAILED tests/modular_pipelines/ltx2/test_modular_pipeline_ltx2.py::TestLTX2Text2VideoModularPipelineFast::test_pipeline_optional_parameters
- FAILED tests/modular_pipelines/ltx2/test_modular_pipeline_ltx2.py::TestLTX2Text2VideoModularPipelineFast::test_pipeline_required_inputs
- FAILED tests/modular_pipelines/ltx2/test_modular_pipeline_ltx2.py::TestLTX2Image2VideoModularPipelineFast::test_pipeline_optional_parameters
- FAILED tests/modular_pipelines/ltx2/test_modular_pipeline_ltx2.py::TestLTX2Image2VideoModularPipelineFast::test_pipeline_required_inputs
- FAILED tests/modular_pipelines/ltx2/test_modular_pipeline_ltx2.py::TestLTX2ConditionModularPipelineFast::test_pipeline_optional_parameters
- FAILED tests/modular_pipelines/ltx2/test_modular_pipeline_ltx2.py::TestLTX2ConditionModularPipelineFast::test_pipeline_required_inputs
- FAILED tests/modular_pipelines/ltx2/test_modular_pipeline_ltx2.py::TestLTX2InContextModularPipelineFast::test_pipeline_optional_parameters
- FAILED tests/modular_pipelines/ltx2/test_modular_pipeline_ltx2.py::TestLTX2InContextModularPipelineFast::test_pipeline_required_inputs
- FAILED tests/modular_pipelines/ltx2/test_modular_pipeline_ltx25.py::TestLTX25Text2VideoModularPipelineFast::test_pipeline_optional_parameters
- FAILED tests/modular_pipelines/ltx2/test_modular_pipeline_ltx25.py::TestLTX25Text2VideoModularPipelineFast::test_pipeline_required_inputs
- FAILED tests/modular_pipelines/ltx2/test_modular_pipeline_ltx25.py::TestLTX25Image2VideoModularPipelineFast::test_pipeline_optional_parameters
- FAILED tests/modular_pipelines/ltx2/test_modular_pipeline_ltx25.py::TestLTX25Image2VideoModularPipelineFast::test_pipeline_required_inputs
- FAILED tests/modular_pipelines/ltx2/test_modular_pipeline_ltx25.py::TestLTX25ConditionModularPipelineFast::test_pipeline_optional_parameters
- FAILED tests/modular_pipelines/ltx2/test_modular_pipeline_ltx25.py::TestLTX25ConditionModularPipelineFast::test_pipeline_required_inputs
- FAILED tests/modular_pipelines/ltx2/test_modular_pipeline_ltx25.py::TestLTX25InContextModularPipelineFast::test_pipeline_optional_parameters
- FAILED tests/modular_pipelines/ltx2/test_modular_pipeline_ltx25.py::TestLTX25InContextModularPipelineFast::test_pipeline_required_inputs
- FAILED tests/modular_pipelines/minimax_h3/test_modular_pipeline_minimax_h3.py::TestMiniMaxH3ModularPipelineFast::test_pipeline_optional_parameters
- FAILED tests/modular_pipelines/minimax_h3/test_modular_pipeline_minimax_h3.py::TestMiniMaxH3ModularPipelineFast::test_pipeline_required_inputs
- FAILED tests/modular_pipelines/minimax_h3/test_modular_pipeline_minimax_h3.py::TestMiniMaxH3Ref2VAModularPipelineFast::test_pipeline_optional_parameters
- FAILED tests/modular_pipelines/minimax_h3/test_modular_pipeline_minimax_h3.py::TestMiniMaxH3Ref2VAModularPipelineFast::test_pipeline_required_inputs
- FAILED tests/modular_pipelines/qwen/test_modular_pipeline_qwenimage.py::TestQwenImageModularPipelineFast::test_pipeline_optional_parameters
- FAILED tests/modular_pipelines/qwen/test_modular_pipeline_qwenimage.py::TestQwenImageModularPipelineFast::test_pipeline_required_inputs
- FAILED tests/modular_pipelines/qwen/test_modular_pipeline_qwenimage.py::TestQwenImageEditModularPipelineFast::test_pipeline_optional_parameters
- FAILED tests/modular_pipelines/qwen/test_modular_pipeline_qwenimage.py::TestQwenImageEditModularPipelineFast::test_pipeline_required_inputs
- FAILED tests/modular_pipelines/qwen/test_modular_pipeline_qwenimage.py::TestQwenImageEditPlusModularPipelineFast::test_pipeline_required_inputs
- FAILED tests/modular_pipelines/qwenimage21/test_modular_pipeline_qwenimage21.py::TestQwenImage21ModularPipelineFast::test_pipeline_optional_parameters
- FAILED tests/modular_pipelines/qwenimage21/test_modular_pipeline_qwenimage21.py::TestQwenImage21ModularPipelineFast::test_pipeline_required_inputs
- FAILED tests/modular_pipelines/qwenimage21/test_modular_pipeline_qwenimage21.py::TestQwenImage21ImageConditionedModularPipelineFast::test_pipeline_optional_parameters
- FAILED tests/modular_pipelines/qwenimage21/test_modular_pipeline_qwenimage21.py::TestQwenImage21ImageConditionedModularPipelineFast::test_pipeline_required_inputs
- FAILED tests/modular_pipelines/qwenimage21/test_modular_pipeline_qwenimage21_turbo.py::TestQwenImage21TurboModularPipelineFast::test_pipeline_optional_parameters
- FAILED tests/modular_pipelines/qwenimage21/test_modular_pipeline_qwenimage21_turbo.py::TestQwenImage21TurboModularPipelineFast::test_pipeline_required_inputs
- FAILED tests/modular_pipelines/qwenimage21/test_modular_pipeline_qwenimage21_turbo.py::TestQwenImage21TurboImageConditionedModularPipelineFast::test_pipeline_optional_parameters
- FAILED tests/modular_pipelines/qwenimage21/test_modular_pipeline_qwenimage21_turbo.py::TestQwenImage21TurboImageConditionedModularPipelineFast::test_pipeline_required_inputs
- FAILED tests/modular_pipelines/stable_diffusion_3/test_modular_pipeline_stable_diffusion_3.py::TestStableDiffusion3ModularPipelineFast::test_pipeline_optional_parameters
- FAILED tests/modular_pipelines/stable_diffusion_3/test_modular_pipeline_stable_diffusion_3.py::TestStableDiffusion3ModularPipelineFast::test_pipeline_required_inputs
- FAILED tests/modular_pipelines/stable_diffusion_3/test_modular_pipeline_stable_diffusion_3.py::TestStableDiffusion3Img2ImgModularPipelineFast::test_pipeline_optional_parameters
- FAILED tests/modular_pipelines/stable_diffusion_3/test_modular_pipeline_stable_diffusion_3.py::TestStableDiffusion3Img2ImgModularPipelineFast::test_pipeline_required_inputs
- FAILED tests/modular_pipelines/stable_diffusion_xl/test_modular_pipeline_stable_diffusion_xl.py::TestSDXLModularPipelineFast::test_pipeline_optional_parameters
- FAILED tests/modular_pipelines/stable_diffusion_xl/test_modular_pipeline_stable_diffusion_xl.py::TestSDXLModularPipelineFast::test_pipeline_required_inputs
- FAILED tests/modular_pipelines/stable_diffusion_xl/test_modular_pipeline_stable_diffusion_xl.py::TestSDXLImg2ImgModularPipelineFast::test_pipeline_optional_parameters
- FAILED tests/modular_pipelines/stable_diffusion_xl/test_modular_pipeline_stable_diffusion_xl.py::TestSDXLImg2ImgModularPipelineFast::test_pipeline_required_inputs
- FAILED tests/modular_pipelines/wan/test_modular_pipeline_wan.py::TestWanModularPipelineFast::test_pipeline_required_inputs
- FAILED tests/modular_pipelines/wan/test_modular_pipeline_wan_vace.py::TestWan22VaceModularPipelineFast::test_pipeline_required_inputs
- FAILED tests/modular_pipelines/wan_animate_2/test_modular_pipeline_wan_animate_2.py::TestWanAnimate2ModularPipelineFast::test_pipeline_required_inputs
- FAILED tests/modular_pipelines/wan_animate_2/test_modular_pipeline_wan_animate_2.py::TestWanAnimate2DistilledModularPipelineFast::test_pipeline_required_inputs
- FAILED tests/modular_pipelines/z_image/test_modular_pipeline_z_image.py::TestZImageModularPipelineFast::test_pipeline_optional_parameters
- FAILED tests/modular_pipelines/z_image/test_modular_pipeline_z_image.py::TestZImageModularPipelineFast::test_pipeline_required_inputs
- ========= 83 failed, 67 passed, 1508 deselected, 22 warnings in 46.33s =========
- sys:1: DeprecationWarning: builtin type swigvarlink has no __module__ attribute
Advertisement