FriedrichLP

Untitled

Jan 12th, 2019
243
0
Never
Not a member of Pastebin yet? Sign Up, it unlocks many cool features!
text 4.69 KB | None | 0 0
  1. 13:55:44.561 [DEBUG] [org.gradle.model.internal.registry.DefaultModelRegistry] Project : - Transitioning model element 'tasks' to state SelfClosed.
  2. 13:55:44.567 [DEBUG] [org.gradle.model.internal.registry.DefaultModelRegistry] Project : - Transitioning model element 'tasks' from state SelfClosed to SelfClosed
  3. 13:55:44.568 [DEBUG] [org.gradle.model.internal.registry.DefaultModelRegistry] Project : - Transitioning model element 'tasks' from state SelfClosed to SelfClosed
  4. 13:55:44.578 [ERROR] [org.gradle.BuildExceptionReporter]
  5. 13:55:44.578 [ERROR] [org.gradle.BuildExceptionReporter] FAILURE: Build failed with an exception.
  6. 13:55:44.578 [ERROR] [org.gradle.BuildExceptionReporter]
  7. 13:55:44.579 [ERROR] [org.gradle.BuildExceptionReporter] * What went wrong:
  8. 13:55:44.579 [ERROR] [org.gradle.BuildExceptionReporter] Task 'and' not found in root project 'trainsa-server-core'.
  9. 13:55:44.579 [ERROR] [org.gradle.BuildExceptionReporter]
  10. 13:55:44.579 [ERROR] [org.gradle.BuildExceptionReporter] * Try:
  11. 13:55:44.579 [ERROR] [org.gradle.BuildExceptionReporter] Run gradlew tasks to get a list of available tasks. Run with --stacktrace option to get the stack trace.
  12. 13:55:44.580 [LIFECYCLE] [org.gradle.BuildResultLogger]
  13. 13:55:44.580 [LIFECYCLE] [org.gradle.BuildResultLogger] BUILD FAILED
  14. 13:55:44.580 [LIFECYCLE] [org.gradle.BuildResultLogger]
  15. 13:55:44.580 [LIFECYCLE] [org.gradle.BuildResultLogger] Total time: 7.444 secs
  16. 13:55:44.589 [DEBUG] [org.gradle.api.internal.artifacts.ivyservice.resolveengine.store.CachedStoreFactory] Resolution result cache closed. Cache reads: 1, disk reads: 1 (avg: 0.004 secs, total: 0.004 secs)
  17. 13:55:44.589 [DEBUG] [org.gradle.api.internal.artifacts.ivyservice.resolveengine.store.CachedStoreFactory] Resolution result cache closed. Cache reads: 0, disk reads: 0 (avg: 0.0 secs, total: 0.0 secs)
  18. 13:55:44.590 [DEBUG] [org.gradle.api.internal.artifacts.ivyservice.resolveengine.store.ResolutionResultsStoreFactory] Deleted 2 resolution results binary files in 0.001 secs
  19. 13:55:44.590 [DEBUG] [org.gradle.api.internal.artifacts.ivyservice.ivyresolve.memcache.InMemoryCachedRepositoryFactory] In-memory dependency metadata cache closed. Repos cached: 16, cache instances: 8, modules served from cache: 0, artifacts: 0
  20. 13:55:44.591 [DEBUG] [org.gradle.cache.internal.btree.BTreePersistentIndexedCache] Closing cache module-metadata.bin (C:\Users\FriedrichLP\.gradle\caches\modules-2\metadata-2.16\module-metadata.bin)
  21. 13:55:44.592 [DEBUG] [org.gradle.cache.internal.btree.BTreePersistentIndexedCache] Closing cache artifact-at-repository.bin (C:\Users\FriedrichLP\.gradle\caches\modules-2\metadata-2.16\artifact-at-repository.bin)
  22. 13:55:44.592 [DEBUG] [org.gradle.cache.internal.DefaultFileLockManager] Releasing lock on artifact cache (C:\Users\FriedrichLP\.gradle\caches\modules-2).
  23. 13:55:44.597 [DEBUG] [org.gradle.cache.internal.DefaultCacheAccess] Cache Generated Gradle JARs cache (C:\Users\FriedrichLP\.gradle\caches\2.14\generated-gradle-jars) was closed 0 times.
  24. 13:55:44.598 [DEBUG] [org.gradle.cache.internal.DefaultCacheAccess] Cache Plugin Resolution Cache (C:\Users\FriedrichLP\.gradle\caches\2.14\plugin-resolution) was closed 0 times.
  25. 13:55:44.598 [DEBUG] [org.gradle.api.internal.tasks.compile.daemon.CompilerDaemonManager] Stopping 0 compiler daemon(s).
  26. 13:55:44.598 [INFO] [org.gradle.api.internal.tasks.compile.daemon.CompilerDaemonManager] Stopped 0 compiler daemon(s).
  27. 13:55:44.598 [DEBUG] [org.gradle.launcher.daemon.server.exec.ExecuteBuild] The daemon has finished executing the build.
  28. 13:55:44.827 [DEBUG] [org.gradle.launcher.daemon.client.DaemonClientInputForwarder] Dispatching close input message: org.gradle.launcher.daemon.protocol.CloseInput@6196ff50
  29. 13:55:44.887 [DEBUG] [org.gradle.launcher.daemon.client.DaemonClientConnection] thread 19: dispatching class org.gradle.launcher.daemon.protocol.CloseInput
  30. 13:55:44.888 [INFO] [org.gradle.launcher.daemon.client.DaemonClient] Received result Failure[value=org.gradle.initialization.ReportedException: org.gradle.internal.exceptions.LocationAwareException: Task 'and' not found in root project 'trainsa-server-core'.] from daemon DaemonInfo{pid=11612, address=[5c9294ff-4de9-4c69-85d8-29d95f00adbb port:54073, addresses:[/127.0.0.1, /0:0:0:0:0:0:0:1]], idle=false, lastBusy=1547297738691, context=DefaultDaemonContext[uid=cd13c2e4-b9e5-4179-a315-c8c8da317be2,javaHome=C:\Program Files\Java\jdk1.8.0_144,daemonRegistryDir=C:\Users\FriedrichLP\.gradle\daemon,pid=11612,idleTimeout=120000,daemonOpts=-Xmx3G,-Dfile.encoding=windows-1252,-Duser.country=DE,-Duser.language=de,-Duser.variant]} (build should be done).
  31. 13:55:44.888 [DEBUG] [org.gradle.launcher.daemon.client.DaemonClientConnection] thread 1: dispatching class org.gradle.launcher.daemon.protocol.Finished
Advertisement
Add Comment
Please, Sign In to add comment