Advertisement
obiman

build.out - last 500 lines

Jan 10th, 2019
118
0
Never
Not a member of Pastebin yet? Sign Up, it unlocks many cool features!
text 34.81 KB | None | 0 0
  1. [ 73%] Building CXX object interpreter/llvm/src/lib/IR/CMakeFiles/LLVMCore.dir/ValueSymbolTable.cpp.o
  2. [ 73%] Building CXX object core/meta/CMakeFiles/Meta.dir/src/TGenericClassInfo.cxx.o
  3. [ 73%] Building CXX object interpreter/llvm/src/lib/IR/CMakeFiles/LLVMCore.dir/ValueTypes.cpp.o
  4. [ 73%] Building CXX object interpreter/llvm/src/lib/IR/CMakeFiles/LLVMCore.dir/Verifier.cpp.o
  5. [ 73%] Building CXX object core/meta/CMakeFiles/Meta.dir/src/TGlobal.cxx.o
  6. [ 73%] Building CXX object core/meta/CMakeFiles/Meta.dir/src/TInterpreter.cxx.o
  7. [ 73%] Building CXX object core/meta/CMakeFiles/Meta.dir/src/TIsAProxy.cxx.o
  8. [ 73%] Building CXX object interpreter/llvm/src/tools/cling/lib/Interpreter/CMakeFiles/obj.clingInterpreter.dir/ValueExtractionSynthesizer.cpp.o
  9. [ 73%] Building CXX object core/meta/CMakeFiles/Meta.dir/src/TListOfDataMembers.cxx.o
  10. [ 73%] Building CXX object interpreter/llvm/src/lib/Target/X86/CMakeFiles/LLVMX86CodeGen.dir/X86TargetMachine.cpp.o
  11. [ 73%] Building CXX object core/meta/CMakeFiles/Meta.dir/src/TListOfEnums.cxx.o
  12. [ 73%] Building CXX object core/meta/CMakeFiles/Meta.dir/src/TListOfEnumsWithLock.cxx.o
  13. [ 73%] Building CXX object core/meta/CMakeFiles/Meta.dir/src/TListOfFunctionTemplates.cxx.o
  14. [ 73%] Building CXX object core/meta/CMakeFiles/Meta.dir/src/TListOfFunctions.cxx.o
  15. [ 73%] Building CXX object core/meta/CMakeFiles/Meta.dir/src/TMethod.cxx.o
  16. [ 73%] Building CXX object interpreter/llvm/src/tools/cling/lib/Interpreter/CMakeFiles/obj.clingInterpreter.dir/Value.cpp.o
  17. [ 73%] Building CXX object core/meta/CMakeFiles/Meta.dir/src/TMethodArg.cxx.o
  18. [ 73%] Building CXX object core/meta/CMakeFiles/Meta.dir/src/TMethodCall.cxx.o
  19. [ 73%] Building CXX object interpreter/llvm/src/lib/Target/X86/CMakeFiles/LLVMX86CodeGen.dir/X86TargetObjectFile.cpp.o
  20. [ 73%] Building CXX object core/meta/CMakeFiles/Meta.dir/src/TProtoClass.cxx.o
  21. [ 73%] Linking CXX static library ../libLLVMCore.a
  22. [ 73%] Building CXX object core/meta/CMakeFiles/Meta.dir/src/TRealData.cxx.o
  23. [ 73%] Built target LLVMCore
  24. [ 73%] Building CXX object interpreter/llvm/src/lib/Target/X86/CMakeFiles/LLVMX86CodeGen.dir/X86TargetTransformInfo.cpp.o
  25. [ 73%] Building CXX object core/meta/CMakeFiles/Meta.dir/src/TSchemaRule.cxx.o
  26. [ 73%] Building CXX object interpreter/llvm/src/tools/cling/lib/Interpreter/CMakeFiles/obj.clingInterpreter.dir/ValuePrinter.cpp.o
  27. Scanning dependencies of target TextInput
  28. [ 73%] Building CXX object core/textinput/CMakeFiles/TextInput.dir/src/Getline.cxx.o
  29. [ 73%] Building CXX object core/textinput/CMakeFiles/TextInput.dir/src/Getline_color.cxx.o
  30. [ 73%] Building CXX object core/meta/CMakeFiles/Meta.dir/src/TSchemaRuleSet.cxx.o
  31. [ 73%] Building CXX object core/textinput/CMakeFiles/TextInput.dir/src/textinput/Editor.cpp.o
  32. [ 73%] Building CXX object core/meta/CMakeFiles/Meta.dir/src/TStatusBitsChecker.cxx.o
  33. [ 73%] Building CXX object interpreter/llvm/src/lib/Target/X86/CMakeFiles/LLVMX86CodeGen.dir/X86VZeroUpper.cpp.o
  34. [ 73%] Building CXX object core/textinput/CMakeFiles/TextInput.dir/src/textinput/History.cpp.o
  35. [ 73%] Building CXX object core/meta/CMakeFiles/Meta.dir/src/TStreamerElement.cxx.o
  36. [ 73%] Building CXX object core/textinput/CMakeFiles/TextInput.dir/src/textinput/KeyBinding.cpp.o
  37. [ 73%] Building CXX object interpreter/llvm/src/tools/cling/lib/Interpreter/CMakeFiles/obj.clingInterpreter.dir/ValuePrinterSynthesizer.cpp.o
  38. [ 73%] Building CXX object core/textinput/CMakeFiles/TextInput.dir/src/textinput/Range.cpp.o
  39. [ 74%] Building CXX object core/textinput/CMakeFiles/TextInput.dir/src/textinput/SignalHandler.cpp.o
  40. [ 74%] Building CXX object core/textinput/CMakeFiles/TextInput.dir/src/textinput/StreamReader.cpp.o
  41. [ 74%] Building CXX object core/meta/CMakeFiles/Meta.dir/src/TToggle.cxx.o
  42. [ 74%] Building CXX object core/textinput/CMakeFiles/TextInput.dir/src/textinput/StreamReaderUnix.cpp.o
  43. [ 74%] Building CXX object core/meta/CMakeFiles/Meta.dir/src/TToggleGroup.cxx.o
  44. [ 74%] Building CXX object core/meta/CMakeFiles/Meta.dir/src/TViewPubDataMembers.cxx.o
  45. [ 74%] Building CXX object core/textinput/CMakeFiles/TextInput.dir/src/textinput/StreamReaderWin.cpp.o
  46. [ 74%] Building CXX object interpreter/llvm/src/lib/Target/X86/CMakeFiles/LLVMX86CodeGen.dir/X86WinAllocaExpander.cpp.o
  47. [ 74%] Building CXX object core/textinput/CMakeFiles/TextInput.dir/src/textinput/TerminalConfigUnix.cpp.o
  48. [ 74%] Building CXX object core/textinput/CMakeFiles/TextInput.dir/src/textinput/TerminalDisplay.cpp.o
  49. [ 74%] Building CXX object core/textinput/CMakeFiles/TextInput.dir/src/textinput/TerminalDisplayUnix.cpp.o
  50. [ 74%] Building CXX object core/meta/CMakeFiles/Meta.dir/src/TViewPubFunctions.cxx.o
  51. [ 74%] Building CXX object core/textinput/CMakeFiles/TextInput.dir/src/textinput/TerminalDisplayWin.cpp.o
  52. [ 74%] Building CXX object core/meta/CMakeFiles/Meta.dir/src/TVirtualStreamerInfo.cxx.o
  53. [ 74%] Building CXX object core/textinput/CMakeFiles/TextInput.dir/src/textinput/TextInput.cpp.o
  54. [ 74%] Building CXX object core/textinput/CMakeFiles/TextInput.dir/src/textinput/TextInputContext.cpp.o
  55. [ 74%] Built target obj.clingInterpreter
  56. [ 74%] Built target Meta
  57. [ 74%] Building CXX object interpreter/llvm/src/lib/Target/X86/CMakeFiles/LLVMX86CodeGen.dir/X86WinEHState.cpp.o
  58. [ 74%] Building CXX object interpreter/llvm/src/lib/Target/X86/CMakeFiles/LLVMX86CodeGen.dir/X86CallingConv.cpp.o
  59. [ 74%] Built target TextInput
  60. [ 74%] Building CXX object interpreter/llvm/src/lib/Target/X86/CMakeFiles/LLVMX86CodeGen.dir/X86CallLowering.cpp.o
  61. Scanning dependencies of target Zip
  62. [ 74%] Building C object core/zip/CMakeFiles/Zip.dir/src/Bits.c.o
  63. [ 74%] Building C object core/zip/CMakeFiles/Zip.dir/src/ZDeflate.c.o
  64. [ 74%] Building C object core/zip/CMakeFiles/Zip.dir/src/ZTrees.c.o
  65. [ 74%] Building C object core/zip/CMakeFiles/Zip.dir/src/ZInflate.c.o
  66. [ 74%] Building CXX object core/zip/CMakeFiles/Zip.dir/src/Compression.cxx.o
  67. [ 74%] Building CXX object core/zip/CMakeFiles/Zip.dir/src/RZip.cxx.o
  68. [ 74%] Built target Zip
  69. [ 74%] Building CXX object interpreter/llvm/src/lib/Target/X86/CMakeFiles/LLVMX86CodeGen.dir/X86LegalizerInfo.cpp.o
  70. Scanning dependencies of target Lzma
  71. [ 74%] Building C object core/lzma/CMakeFiles/Lzma.dir/src/ZipLZMA.c.o
  72. [ 74%] Built target Lzma
  73. [ 74%] Building CXX object interpreter/llvm/src/lib/Target/X86/CMakeFiles/LLVMX86CodeGen.dir/X86RegisterBankInfo.cpp.o
  74. Scanning dependencies of target Lz4
  75. [ 74%] Building CXX object core/lz4/CMakeFiles/Lz4.dir/src/ZipLZ4.cxx.o
  76. [ 74%] Built target Lz4
  77. [ 74%] Building CXX object interpreter/llvm/src/lib/Target/X86/CMakeFiles/LLVMX86CodeGen.dir/X86InstructionSelector.cpp.o
  78. Scanning dependencies of target Unix
  79. Scanning dependencies of target Macosx
  80. [ 74%] Building CXX object core/unix/CMakeFiles/Unix.dir/src/TUnixSystem.cxx.o
  81. [ 74%] Building CXX object core/macosx/CMakeFiles/Macosx.dir/src/CocoaUtils.mm.o
  82. [ 74%] Building CXX object core/macosx/CMakeFiles/Macosx.dir/src/TMacOSXSystem.mm.o
  83. Scanning dependencies of target RootPcmObjs
  84. [ 74%] Building CXX object io/rootpcm/CMakeFiles/RootPcmObjs.dir/src/rootclingIO.cxx.o
  85. [ 74%] Built target Unix
  86. [ 74%] Built target RootPcmObjs
  87. Scanning dependencies of target mathtext
  88. [ 74%] Building CXX object graf2d/mathtext/CMakeFiles/mathtext.dir/src/fontembed.cxx.o
  89. Scanning dependencies of target GLEW
  90. [ 74%] Building C object graf3d/glew/CMakeFiles/GLEW.dir/src/glew.c.o
  91. [ 74%] Built target Macosx
  92. [ 74%] Building CXX object graf2d/mathtext/CMakeFiles/mathtext.dir/src/fontembedps.cxx.o
  93. Scanning dependencies of target FTGL
  94. [ 74%] Building CXX object graf2d/mathtext/CMakeFiles/mathtext.dir/src/mathrender.cxx.o
  95. [ 74%] Building CXX object graf3d/ftgl/CMakeFiles/FTGL.dir/src/FTBitmapGlyph.cxx.o
  96. [ 74%] Building CXX object graf3d/ftgl/CMakeFiles/FTGL.dir/src/FTCharmap.cxx.o
  97. [ 74%] Building CXX object graf3d/ftgl/CMakeFiles/FTGL.dir/src/FTContour.cxx.o
  98. [ 74%] Building CXX object graf3d/ftgl/CMakeFiles/FTGL.dir/src/FTExtrdGlyph.cxx.o
  99. [ 74%] Building CXX object graf2d/mathtext/CMakeFiles/mathtext.dir/src/mathrenderstyle.cxx.o
  100. [ 74%] Building CXX object graf3d/ftgl/CMakeFiles/FTGL.dir/src/FTFace.cxx.o
  101. [ 74%] Building CXX object graf3d/ftgl/CMakeFiles/FTGL.dir/src/FTFont.cxx.o
  102. [ 74%] Building CXX object graf3d/ftgl/CMakeFiles/FTGL.dir/src/FTGLBitmapFont.cxx.o
  103. [ 74%] Building CXX object graf2d/mathtext/CMakeFiles/mathtext.dir/src/mathrendertoken.cxx.o
  104. [ 74%] Building CXX object graf3d/ftgl/CMakeFiles/FTGL.dir/src/FTGLExtrdFont.cxx.o
  105. [ 74%] Linking CXX static library ../../libLLVMX86CodeGen.a
  106. [ 74%] Building CXX object graf3d/ftgl/CMakeFiles/FTGL.dir/src/FTGLOutlineFont.cxx.o
  107. [ 74%] Built target LLVMX86CodeGen
  108. [ 74%] Building CXX object graf2d/mathtext/CMakeFiles/mathtext.dir/src/mathtext.cxx.o
  109. [ 74%] Building CXX object graf3d/ftgl/CMakeFiles/FTGL.dir/src/FTGLPixmapFont.cxx.o
  110. [ 74%] Building CXX object graf3d/ftgl/CMakeFiles/FTGL.dir/src/FTGLPolygonFont.cxx.o
  111. [ 74%] Building CXX object graf3d/ftgl/CMakeFiles/FTGL.dir/src/FTGLTextureFont.cxx.o
  112. [ 74%] Building CXX object graf3d/ftgl/CMakeFiles/FTGL.dir/src/FTGlyph.cxx.o
  113. Scanning dependencies of target root
  114. [ 74%] Building CXX object graf3d/ftgl/CMakeFiles/FTGL.dir/src/FTGlyphContainer.cxx.o
  115. [ 74%] Building CXX object rootx/CMakeFiles/root.dir/src/rootx.cxx.o
  116. [ 74%] Building CXX object graf3d/ftgl/CMakeFiles/FTGL.dir/src/FTLibrary.cxx.o
  117. [ 74%] Building CXX object graf3d/ftgl/CMakeFiles/FTGL.dir/src/FTOutlineGlyph.cxx.o
  118. [ 74%] Building CXX object graf2d/mathtext/CMakeFiles/mathtext.dir/src/mathtextencode.cxx.o
  119. [ 74%] Building CXX object rootx/CMakeFiles/root.dir/src/rootxx-cocoa.mm.o
  120. [ 74%] Building CXX object graf3d/ftgl/CMakeFiles/FTGL.dir/src/FTPixmapGlyph.cxx.o
  121. [ 74%] Building CXX object graf3d/ftgl/CMakeFiles/FTGL.dir/src/FTPoint.cxx.o
  122. [ 74%] Building CXX object graf3d/ftgl/CMakeFiles/FTGL.dir/src/FTPolyGlyph.cxx.o
  123. [ 74%] Building CXX object graf3d/ftgl/CMakeFiles/FTGL.dir/src/FTSize.cxx.o
  124. [ 74%] Building CXX object graf2d/mathtext/CMakeFiles/mathtext.dir/src/mathtextparse.cxx.o
  125. [ 74%] Building CXX object graf3d/ftgl/CMakeFiles/FTGL.dir/src/FTTextureGlyph.cxx.o
  126. [ 74%] Building CXX object graf3d/ftgl/CMakeFiles/FTGL.dir/src/FTVectoriser.cxx.o
  127. [ 74%] Linking CXX shared library ../../lib/libFTGL.so
  128. [ 74%] Built target FTGL
  129. [ 74%] Building CXX object graf2d/mathtext/CMakeFiles/mathtext.dir/src/mathtextview.cxx.o
  130. Scanning dependencies of target rmkdepend
  131. [ 74%] Linking CXX executable ../bin/root
  132. [ 74%] Building CXX object build/CMakeFiles/rmkdepend.dir/rmkdepend/mainroot.cxx.o
  133. [ 74%] Linking CXX static library ../../lib/libmathtext.a
  134. [ 74%] Built target root
  135. [ 74%] Building C object build/CMakeFiles/rmkdepend.dir/rmkdepend/cppsetup.c.o
  136. [ 74%] Built target mathtext
  137. [ 74%] Building C object build/CMakeFiles/rmkdepend.dir/rmkdepend/ifparser.c.o
  138. Scanning dependencies of target rsa
  139. [ 74%] Building CXX object net/auth/CMakeFiles/rsa.dir/src/rsaaux.cxx.o
  140. [ 74%] Building C object build/CMakeFiles/rmkdepend.dir/rmkdepend/include.c.o
  141. Scanning dependencies of target rpdutil
  142. [ 74%] Building CXX object net/rpdutils/CMakeFiles/rpdutil.dir/src/daemon.cxx.o
  143. [ 74%] Building C object build/CMakeFiles/rmkdepend.dir/rmkdepend/main.c.o
  144. [ 74%] Building C object build/CMakeFiles/rmkdepend.dir/rmkdepend/parse.c.o
  145. [ 74%] Building CXX object net/auth/CMakeFiles/rsa.dir/src/rsalib.cxx.o
  146. [ 74%] Building CXX object net/rpdutils/CMakeFiles/rpdutil.dir/src/error.cxx.o
  147. [ 74%] Building CXX object net/auth/CMakeFiles/rsa.dir/src/rsafun.cxx.o
  148. [ 74%] Building C object build/CMakeFiles/rmkdepend.dir/rmkdepend/pr.c.o
  149. [ 74%] Linking CXX static library ../../lib/librsa.a
  150. [ 74%] Linking CXX executable ../bin/rmkdepend
  151. [ 74%] Built target rsa
  152. [ 74%] Building CXX object net/rpdutils/CMakeFiles/rpdutil.dir/src/net.cxx.o
  153. Scanning dependencies of target ssh2rpd
  154. [ 74%] Built target rmkdepend
  155. [ 74%] Building CXX object main/CMakeFiles/ssh2rpd.dir/src/ssh2rpd.cxx.o
  156. [ 74%] Building CXX object net/rpdutils/CMakeFiles/rpdutil.dir/src/netpar.cxx.o
  157. [ 74%] Building C object main/CMakeFiles/ssh2rpd.dir/__/core/clib/src/strlcpy.c.o
  158. [ 74%] Building CXX object net/rpdutils/CMakeFiles/rpdutil.dir/src/rpdutils.cxx.o
  159. Scanning dependencies of target Foundation_Stage1
  160. [ 74%] Linking CXX executable ../bin/ssh2rpd
  161. [ 74%] Building CXX object core/foundation/CMakeFiles/Foundation_Stage1.dir/src/RConversionRuleParser.cxx.o
  162. [ 74%] Built target ssh2rpd
  163. [ 74%] Building CXX object net/rpdutils/CMakeFiles/rpdutil.dir/src/ssh.cxx.o
  164. [ 74%] Building CXX object core/foundation/CMakeFiles/Foundation_Stage1.dir/src/TClassEdit.cxx.o
  165. [ 74%] Linking CXX static library ../../lib/librpdutil.a
  166. [ 74%] Built target rpdutil
  167. Scanning dependencies of target clingUtils
  168. [ 74%] Linking CXX static library ../../../../lib/libclingUtils.a
  169. [ 74%] Built target clingUtils
  170. Scanning dependencies of target clingInterpreter
  171. [ 74%] Linking CXX static library ../../../../lib/libclingInterpreter.a
  172. [ 74%] Built target clingInterpreter
  173. Scanning dependencies of target rootd
  174. [ 74%] Building CXX object net/rootd/CMakeFiles/rootd.dir/src/rootd.cxx.o
  175. [ 74%] Building C object net/rootd/CMakeFiles/rootd.dir/__/__/core/clib/src/strlcpy.c.o
  176. [ 74%] Linking CXX executable ../../bin/rootd
  177. [ 74%] Built target rootd
  178. Scanning dependencies of target CLING
  179. [ 74%] Built target CLING
  180. Scanning dependencies of target LLVMRES
  181. [ 74%] Copying LLVM resource and header files
  182. [ 74%] Built target Foundation_Stage1
  183. Scanning dependencies of target ClingUtils
  184. [ 74%] Building CXX object core/clingutils/CMakeFiles/ClingUtils.dir/src/RStl.cxx.o
  185. [ 74%] Built target LLVMRES
  186. [ 74%] Building CXX object core/clingutils/CMakeFiles/ClingUtils.dir/src/TClingUtils.cxx.o
  187. Scanning dependencies of target Dictgen
  188. [ 74%] Building CXX object core/dictgen/CMakeFiles/Dictgen.dir/src/BaseSelectionRule.cxx.o
  189. [ 74%] Building CXX object core/dictgen/CMakeFiles/Dictgen.dir/src/ClassSelectionRule.cxx.o
  190. Scanning dependencies of target MetaCling
  191. [ 74%] Building CXX object core/metacling/src/CMakeFiles/MetaCling.dir/TCling.cxx.o
  192. [ 74%] Building CXX object core/dictgen/CMakeFiles/Dictgen.dir/src/DictSelectionReader.cxx.o
  193. [ 74%] Linking C shared library ../../lib/libGLEW.so
  194. [ 74%] Built target GLEW
  195. [ 74%] Building CXX object core/metacling/src/CMakeFiles/MetaCling.dir/TClingBaseClassInfo.cxx.o
  196. [ 74%] Built target ClingUtils
  197. [ 74%] Building CXX object core/dictgen/CMakeFiles/Dictgen.dir/src/LinkdefReader.cxx.o
  198. [ 74%] Building CXX object core/dictgen/CMakeFiles/Dictgen.dir/src/Scanner.cxx.o
  199. [ 74%] Building CXX object core/metacling/src/CMakeFiles/MetaCling.dir/TClingCallFunc.cxx.o
  200. [ 74%] Building CXX object core/metacling/src/CMakeFiles/MetaCling.dir/TClingCallbacks.cxx.o
  201. [ 74%] Building CXX object core/dictgen/CMakeFiles/Dictgen.dir/src/SelectionRules.cxx.o
  202. [ 74%] Building CXX object core/metacling/src/CMakeFiles/MetaCling.dir/TClingClassInfo.cxx.o
  203. [ 74%] Building CXX object core/dictgen/CMakeFiles/Dictgen.dir/src/TModuleGenerator.cxx.o
  204. [ 74%] Building CXX object core/metacling/src/CMakeFiles/MetaCling.dir/TClingDataMemberInfo.cxx.o
  205. [ 74%] Building CXX object core/dictgen/CMakeFiles/Dictgen.dir/src/VariableSelectionRule.cxx.o
  206. [ 74%] Building CXX object core/dictgen/CMakeFiles/Dictgen.dir/src/XMLReader.cxx.o
  207. [ 74%] Building CXX object core/dictgen/CMakeFiles/Dictgen.dir/src/rootcling_impl.cxx.o
  208. [ 74%] Building CXX object core/metacling/src/CMakeFiles/MetaCling.dir/TClingMethodArgInfo.cxx.o
  209. [ 74%] Building CXX object core/metacling/src/CMakeFiles/MetaCling.dir/TClingMethodInfo.cxx.o
  210. [ 74%] Building CXX object core/metacling/src/CMakeFiles/MetaCling.dir/TClingTypeInfo.cxx.o
  211. [ 74%] Building CXX object core/metacling/src/CMakeFiles/MetaCling.dir/TClingTypedefInfo.cxx.o
  212. [ 74%] Building CXX object core/metacling/src/CMakeFiles/MetaCling.dir/TClingValue.cxx.o
  213. [ 74%] Building CXX object core/metacling/src/CMakeFiles/MetaCling.dir/rootclingTCling.cxx.o
  214. [ 74%] Built target MetaCling
  215. [ 74%] Built target Dictgen
  216. [ 74%] Generating dummy.cxx
  217. Scanning dependencies of target rootcling_stage1
  218. [ 74%] Building CXX object core/rootcling_stage1/CMakeFiles/rootcling_stage1.dir/src/rootcling_stage1.cxx.o
  219. Scanning dependencies of target Cling
  220. [ 74%] Building CXX object core/metacling/src/CMakeFiles/Cling.dir/dummy.cxx.o
  221. [ 74%] Linking CXX shared library ../../../lib/libCling.so
  222. [ 74%] Linking CXX executable src/rootcling_stage1
  223. [ 74%] Built target rootcling_stage1
  224. [ 74%] Built target Cling
  225. Scanning dependencies of target G__Core
  226. [ 74%] Generating G__Core.cxx, ../../lib/libCore.rootmap
  227. In file included from input_line_5:1:
  228. In file included from /Applications/Scientific/cern-root/root-v6-14-08-build/include/Rtypes.h:26:
  229. In file included from /Applications/Scientific/cern-root/root-v6-14-08-build/include/snprintf.h:14:
  230. In file included from /usr/include/stdio.h:64:
  231. /usr/include/_stdio.h:93:16: warning: pointer is missing a nullability type specifier (_Nonnull, _Nullable, or _Null_unspecified) [-Wnullability-completeness]
  232. unsigned char *_base;
  233. ^
  234. /usr/include/_stdio.h:93:16: note: insert '_Nullable' if the pointer may be null
  235. unsigned char *_base;
  236. ^
  237. _Nullable
  238. /usr/include/_stdio.h:93:16: note: insert '_Nonnull' if the pointer should never be null
  239. unsigned char *_base;
  240. ^
  241. _Nonnull
  242. /usr/include/_stdio.h:138:32: warning: pointer is missing a nullability type specifier (_Nonnull, _Nullable, or _Null_unspecified) [-Wnullability-completeness]
  243. int (* _Nullable _read) (void *, char *, int);
  244. ^
  245. /usr/include/_stdio.h:138:32: note: insert '_Nullable' if the pointer may be null
  246. int (* _Nullable _read) (void *, char *, int);
  247. ^
  248. _Nullable
  249. /usr/include/_stdio.h:138:32: note: insert '_Nonnull' if the pointer should never be null
  250. int (* _Nullable _read) (void *, char *, int);
  251. ^
  252. _Nonnull
  253. /usr/include/_stdio.h:138:40: warning: pointer is missing a nullability type specifier (_Nonnull, _Nullable, or _Null_unspecified) [-Wnullability-completeness]
  254. int (* _Nullable _read) (void *, char *, int);
  255. ^
  256. /usr/include/_stdio.h:138:40: note: insert '_Nullable' if the pointer may be null
  257. int (* _Nullable _read) (void *, char *, int);
  258. ^
  259. _Nullable
  260. /usr/include/_stdio.h:138:40: note: insert '_Nonnull' if the pointer should never be null
  261. int (* _Nullable _read) (void *, char *, int);
  262. ^
  263. _Nonnull
  264. /usr/include/_stdio.h:139:35: warning: pointer is missing a nullability type specifier (_Nonnull, _Nullable, or _Null_unspecified) [-Wnullability-completeness]
  265. fpos_t (* _Nullable _seek) (void *, fpos_t, int);
  266. ^
  267. /usr/include/_stdio.h:139:35: note: insert '_Nullable' if the pointer may be null
  268. fpos_t (* _Nullable _seek) (void *, fpos_t, int);
  269. ^
  270. _Nullable
  271. /usr/include/_stdio.h:139:35: note: insert '_Nonnull' if the pointer should never be null
  272. fpos_t (* _Nullable _seek) (void *, fpos_t, int);
  273. ^
  274. _Nonnull
  275. /usr/include/_stdio.h:140:32: warning: pointer is missing a nullability type specifier (_Nonnull, _Nullable, or _Null_unspecified) [-Wnullability-completeness]
  276. int (* _Nullable _write)(void *, const char *, int);
  277. ^
  278. /usr/include/_stdio.h:140:32: note: insert '_Nullable' if the pointer may be null
  279. int (* _Nullable _write)(void *, const char *, int);
  280. ^
  281. _Nullable
  282. /usr/include/_stdio.h:140:32: note: insert '_Nonnull' if the pointer should never be null
  283. int (* _Nullable _write)(void *, const char *, int);
  284. ^
  285. _Nonnull
  286. /usr/include/_stdio.h:140:46: warning: pointer is missing a nullability type specifier (_Nonnull, _Nullable, or _Null_unspecified) [-Wnullability-completeness]
  287. int (* _Nullable _write)(void *, const char *, int);
  288. ^
  289. /usr/include/_stdio.h:140:46: note: insert '_Nullable' if the pointer may be null
  290. int (* _Nullable _write)(void *, const char *, int);
  291. ^
  292. _Nullable
  293. /usr/include/_stdio.h:140:46: note: insert '_Nonnull' if the pointer should never be null
  294. int (* _Nullable _write)(void *, const char *, int);
  295. ^
  296. _Nonnull
  297. /usr/include/_stdio.h:144:18: warning: pointer is missing a nullability type specifier (_Nonnull, _Nullable, or _Null_unspecified) [-Wnullability-completeness]
  298. struct __sFILEX *_extra; /* additions to FILE to not break ABI */
  299. ^
  300. /usr/include/_stdio.h:144:18: note: insert '_Nullable' if the pointer may be null
  301. struct __sFILEX *_extra; /* additions to FILE to not break ABI */
  302. ^
  303. _Nullable
  304. /usr/include/_stdio.h:144:18: note: insert '_Nonnull' if the pointer should never be null
  305. struct __sFILEX *_extra; /* additions to FILE to not break ABI */
  306. ^
  307. _Nonnull
  308. In file included from input_line_5:1:
  309. In file included from /Applications/Scientific/cern-root/root-v6-14-08-build/include/Rtypes.h:26:
  310. In file included from /Applications/Scientific/cern-root/root-v6-14-08-build/include/snprintf.h:14:
  311. /usr/include/stdio.h:67:13: warning: pointer is missing a nullability type specifier (_Nonnull, _Nullable, or _Null_unspecified) [-Wnullability-completeness]
  312. extern FILE *__stdinp;
  313. ^
  314. /usr/include/stdio.h:67:13: note: insert '_Nullable' if the pointer may be null
  315. extern FILE *__stdinp;
  316. ^
  317. _Nullable
  318. /usr/include/stdio.h:67:13: note: insert '_Nonnull' if the pointer should never be null
  319. extern FILE *__stdinp;
  320. ^
  321. _Nonnull
  322. /usr/include/stdio.h:390:41: warning: pointer is missing a nullability type specifier (_Nonnull, _Nullable, or _Null_unspecified) [-Wnullability-completeness]
  323. int (* _Nullable)(void *, const char *, int),
  324. ^
  325. /usr/include/stdio.h:390:41: note: insert '_Nullable' if the pointer may be null
  326. int (* _Nullable)(void *, const char *, int),
  327. ^
  328. _Nullable
  329. /usr/include/stdio.h:390:41: note: insert '_Nonnull' if the pointer should never be null
  330. int (* _Nullable)(void *, const char *, int),
  331. ^
  332. _Nonnull
  333. /usr/include/stdio.h:390:55: warning: pointer is missing a nullability type specifier (_Nonnull, _Nullable, or _Null_unspecified) [-Wnullability-completeness]
  334. int (* _Nullable)(void *, const char *, int),
  335. ^
  336. /usr/include/stdio.h:390:55: note: insert '_Nullable' if the pointer may be null
  337. int (* _Nullable)(void *, const char *, int),
  338. ^
  339. _Nullable
  340. /usr/include/stdio.h:390:55: note: insert '_Nonnull' if the pointer should never be null
  341. int (* _Nullable)(void *, const char *, int),
  342. ^
  343. _Nonnull
  344. /usr/include/stdio.h:391:44: warning: pointer is missing a nullability type specifier (_Nonnull, _Nullable, or _Null_unspecified) [-Wnullability-completeness]
  345. fpos_t (* _Nullable)(void *, fpos_t, int),
  346. ^
  347. /usr/include/stdio.h:391:44: note: insert '_Nullable' if the pointer may be null
  348. fpos_t (* _Nullable)(void *, fpos_t, int),
  349. ^
  350. _Nullable
  351. /usr/include/stdio.h:391:44: note: insert '_Nonnull' if the pointer should never be null
  352. fpos_t (* _Nullable)(void *, fpos_t, int),
  353. ^
  354. _Nonnull
  355. /usr/include/stdio.h:392:41: warning: pointer is missing a nullability type specifier (_Nonnull, _Nullable, or _Null_unspecified) [-Wnullability-completeness]
  356. int (* _Nullable)(void *));
  357. ^
  358. /usr/include/stdio.h:392:41: note: insert '_Nullable' if the pointer may be null
  359. int (* _Nullable)(void *));
  360. ^
  361. _Nullable
  362. /usr/include/stdio.h:392:41: note: insert '_Nonnull' if the pointer should never be null
  363. int (* _Nullable)(void *));
  364. ^
  365. _Nonnull
  366. /usr/include/stdio.h:388:6: warning: pointer is missing a nullability type specifier (_Nonnull, _Nullable, or _Null_unspecified) [-Wnullability-completeness]
  367. FILE *funopen(const void *,
  368. ^
  369. /usr/include/stdio.h:388:6: note: insert '_Nullable' if the pointer may be null
  370. FILE *funopen(const void *,
  371. ^
  372. _Nullable
  373. /usr/include/stdio.h:388:6: note: insert '_Nonnull' if the pointer should never be null
  374. FILE *funopen(const void *,
  375. ^
  376. _Nonnull
  377. In file included from input_line_9:12:
  378. In file included from /Applications/Scientific/cern-root/root-v6-14-08-build/include/TApplication.h:30:
  379. In file included from /Applications/Scientific/cern-root/root-v6-14-08-build/include/TQObject.h:41:
  380. In file included from /Applications/Scientific/cern-root/root-v6-14-08-build/include/TList.h:25:
  381. In file included from /Applications/Scientific/cern-root/root-v6-14-08-build/include/TSeqCollection.h:25:
  382. In file included from /Applications/Scientific/cern-root/root-v6-14-08-build/include/TCollection.h:29:
  383. In file included from /Applications/Scientific/cern-root/root-v6-14-08-build/include/TString.h:26:
  384. In file included from /Applications/Scientific/cern-root/root-v6-14-08-build/include/TMathBase.h:32:
  385. /Applications/Xcode.app/Contents/Developer/Toolchains/XcodeDefault.xctoolchain/usr/include/c++/v1/cmath:313:9: error: no member named 'signbit' in the global namespace
  386. using ::signbit;
  387. ~~^
  388. /Applications/Xcode.app/Contents/Developer/Toolchains/XcodeDefault.xctoolchain/usr/include/c++/v1/cmath:314:9: error: no member named 'fpclassify' in the global namespace
  389. using ::fpclassify;
  390. ~~^
  391. /Applications/Xcode.app/Contents/Developer/Toolchains/XcodeDefault.xctoolchain/usr/include/c++/v1/cmath:315:9: error: no member named 'isfinite' in the global namespace; did you mean 'finite'?
  392. using ::isfinite;
  393. ~~^
  394. /usr/include/math.h:749:12: note: 'finite' declared here
  395. extern int finite(double)
  396. ^
  397. In file included from input_line_9:12:
  398. In file included from /Applications/Scientific/cern-root/root-v6-14-08-build/include/TApplication.h:30:
  399. In file included from /Applications/Scientific/cern-root/root-v6-14-08-build/include/TQObject.h:41:
  400. In file included from /Applications/Scientific/cern-root/root-v6-14-08-build/include/TList.h:25:
  401. In file included from /Applications/Scientific/cern-root/root-v6-14-08-build/include/TSeqCollection.h:25:
  402. In file included from /Applications/Scientific/cern-root/root-v6-14-08-build/include/TCollection.h:29:
  403. In file included from /Applications/Scientific/cern-root/root-v6-14-08-build/include/TString.h:26:
  404. In file included from /Applications/Scientific/cern-root/root-v6-14-08-build/include/TMathBase.h:32:
  405. /Applications/Xcode.app/Contents/Developer/Toolchains/XcodeDefault.xctoolchain/usr/include/c++/v1/cmath:316:9: error: no member named 'isinf' in the global namespace
  406. using ::isinf;
  407. ~~^
  408. /Applications/Xcode.app/Contents/Developer/Toolchains/XcodeDefault.xctoolchain/usr/include/c++/v1/cmath:317:9: error: no member named 'isnan' in the global namespace
  409. using ::isnan;
  410. ~~^
  411. /Applications/Xcode.app/Contents/Developer/Toolchains/XcodeDefault.xctoolchain/usr/include/c++/v1/cmath:318:9: error: no member named 'isnormal' in the global namespace
  412. using ::isnormal;
  413. ~~^
  414. /Applications/Xcode.app/Contents/Developer/Toolchains/XcodeDefault.xctoolchain/usr/include/c++/v1/cmath:319:9: error: no member named 'isgreater' in the global namespace
  415. using ::isgreater;
  416. ~~^
  417. /Applications/Xcode.app/Contents/Developer/Toolchains/XcodeDefault.xctoolchain/usr/include/c++/v1/cmath:320:9: error: no member named 'isgreaterequal' in the global namespace
  418. using ::isgreaterequal;
  419. ~~^
  420. /Applications/Xcode.app/Contents/Developer/Toolchains/XcodeDefault.xctoolchain/usr/include/c++/v1/cmath:321:9: error: no member named 'isless' in the global namespace
  421. using ::isless;
  422. ~~^
  423. /Applications/Xcode.app/Contents/Developer/Toolchains/XcodeDefault.xctoolchain/usr/include/c++/v1/cmath:322:9: error: no member named 'islessequal' in the global namespace
  424. using ::islessequal;
  425. ~~^
  426. /Applications/Xcode.app/Contents/Developer/Toolchains/XcodeDefault.xctoolchain/usr/include/c++/v1/cmath:323:9: error: no member named 'islessgreater' in the global namespace
  427. using ::islessgreater;
  428. ~~^
  429. /Applications/Xcode.app/Contents/Developer/Toolchains/XcodeDefault.xctoolchain/usr/include/c++/v1/cmath:324:9: error: no member named 'isunordered' in the global namespace
  430. using ::isunordered;
  431. ~~^
  432. /Applications/Xcode.app/Contents/Developer/Toolchains/XcodeDefault.xctoolchain/usr/include/c++/v1/cmath:325:9: error: no member named 'isunordered' in the global namespace
  433. using ::isunordered;
  434. ~~^
  435. In file included from input_line_9:12:
  436. In file included from /Applications/Scientific/cern-root/root-v6-14-08-build/include/TApplication.h:30:
  437. In file included from /Applications/Scientific/cern-root/root-v6-14-08-build/include/TQObject.h:41:
  438. In file included from /Applications/Scientific/cern-root/root-v6-14-08-build/include/TList.h:25:
  439. In file included from /Applications/Scientific/cern-root/root-v6-14-08-build/include/TSeqCollection.h:25:
  440. In file included from /Applications/Scientific/cern-root/root-v6-14-08-build/include/TCollection.h:29:
  441. In file included from /Applications/Scientific/cern-root/root-v6-14-08-build/include/TString.h:26:
  442. /Applications/Scientific/cern-root/root-v6-14-08-build/include/TMathBase.h:125:10: warning: using integer absolute value function 'abs' when argument is of floating point type [-Wabsolute-value]
  443. { return std::abs(d); }
  444. ^
  445. /Applications/Scientific/cern-root/root-v6-14-08-build/include/TMathBase.h:125:10: note: use function 'std::abs' instead
  446. { return std::abs(d); }
  447. ^~~~~~~~
  448. std::abs
  449. /Applications/Scientific/cern-root/root-v6-14-08-build/include/TMathBase.h:125:10: note: include the header <cmath> or explicitly provide a declaration for 'std::abs'
  450. /Applications/Scientific/cern-root/root-v6-14-08-build/include/TMathBase.h:128:10: warning: using integer absolute value function 'abs' when argument is of floating point type [-Wabsolute-value]
  451. { return std::abs(d); }
  452. ^
  453. /Applications/Scientific/cern-root/root-v6-14-08-build/include/TMathBase.h:128:10: note: use function 'std::abs' instead
  454. { return std::abs(d); }
  455. ^~~~~~~~
  456. std::abs
  457. /Applications/Scientific/cern-root/root-v6-14-08-build/include/TMathBase.h:128:10: note: include the header <cmath> or explicitly provide a declaration for 'std::abs'
  458. /Applications/Scientific/cern-root/root-v6-14-08-build/include/TMathBase.h:131:10: warning: using integer absolute value function 'abs' when argument is of floating point type [-Wabsolute-value]
  459. { return std::abs(d); }
  460. ^
  461. /Applications/Scientific/cern-root/root-v6-14-08-build/include/TMathBase.h:131:10: note: use function 'std::abs' instead
  462. { return std::abs(d); }
  463. ^~~~~~~~
  464. std::abs
  465. /Applications/Scientific/cern-root/root-v6-14-08-build/include/TMathBase.h:131:10: note: include the header <cmath> or explicitly provide a declaration for 'std::abs'
  466. /Applications/Scientific/cern-root/root-v6-14-08-build/include/TMathBase.h:141:18: error: expected unqualified-id
  467. { return std::signbit(a); }
  468. ^
  469. /usr/include/math.h:170:5: note: expanded from macro 'signbit'
  470. ( sizeof(x) == sizeof(float) ? __inline_signbitf((float)(x)) \
  471. ^
  472. In file included from input_line_9:12:
  473. In file included from /Applications/Scientific/cern-root/root-v6-14-08-build/include/TApplication.h:30:
  474. In file included from /Applications/Scientific/cern-root/root-v6-14-08-build/include/TQObject.h:41:
  475. In file included from /Applications/Scientific/cern-root/root-v6-14-08-build/include/TList.h:25:
  476. In file included from /Applications/Scientific/cern-root/root-v6-14-08-build/include/TSeqCollection.h:25:
  477. In file included from /Applications/Scientific/cern-root/root-v6-14-08-build/include/TCollection.h:29:
  478. In file included from /Applications/Scientific/cern-root/root-v6-14-08-build/include/TString.h:26:
  479. /Applications/Scientific/cern-root/root-v6-14-08-build/include/TMathBase.h:144:18: error: expected unqualified-id
  480. { return std::signbit(a); }
  481. ^
  482. /usr/include/math.h:170:5: note: expanded from macro 'signbit'
  483. ( sizeof(x) == sizeof(float) ? __inline_signbitf((float)(x)) \
  484. ^
  485. In file included from input_line_9:12:
  486. In file included from /Applications/Scientific/cern-root/root-v6-14-08-build/include/TApplication.h:30:
  487. In file included from /Applications/Scientific/cern-root/root-v6-14-08-build/include/TQObject.h:41:
  488. In file included from /Applications/Scientific/cern-root/root-v6-14-08-build/include/TList.h:25:
  489. In file included from /Applications/Scientific/cern-root/root-v6-14-08-build/include/TSeqCollection.h:25:
  490. In file included from /Applications/Scientific/cern-root/root-v6-14-08-build/include/TCollection.h:29:
  491. In file included from /Applications/Scientific/cern-root/root-v6-14-08-build/include/TString.h:26:
  492. /Applications/Scientific/cern-root/root-v6-14-08-build/include/TMathBase.h:147:18: error: expected unqualified-id
  493. { return std::signbit(a); }
  494. ^
  495. /usr/include/math.h:170:5: note: expanded from macro 'signbit'
  496. ( sizeof(x) == sizeof(float) ? __inline_signbitf((float)(x)) \
  497. ^
  498. Error: /Applications/Scientific/cern-root/root-v6-14-08-build/core/rootcling_stage1/src/rootcling_stage1: compilation failure (/Applications/Scientific/cern-root/root-v6-14-08-build/lib/libCore4699ab63cc_dictUmbrella.h)
  499. make[2]: *** [core/base/G__Core.cxx] Error 1
  500. make[1]: *** [core/base/CMakeFiles/G__Core.dir/all] Error 2
  501. make: *** [all] Error 2
Advertisement
Add Comment
Please, Sign In to add comment
Advertisement