swarfega

config.log

Jan 24th, 2014
189
0
Never
Not a member of Pastebin yet? Sign Up, it unlocks many cool features!
Bash 28.60 KB | None | 0 0
  1. This file contains any messages produced by compilers while
  2. running configure, to aid debugging if configure makes a mistake.
  3.  
  4. It was created by znc configure 1.3, which was
  5. generated by GNU Autoconf 2.69.  Invocation command line was
  6.  
  7.   $ ./configure --prefix=/home/swarfega/znc --enable-tcl --enable-cyrus
  8.  
  9. ## --------- ##
  10. ## Platform. ##
  11. ## --------- ##
  12.  
  13. hostname = cal
  14. uname -m = x86_64
  15. uname -r = 2.6.32-348.16.1.el5.028stab108.1
  16. uname -s = Linux
  17. uname -v = #1 SMP Tue Aug 27 13:02:53 MSD 2013
  18.  
  19. /usr/bin/uname -p = unknown
  20. /bin/uname -X     = unknown
  21.  
  22. /bin/arch              = unknown
  23. /usr/bin/arch -k       = unknown
  24. /usr/convex/getsysinfo = unknown
  25. /usr/bin/hostinfo      = unknown
  26. /bin/machine           = unknown
  27. /usr/bin/oslevel       = unknown
  28. /bin/universe          = unknown
  29.  
  30. PATH: /usr/local/bin
  31. PATH: /usr/bin
  32. PATH: /bin
  33. PATH: /usr/local/games
  34. PATH: /usr/games
  35.  
  36.  
  37. ## ----------- ##
  38. ## Core tests. ##
  39. ## ----------- ##
  40.  
  41. configure:2139: checking for g++
  42. configure:2155: found /usr/bin/g++
  43. configure:2166: result: g++
  44. configure:2193: checking for C++ compiler version
  45. configure:2202: g++ --version >&5
  46. g++ (Debian 4.4.5-8) 4.4.5
  47. Copyright (C) 2010 Free Software Foundation, Inc.
  48. This is free software; see the source for copying conditions.  There is NO
  49. warranty; not even for MERCHANTABILITY or FITNESS FOR A PARTICULAR PURPOSE.
  50.  
  51. configure:2213: $? = 0
  52. configure:2202: g++ -v >&5
  53. Using built-in specs.
  54. Target: x86_64-linux-gnu
  55. Configured with: ../src/configure -v --with-pkgversion='Debian 4.4.5-8' --with-bugurl=file:///usr/share/doc/gcc-4.4/README.Bugs --enable-languages=c,c++,fortran,objc,obj-c++ --prefix=/usr --program-suffix=-4.4 --enable-shared --enable-multiarch --enable-linker-build-id --with-system-zlib --libexecdir=/usr/lib --without-included-gettext --enable-threads=posix --with-gxx-include-dir=/usr/include/c++/4.4 --libdir=/usr/lib --enable-nls --enable-clocale=gnu --enable-libstdcxx-debug --enable-objc-gc --with-arch-32=i586 --with-tune=generic --enable-checking=release --build=x86_64-linux-gnu --host=x86_64-linux-gnu --target=x86_64-linux-gnu
  56. Thread model: posix
  57. gcc version 4.4.5 (Debian 4.4.5-8)
  58. configure:2213: $? = 0
  59. configure:2202: g++ -V >&5
  60. g++: '-V' option must have argument
  61. configure:2213: $? = 1
  62. configure:2202: g++ -qversion >&5
  63. g++: unrecognized option '-qversion'
  64. g++: no input files
  65. configure:2213: $? = 1
  66. configure:2233: checking whether the C++ compiler works
  67. configure:2255: g++     conftest.cpp  >&5
  68. configure:2259: $? = 0
  69. configure:2307: result: yes
  70. configure:2310: checking for C++ compiler default output file name
  71. configure:2312: result: a.out
  72. configure:2318: checking for suffix of executables
  73. configure:2325: g++ -o conftest     conftest.cpp  >&5
  74. configure:2329: $? = 0
  75. configure:2351: result:
  76. configure:2373: checking whether we are cross compiling
  77. configure:2381: g++ -o conftest     conftest.cpp  >&5
  78. configure:2385: $? = 0
  79. configure:2392: ./conftest
  80. configure:2396: $? = 0
  81. configure:2411: result: no
  82. configure:2416: checking for suffix of object files
  83. configure:2438: g++ -c    conftest.cpp >&5
  84. configure:2442: $? = 0
  85. configure:2463: result: o
  86. configure:2467: checking whether we are using the GNU C++ compiler
  87. configure:2486: g++ -c    conftest.cpp >&5
  88. configure:2486: $? = 0
  89. configure:2495: result: yes
  90. configure:2504: checking whether g++ accepts -g
  91. configure:2524: g++ -c -g  conftest.cpp >&5
  92. configure:2524: $? = 0
  93. configure:2565: result: yes
  94. configure:2631: checking for a BSD-compatible install
  95. configure:2699: result: /usr/bin/install -c
  96. configure:2710: checking for grep that handles long lines and -e
  97. configure:2768: result: /bin/grep
  98. configure:2773: checking for a sed that does not truncate output
  99. configure:2837: result: /bin/sed
  100. configure:2846: checking build system type
  101. configure:2860: result: x86_64-unknown-linux-gnu
  102. configure:2880: checking host system type
  103. configure:2893: result: x86_64-unknown-linux-gnu
  104. configure:2921: checking for special C compiler options needed for large files
  105. configure:2951: g++ -c    conftest.cpp >&5
  106. configure:2951: $? = 0
  107. configure:2966: result: no
  108. configure:2972: checking for _FILE_OFFSET_BITS value needed for large files
  109. configure:2997: g++ -c    conftest.cpp >&5
  110. configure:2997: $? = 0
  111. configure:3029: result: no
  112. configure:3125: checking whether the -Werror option is usable
  113. configure:3144: g++ -c   -Werror  conftest.cpp >&5
  114. configure:3144: $? = 0
  115. configure:3153: result: yes
  116. configure:3155: checking for simple visibility declarations
  117. configure:3182: g++ -c   -fvisibility=hidden -Werror  conftest.cpp >&5
  118. configure:3182: $? = 0
  119. configure:3191: result: yes
  120. configure:3214: checking for git
  121. configure:3232: found /usr/bin/git
  122. configure:3244: result: /usr/bin/git
  123. configure:3358: checking for pkg-config
  124. configure:3376: found /usr/bin/pkg-config
  125. configure:3388: result: /usr/bin/pkg-config
  126. configure:3413: checking pkg-config is at least version 0.9.0
  127. configure:3416: result: yes
  128. configure:3555: checking whether compiler predefines _FORTIFY_SOURCE
  129. configure:3575: g++ -c    conftest.cpp >&5
  130. conftest.cpp:18:4: error: #error "Just checking, nothing fatal here"
  131. configure:3575: $? = 1
  132. configure: failed program was:
  133. | /* confdefs.h */
  134. | #define PACKAGE_NAME "znc"
  135. | #define PACKAGE_TARNAME "znc"
  136. | #define PACKAGE_VERSION "1.3"
  137. | #define PACKAGE_STRING "znc 1.3"
  138. | #define PACKAGE_BUGREPORT ""
  139. | #define PACKAGE_URL ""
  140. | #define HAVE_VISIBILITY 1
  141. | /* end confdefs.h.  */
  142. |
  143. |
  144. |
  145. | int
  146. | main ()
  147. | {
  148. |
  149. |       #ifndef _FORTIFY_SOURCE
  150. |       #error "Just checking, nothing fatal here"
  151. |       #endif
  152. |
  153. |   ;
  154. |   return 0;
  155. | }
  156. |
  157. configure:3582: result: no
  158. configure:3649: checking for getopt_long in -lgnugetopt
  159. configure:3674: g++ -o conftest   -D_FORTIFY_SOURCE=2 -O2 -Wall -W -Wno-unused-parameter -Woverloaded-virtual -Wshadow   conftest.cpp -lgnugetopt   >&5
  160. /usr/bin/ld: cannot find -lgnugetopt
  161. collect2: ld returned 1 exit status
  162. configure:3674: $? = 1
  163. configure: failed program was:
  164. | /* confdefs.h */
  165. | #define PACKAGE_NAME "znc"
  166. | #define PACKAGE_TARNAME "znc"
  167. | #define PACKAGE_VERSION "1.3"
  168. | #define PACKAGE_STRING "znc 1.3"
  169. | #define PACKAGE_BUGREPORT ""
  170. | #define PACKAGE_URL ""
  171. | #define HAVE_VISIBILITY 1
  172. | #define HAVE_IPV6 1
  173. | #define CSOCK_USE_POLL 1
  174. | /* end confdefs.h.  */
  175. |
  176. | /* Override any GCC internal prototype to avoid an error.
  177. |    Use char because int might match the return type of a GCC
  178. |    builtin and then its argument prototype would still apply.  */
  179. | #ifdef __cplusplus
  180. | extern "C"
  181. | #endif
  182. | char getopt_long ();
  183. | int
  184. | main ()
  185. | {
  186. | return getopt_long ();
  187. |   ;
  188. |   return 0;
  189. | }
  190. configure:3683: result: no
  191. configure:3697: checking for lstat
  192. configure:3697: g++ -o conftest   -D_FORTIFY_SOURCE=2 -O2 -Wall -W -Wno-unused-parameter -Woverloaded-virtual -Wshadow   conftest.cpp  >&5
  193. configure:3697: $? = 0
  194. configure:3697: result: yes
  195. configure:3697: checking for getopt_long
  196. configure:3697: g++ -o conftest   -D_FORTIFY_SOURCE=2 -O2 -Wall -W -Wno-unused-parameter -Woverloaded-virtual -Wshadow   conftest.cpp  >&5
  197. configure:3697: $? = 0
  198. configure:3697: result: yes
  199. configure:3697: checking for getphassphrase
  200. configure:3697: g++ -o conftest   -D_FORTIFY_SOURCE=2 -O2 -Wall -W -Wno-unused-parameter -Woverloaded-virtual -Wshadow   conftest.cpp  >&5
  201. /tmp/cc30C5Vj.o: In function `main':
  202. conftest.cpp:(.text+0x5): undefined reference to `getphassphrase'
  203. collect2: ld returned 1 exit status
  204. configure:3697: $? = 1
  205. configure: failed program was:
  206. | /* confdefs.h */
  207. | #define PACKAGE_NAME "znc"
  208. | #define PACKAGE_TARNAME "znc"
  209. | #define PACKAGE_VERSION "1.3"
  210. | #define PACKAGE_STRING "znc 1.3"
  211. | #define PACKAGE_BUGREPORT ""
  212. | #define PACKAGE_URL ""
  213. | #define HAVE_VISIBILITY 1
  214. | #define HAVE_IPV6 1
  215. | #define CSOCK_USE_POLL 1
  216. | #define HAVE_LSTAT 1
  217. | #define HAVE_GETOPT_LONG 1
  218. | /* end confdefs.h.  */
  219. | /* Define getphassphrase to an innocuous variant, in case <limits.h> declares getphassphrase.
  220. |    For example, HP-UX 11i <limits.h> declares gettimeofday.  */
  221. | #define getphassphrase innocuous_getphassphrase
  222. |
  223. | /* System header to define __stub macros and hopefully few prototypes,
  224. |     which can conflict with char getphassphrase (); below.
  225. |     Prefer <limits.h> to <assert.h> if __STDC__ is defined, since
  226. |     <limits.h> exists even on freestanding compilers.  */
  227. |
  228. | #ifdef __STDC__
  229. | # include <limits.h>
  230. | #else
  231. | # include <assert.h>
  232. | #endif
  233. |
  234. | #undef getphassphrase
  235. |
  236. | /* Override any GCC internal prototype to avoid an error.
  237. |    Use char because int might match the return type of a GCC
  238. |    builtin and then its argument prototype would still apply.  */
  239. | #ifdef __cplusplus
  240. | extern "C"
  241. | #endif
  242. | char getphassphrase ();
  243. | /* The GNU C library defines this for functions which it implements
  244. |     to always fail with ENOSYS.  Some functions are actually named
  245. |     something starting with __ and the normal name is an alias.  */
  246. | #if defined __stub_getphassphrase || defined __stub___getphassphrase
  247. | choke me
  248. | #endif
  249. |
  250. | int
  251. | main ()
  252. | {
  253. | return getphassphrase ();
  254. |   ;
  255. |   return 0;
  256. | }
  257. configure:3697: result: no
  258. configure:3709: checking for library containing dlopen
  259. configure:3740: g++ -o conftest   -D_FORTIFY_SOURCE=2 -O2 -Wall -W -Wno-unused-parameter -Woverloaded-virtual -Wshadow   conftest.cpp  >&5
  260. /tmp/ccyUyFsp.o: In function `main':
  261. conftest.cpp:(.text+0x5): undefined reference to `dlopen'
  262. collect2: ld returned 1 exit status
  263. configure:3740: $? = 1
  264. configure: failed program was:
  265. | /* confdefs.h */
  266. | #define PACKAGE_NAME "znc"
  267. | #define PACKAGE_TARNAME "znc"
  268. | #define PACKAGE_VERSION "1.3"
  269. | #define PACKAGE_STRING "znc 1.3"
  270. | #define PACKAGE_BUGREPORT ""
  271. | #define PACKAGE_URL ""
  272. | #define HAVE_VISIBILITY 1
  273. | #define HAVE_IPV6 1
  274. | #define CSOCK_USE_POLL 1
  275. | #define HAVE_LSTAT 1
  276. | #define HAVE_GETOPT_LONG 1
  277. | /* end confdefs.h.  */
  278. |
  279. | /* Override any GCC internal prototype to avoid an error.
  280. |    Use char because int might match the return type of a GCC
  281. |    builtin and then its argument prototype would still apply.  */
  282. | #ifdef __cplusplus
  283. | extern "C"
  284. | #endif
  285. | char dlopen ();
  286. | int
  287. | main ()
  288. | {
  289. | return dlopen ();
  290. |   ;
  291. |   return 0;
  292. | }
  293. configure:3740: g++ -o conftest   -D_FORTIFY_SOURCE=2 -O2 -Wall -W -Wno-unused-parameter -Woverloaded-virtual -Wshadow   conftest.cpp -ldl   >&5
  294. configure:3740: $? = 0
  295. configure:3757: result: -ldl
  296. configure:3942: checking for the pthreads library -lpthreads
  297. configure:3980: g++ -o conftest   -D_FORTIFY_SOURCE=2 -O2 -Wall -W -Wno-unused-parameter -Woverloaded-virtual -Wshadow    conftest.cpp -lpthreads -ldl  >&5
  298. /usr/bin/ld: cannot find -lpthreads
  299. collect2: ld returned 1 exit status
  300. configure:3980: $? = 1
  301. configure: failed program was:
  302. | /* confdefs.h */
  303. | #define PACKAGE_NAME "znc"
  304. | #define PACKAGE_TARNAME "znc"
  305. | #define PACKAGE_VERSION "1.3"
  306. | #define PACKAGE_STRING "znc 1.3"
  307. | #define PACKAGE_BUGREPORT ""
  308. | #define PACKAGE_URL ""
  309. | #define HAVE_VISIBILITY 1
  310. | #define HAVE_IPV6 1
  311. | #define CSOCK_USE_POLL 1
  312. | #define HAVE_LSTAT 1
  313. | #define HAVE_GETOPT_LONG 1
  314. | /* end confdefs.h.  */
  315. | #include <pthread.h>
  316. |                         static void routine(void *a) { *((int*)a) = 42; }
  317. |                         static void *start_routine(void *a) { return a; }
  318. | int
  319. | main ()
  320. | {
  321. | pthread_t th; pthread_attr_t attr;
  322. |                         pthread_create(&th, 0, start_routine, 0);
  323. |                         pthread_join(th, 0);
  324. |                         pthread_attr_init(&attr);
  325. |                         pthread_cleanup_push(routine, 0);
  326. |                         pthread_cleanup_pop(0) /* ; */
  327. |   ;
  328. |   return 0;
  329. | }
  330. configure:3989: result: no
  331. configure:3886: checking whether pthreads work without any flags
  332. configure:3980: g++ -o conftest   -D_FORTIFY_SOURCE=2 -O2 -Wall -W -Wno-unused-parameter -Woverloaded-virtual -Wshadow    conftest.cpp  -ldl  >&5
  333. /tmp/cccTbQPB.o: In function `main':
  334. conftest.cpp:(.text+0x33): undefined reference to `pthread_create'
  335. conftest.cpp:(.text+0x3f): undefined reference to `pthread_join'
  336. collect2: ld returned 1 exit status
  337. configure:3980: $? = 1
  338. configure: failed program was:
  339. | /* confdefs.h */
  340. | #define PACKAGE_NAME "znc"
  341. | #define PACKAGE_TARNAME "znc"
  342. | #define PACKAGE_VERSION "1.3"
  343. | #define PACKAGE_STRING "znc 1.3"
  344. | #define PACKAGE_BUGREPORT ""
  345. | #define PACKAGE_URL ""
  346. | #define HAVE_VISIBILITY 1
  347. | #define HAVE_IPV6 1
  348. | #define CSOCK_USE_POLL 1
  349. | #define HAVE_LSTAT 1
  350. | #define HAVE_GETOPT_LONG 1
  351. | /* end confdefs.h.  */
  352. | #include <pthread.h>
  353. |                         static void routine(void *a) { *((int*)a) = 42; }
  354. |                         static void *start_routine(void *a) { return a; }
  355. | int
  356. | main ()
  357. | {
  358. | pthread_t th; pthread_attr_t attr;
  359. |                         pthread_create(&th, 0, start_routine, 0);
  360. |                         pthread_join(th, 0);
  361. |                         pthread_attr_init(&attr);
  362. |                         pthread_cleanup_push(routine, 0);
  363. |                         pthread_cleanup_pop(0) /* ; */
  364. |   ;
  365. |   return 0;
  366. | }
  367. configure:3989: result: no
  368. configure:3891: checking whether pthreads work with -Kthread
  369. configure:3980: g++ -o conftest   -D_FORTIFY_SOURCE=2 -O2 -Wall -W -Wno-unused-parameter -Woverloaded-virtual -Wshadow -Kthread   conftest.cpp -Kthread -ldl  >&5
  370. g++: unrecognized option '-Kthread'
  371. g++: unrecognized option '-Kthread'
  372. /tmp/ccjEM8kH.o: In function `main':
  373. conftest.cpp:(.text+0x33): undefined reference to `pthread_create'
  374. conftest.cpp:(.text+0x3f): undefined reference to `pthread_join'
  375. collect2: ld returned 1 exit status
  376. configure:3980: $? = 1
  377. configure: failed program was:
  378. | /* confdefs.h */
  379. | #define PACKAGE_NAME "znc"
  380. | #define PACKAGE_TARNAME "znc"
  381. | #define PACKAGE_VERSION "1.3"
  382. | #define PACKAGE_STRING "znc 1.3"
  383. | #define PACKAGE_BUGREPORT ""
  384. | #define PACKAGE_URL ""
  385. | #define HAVE_VISIBILITY 1
  386. | #define HAVE_IPV6 1
  387. | #define CSOCK_USE_POLL 1
  388. | #define HAVE_LSTAT 1
  389. | #define HAVE_GETOPT_LONG 1
  390. | /* end confdefs.h.  */
  391. | #include <pthread.h>
  392. |                         static void routine(void *a) { *((int*)a) = 42; }
  393. |                         static void *start_routine(void *a) { return a; }
  394. | int
  395. | main ()
  396. | {
  397. | pthread_t th; pthread_attr_t attr;
  398. |                         pthread_create(&th, 0, start_routine, 0);
  399. |                         pthread_join(th, 0);
  400. |                         pthread_attr_init(&attr);
  401. |                         pthread_cleanup_push(routine, 0);
  402. |                         pthread_cleanup_pop(0) /* ; */
  403. |   ;
  404. |   return 0;
  405. | }
  406. configure:3989: result: no
  407. configure:3891: checking whether pthreads work with -kthread
  408. configure:3980: g++ -o conftest   -D_FORTIFY_SOURCE=2 -O2 -Wall -W -Wno-unused-parameter -Woverloaded-virtual -Wshadow -kthread   conftest.cpp -kthread -ldl  >&5
  409. g++: unrecognized option '-kthread'
  410. g++: unrecognized option '-kthread'
  411. /tmp/ccjDdEPK.o: In function `main':
  412. conftest.cpp:(.text+0x33): undefined reference to `pthread_create'
  413. conftest.cpp:(.text+0x3f): undefined reference to `pthread_join'
  414. collect2: ld returned 1 exit status
  415. configure:3980: $? = 1
  416. configure: failed program was:
  417. | /* confdefs.h */
  418. | #define PACKAGE_NAME "znc"
  419. | #define PACKAGE_TARNAME "znc"
  420. | #define PACKAGE_VERSION "1.3"
  421. | #define PACKAGE_STRING "znc 1.3"
  422. | #define PACKAGE_BUGREPORT ""
  423. | #define PACKAGE_URL ""
  424. | #define HAVE_VISIBILITY 1
  425. | #define HAVE_IPV6 1
  426. | #define CSOCK_USE_POLL 1
  427. | #define HAVE_LSTAT 1
  428. | #define HAVE_GETOPT_LONG 1
  429. | /* end confdefs.h.  */
  430. | #include <pthread.h>
  431. |                         static void routine(void *a) { *((int*)a) = 42; }
  432. |                         static void *start_routine(void *a) { return a; }
  433. | int
  434. | main ()
  435. | {
  436. | pthread_t th; pthread_attr_t attr;
  437. |                         pthread_create(&th, 0, start_routine, 0);
  438. |                         pthread_join(th, 0);
  439. |                         pthread_attr_init(&attr);
  440. |                         pthread_cleanup_push(routine, 0);
  441. |                         pthread_cleanup_pop(0) /* ; */
  442. |   ;
  443. |   return 0;
  444. | }
  445. configure:3989: result: no
  446. configure:3942: checking for the pthreads library -llthread
  447. configure:3980: g++ -o conftest   -D_FORTIFY_SOURCE=2 -O2 -Wall -W -Wno-unused-parameter -Woverloaded-virtual -Wshadow    conftest.cpp -llthread -ldl  >&5
  448. /usr/bin/ld: cannot find -llthread
  449. collect2: ld returned 1 exit status
  450. configure:3980: $? = 1
  451. configure: failed program was:
  452. | /* confdefs.h */
  453. | #define PACKAGE_NAME "znc"
  454. | #define PACKAGE_TARNAME "znc"
  455. | #define PACKAGE_VERSION "1.3"
  456. | #define PACKAGE_STRING "znc 1.3"
  457. | #define PACKAGE_BUGREPORT ""
  458. | #define PACKAGE_URL ""
  459. | #define HAVE_VISIBILITY 1
  460. | #define HAVE_IPV6 1
  461. | #define CSOCK_USE_POLL 1
  462. | #define HAVE_LSTAT 1
  463. | #define HAVE_GETOPT_LONG 1
  464. | /* end confdefs.h.  */
  465. | #include <pthread.h>
  466. |                         static void routine(void *a) { *((int*)a) = 42; }
  467. |                         static void *start_routine(void *a) { return a; }
  468. | int
  469. | main ()
  470. | {
  471. | pthread_t th; pthread_attr_t attr;
  472. |                         pthread_create(&th, 0, start_routine, 0);
  473. |                         pthread_join(th, 0);
  474. |                         pthread_attr_init(&attr);
  475. |                         pthread_cleanup_push(routine, 0);
  476. |                         pthread_cleanup_pop(0) /* ; */
  477. |   ;
  478. |   return 0;
  479. | }
  480. configure:3989: result: no
  481. configure:3891: checking whether pthreads work with -pthread
  482. configure:3980: g++ -o conftest   -D_FORTIFY_SOURCE=2 -O2 -Wall -W -Wno-unused-parameter -Woverloaded-virtual -Wshadow -pthread   conftest.cpp -pthread -ldl  >&5
  483. configure:3980: $? = 0
  484. configure:3989: result: yes
  485. configure:4008: checking for joinable pthread attribute
  486. configure:4023: g++ -o conftest   -D_FORTIFY_SOURCE=2 -O2 -Wall -W -Wno-unused-parameter -Woverloaded-virtual -Wshadow -pthread   conftest.cpp -pthread -ldl  >&5
  487. configure:4023: $? = 0
  488. configure:4029: result: PTHREAD_CREATE_JOINABLE
  489. configure:4039: checking if more special flags are required for pthreads
  490. configure:4053: result: no
  491. configure:4059: checking for PTHREAD_PRIO_INHERIT
  492. configure:4077: g++ -o conftest   -D_FORTIFY_SOURCE=2 -O2 -Wall -W -Wno-unused-parameter -Woverloaded-virtual -Wshadow -pthread   conftest.cpp -pthread -ldl  >&5
  493. configure:4077: $? = 0
  494. configure:4086: result: yes
  495. configure:4161: checking whether getaddrinfo() supports AI_ADDRCONFIG
  496. configure:4183: g++ -c   -D_FORTIFY_SOURCE=2 -O2 -Wall -W -Wno-unused-parameter -Woverloaded-virtual -Wshadow -pthread  conftest.cpp >&5
  497. configure:4183: $? = 0
  498. configure:4185: result: yes
  499. configure:4247: checking for openssl
  500. configure:4254: $PKG_CONFIG --exists --print-errors "openssl"
  501. configure:4257: $? = 0
  502. configure:4271: $PKG_CONFIG --exists --print-errors "openssl"
  503. configure:4274: $? = 0
  504. configure:4506: result: yes
  505. configure:4515: checking whether openssl is usable
  506. configure:4539: g++ -o conftest   -D_FORTIFY_SOURCE=2 -O2 -Wall -W -Wno-unused-parameter -Woverloaded-virtual -Wshadow -pthread     conftest.cpp -ldl  -pthread -lssl -lcrypto   >&5
  507. configure:4539: $? = 0
  508. configure:4541: result: yes
  509. configure:4582: checking whether zlib is usable
  510. configure:4604: g++ -o conftest   -D_FORTIFY_SOURCE=2 -O2 -Wall -W -Wno-unused-parameter -Woverloaded-virtual -Wshadow -pthread     conftest.cpp -ldl  -pthread -lssl -lcrypto   -lz >&5
  511. configure:4604: $? = 0
  512. configure:4606: result: yes
  513. configure:5151: checking for sasl_server_init in -lsasl2
  514. configure:5176: g++ -o conftest   -D_FORTIFY_SOURCE=2 -O2 -Wall -W -Wno-unused-parameter -Woverloaded-virtual -Wshadow -pthread    -Wl,--export-dynamic conftest.cpp -lsasl2  -ldl  -pthread -lssl -lcrypto   -lz >&5
  515. configure:5176: $? = 0
  516. configure:5185: result: yes
  517. configure:5225: checking for /usr/lib/tclConfig.sh
  518. configure:5230: result: yes
  519. configure:5245: checking modtcl flags
  520. configure:5252: result: -I/usr/include/tcl8.4 -L/usr/lib -ltcl8.4
  521. configure:5257: checking for Tcl_CreateInterp
  522. configure:5257: g++ -o conftest   -D_FORTIFY_SOURCE=2 -O2 -Wall -W -Wno-unused-parameter -Woverloaded-virtual -Wshadow -pthread    -Wl,--export-dynamic conftest.cpp -ldl  -pthread -lssl -lcrypto   -lz -I/usr/include/tcl8.4 -L/usr/lib -ltcl8.4 >&5
  523. configure:5257: $? = 0
  524. configure:5257: result: yes
  525. configure:5291: checking how to run the C++ preprocessor
  526. configure:5318: g++ -E  conftest.cpp
  527. configure:5318: $? = 0
  528. configure:5332: g++ -E  conftest.cpp
  529. conftest.cpp:19:28: error: ac_nonexistent.h: No such file or directory
  530. configure:5332: $? = 1
  531. configure: failed program was:
  532. | /* confdefs.h */
  533. | #define PACKAGE_NAME "znc"
  534. | #define PACKAGE_TARNAME "znc"
  535. | #define PACKAGE_VERSION "1.3"
  536. | #define PACKAGE_STRING "znc 1.3"
  537. | #define PACKAGE_BUGREPORT ""
  538. | #define PACKAGE_URL ""
  539. | #define HAVE_VISIBILITY 1
  540. | #define HAVE_IPV6 1
  541. | #define CSOCK_USE_POLL 1
  542. | #define HAVE_LSTAT 1
  543. | #define HAVE_GETOPT_LONG 1
  544. | #define HAVE_PTHREAD_PRIO_INHERIT 1
  545. | #define HAVE_PTHREAD 1
  546. | #define HAVE_THREADED_DNS 1
  547. | #define HAVE_LIBSSL 1
  548. | #define HAVE_ZLIB 1
  549. | /* end confdefs.h.  */
  550. | #include <ac_nonexistent.h>
  551. configure:5357: result: g++ -E
  552. configure:5377: g++ -E  conftest.cpp
  553. configure:5377: $? = 0
  554. configure:5391: g++ -E  conftest.cpp
  555. conftest.cpp:19:28: error: ac_nonexistent.h: No such file or directory
  556. configure:5391: $? = 1
  557. configure: failed program was:
  558. | /* confdefs.h */
  559. | #define PACKAGE_NAME "znc"
  560. | #define PACKAGE_TARNAME "znc"
  561. | #define PACKAGE_VERSION "1.3"
  562. | #define PACKAGE_STRING "znc 1.3"
  563. | #define PACKAGE_BUGREPORT ""
  564. | #define PACKAGE_URL ""
  565. | #define HAVE_VISIBILITY 1
  566. | #define HAVE_IPV6 1
  567. | #define CSOCK_USE_POLL 1
  568. | #define HAVE_LSTAT 1
  569. | #define HAVE_GETOPT_LONG 1
  570. | #define HAVE_PTHREAD_PRIO_INHERIT 1
  571. | #define HAVE_PTHREAD 1
  572. | #define HAVE_THREADED_DNS 1
  573. | #define HAVE_LIBSSL 1
  574. | #define HAVE_ZLIB 1
  575. | /* end confdefs.h.  */
  576. | #include <ac_nonexistent.h>
  577. configure:5420: checking for egrep
  578. configure:5482: result: /bin/grep -E
  579. configure:6047: checking for iconv
  580. configure:6071: g++ -o conftest   -D_FORTIFY_SOURCE=2 -O2 -Wall -W -Wno-unused-parameter -Woverloaded-virtual -Wshadow -pthread    -Wl,--export-dynamic conftest.cpp -ldl  -pthread -lssl -lcrypto   -lz >&5
  581. configure:6071: $? = 0
  582. configure:6105: result: yes
  583. configure:6108: checking for working iconv
  584. configure:6228: g++ -o conftest   -D_FORTIFY_SOURCE=2 -O2 -Wall -W -Wno-unused-parameter -Woverloaded-virtual -Wshadow -pthread    -Wl,--export-dynamic conftest.cpp -ldl  -pthread -lssl -lcrypto   -lz >&5
  585. configure:6228: $? = 0
  586. configure:6228: ./conftest
  587. configure:6228: $? = 0
  588. configure:6240: result: yes
  589. configure:6270: checking for iconv declaration
  590. configure:6299: g++ -c   -D_FORTIFY_SOURCE=2 -O2 -Wall -W -Wno-unused-parameter -Woverloaded-virtual -Wshadow -pthread    conftest.cpp >&5
  591. configure:6299: $? = 0
  592. configure:6310: result:
  593.         extern size_t iconv (iconv_t cd, char * *inbuf, size_t *inbytesleft, char * *outbuf, size_t *outbytesleft);
  594. configure:6322: checking for GNU make
  595. configure:6361: result: /usr/bin/make
  596. configure:6544: creating ./config.status
  597.  
  598. ## ---------------------- ##
  599. ## Running config.status. ##
  600. ## ---------------------- ##
  601.  
  602. This file was extended by znc config.status 1.3, which was
  603. generated by GNU Autoconf 2.69.  Invocation command line was
  604.  
  605.  CONFIG_FILES    =
  606.  CONFIG_HEADERS  =
  607.  CONFIG_LINKS    =
  608.  CONFIG_COMMANDS =
  609.  $ ./config.status
  610.  
  611. on cal
  612.  
  613. config.status:855: creating Makefile
  614. config.status:855: creating znc-buildmod
  615. config.status:855: creating man/Makefile
  616. config.status:855: creating znc.pc
  617. config.status:855: creating znc-uninstalled.pc
  618. config.status:855: creating modules/Makefile
  619. config.status:855: creating test/Makefile
  620. config.status:855: creating include/znc/zncconfig.h
  621. config.status:1030: include/znc/zncconfig.h is unchanged
  622.  
  623. ## ---------------- ##
  624. ## Cache variables. ##
  625. ## ---------------- ##
  626.  
  627. ac_cv_build=x86_64-unknown-linux-gnu
  628. ac_cv_cxx_compiler_gnu=yes
  629. ac_cv_env_CCC_set=
  630. ac_cv_env_CCC_value=
  631. ac_cv_env_CPPFLAGS_set=
  632. ac_cv_env_CPPFLAGS_value=
  633. ac_cv_env_CXXCPP_set=
  634. ac_cv_env_CXXCPP_value=
  635. ac_cv_env_CXXFLAGS_set=
  636. ac_cv_env_CXXFLAGS_value=
  637. ac_cv_env_CXX_set=
  638. ac_cv_env_CXX_value=
  639. ac_cv_env_LDFLAGS_set=
  640. ac_cv_env_LDFLAGS_value=
  641. ac_cv_env_LIBS_set=
  642. ac_cv_env_LIBS_value=
  643. ac_cv_env_PKG_CONFIG_LIBDIR_set=
  644. ac_cv_env_PKG_CONFIG_LIBDIR_value=
  645. ac_cv_env_PKG_CONFIG_PATH_set=
  646. ac_cv_env_PKG_CONFIG_PATH_value=
  647. ac_cv_env_PKG_CONFIG_set=
  648. ac_cv_env_PKG_CONFIG_value=
  649. ac_cv_env_build_alias_set=
  650. ac_cv_env_build_alias_value=
  651. ac_cv_env_host_alias_set=
  652. ac_cv_env_host_alias_value=
  653. ac_cv_env_openssl_CFLAGS_set=
  654. ac_cv_env_openssl_CFLAGS_value=
  655. ac_cv_env_openssl_LIBS_set=
  656. ac_cv_env_openssl_LIBS_value=
  657. ac_cv_env_python_CFLAGS_set=
  658. ac_cv_env_python_CFLAGS_value=
  659. ac_cv_env_python_LIBS_set=
  660. ac_cv_env_python_LIBS_value=
  661. ac_cv_env_target_alias_set=
  662. ac_cv_env_target_alias_value=
  663. ac_cv_func_Tcl_CreateInterp=yes
  664. ac_cv_func_getopt_long=yes
  665. ac_cv_func_getphassphrase=no
  666. ac_cv_func_lstat=yes
  667. ac_cv_host=x86_64-unknown-linux-gnu
  668. ac_cv_lib_gnugetopt_getopt_long=no
  669. ac_cv_lib_sasl2_sasl_server_init=yes
  670. ac_cv_objext=o
  671. ac_cv_path_EGREP='/bin/grep -E'
  672. ac_cv_path_GIT=/usr/bin/git
  673. ac_cv_path_GNUMAKE=/usr/bin/make
  674. ac_cv_path_GREP=/bin/grep
  675. ac_cv_path_SED=/bin/sed
  676. ac_cv_path_ac_pt_PKG_CONFIG=/usr/bin/pkg-config
  677. ac_cv_path_install='/usr/bin/install -c'
  678. ac_cv_prog_CXXCPP='g++ -E'
  679. ac_cv_prog_ac_ct_CXX=g++
  680. ac_cv_prog_cxx_g=yes
  681. ac_cv_search_dlopen=-ldl
  682. ac_cv_sys_file_offset_bits=no
  683. ac_cv_sys_largefile_CC=no
  684. am_cv_func_iconv=yes
  685. am_cv_func_iconv_works=yes
  686. am_cv_lib_iconv=no
  687. am_cv_proto_iconv='extern size_t iconv (iconv_t cd, char * *inbuf, size_t *inbytesleft, char * *outbuf, size_t *outbytesleft);'
  688. am_cv_proto_iconv_arg1=
  689. ax_cv_PTHREAD_PRIO_INHERIT=yes
  690. pkg_cv_openssl_CFLAGS=' '
  691. pkg_cv_openssl_LIBS='-lssl -lcrypto  '
  692. znc_cv_cc_vis_werror=yes
  693. znc_cv_cc_visibility=yes
  694.  
  695. ## ----------------- ##
  696. ## Output variables. ##
  697. ## ----------------- ##
  698.  
  699. CFLAG_VISIBILITY='-fvisibility=hidden'
  700. CHARSET=''
  701. CPPFLAGS=''
  702. CXX='g++'
  703. CXXCPP='g++ -E'
  704. CXXFLAGS='  -D_FORTIFY_SOURCE=2 -O2 -Wall -W -Wno-unused-parameter -Woverloaded-virtual -Wshadow -pthread   -include znc/zncconfig.h'
  705. CYRUS='1'
  706. DATADIR='${datarootdir}/znc'
  707. DEFS='-DHAVE_CONFIG_H'
  708. ECHO_C=''
  709. ECHO_N='-n'
  710. ECHO_T=''
  711. EGREP='/bin/grep -E'
  712. EXEEXT=''
  713. GIT='/usr/bin/git'
  714. GREP='/bin/grep'
  715. GTEST_DIR=''
  716. HAVE_ICONV='1'
  717. HAVE_SYSTEMD_FALSE=''
  718. HAVE_SYSTEMD_TRUE='#'
  719. HAVE_VISIBILITY='1'
  720. INSTALL_DATA='${INSTALL} -m 644'
  721. INSTALL_PROGRAM='${INSTALL}'
  722. INSTALL_SCRIPT='${INSTALL}'
  723. ISCYGWIN=''
  724. LDFLAGS='-Wl,--export-dynamic'
  725. LIBICONV=''
  726. LIBOBJS=''
  727. LIBS='-ldl  -pthread -lssl -lcrypto   -lz'
  728. LIBZNC=''
  729. LIBZNCDIR=''
  730. LTLIBICONV=''
  731. LTLIBOBJS=''
  732. MODDIR='${exec_prefix}/lib/znc'
  733. MODFLAGS='  -D_FORTIFY_SOURCE=2 -O2 -Wall -W -Wno-unused-parameter -Woverloaded-virtual -Wshadow -pthread   -fvisibility=hidden -fPIC'
  734. MODLINK='-shared'
  735. NOSSL=''
  736. OBJEXT='o'
  737. PACKAGE_BUGREPORT=''
  738. PACKAGE_NAME='znc'
  739. PACKAGE_STRING='znc 1.3'
  740. PACKAGE_TARNAME='znc'
  741. PACKAGE_URL=''
  742. PACKAGE_VERSION='1.3'
  743. PATH_SEPARATOR=':'
  744. PERL='no'
  745. PERL_BINARY=''
  746. PKG_CONFIG='/usr/bin/pkg-config'
  747. PKG_CONFIG_LIBDIR=''
  748. PKG_CONFIG_PATH=''
  749. PTHREAD_CC=''
  750. PTHREAD_CFLAGS='-pthread'
  751. PTHREAD_LIBS='-pthread'
  752. PYTHON='no'
  753. SED='/bin/sed'
  754. SHELL='/bin/sh'
  755. SWIG=''
  756. SWIG_LIB=''
  757. TCL_FLAGS='-I/usr/include/tcl8.4 -L/usr/lib -ltcl8.4'
  758. ac_ct_CXX='g++'
  759. ax_pthread_config=''
  760. bindir='${exec_prefix}/bin'
  761. build='x86_64-unknown-linux-gnu'
  762. build_alias=''
  763. build_cpu='x86_64'
  764. build_os='linux-gnu'
  765. build_vendor='unknown'
  766. datadir='${datarootdir}'
  767. datarootdir='${prefix}/share'
  768. docdir='${datarootdir}/doc/${PACKAGE_TARNAME}'
  769. dvidir='${docdir}'
  770. exec_prefix='${prefix}'
  771. host='x86_64-unknown-linux-gnu'
  772. host_alias=''
  773. host_cpu='x86_64'
  774. host_os='linux-gnu'
  775. host_vendor='unknown'
  776. htmldir='${docdir}'
  777. includedir='${prefix}/include'
  778. infodir='${datarootdir}/info'
  779. libdir='${exec_prefix}/lib'
  780. libexecdir='${exec_prefix}/libexec'
  781. localedir='${datarootdir}/locale'
  782. localstatedir='${prefix}/var'
  783. mandir='${datarootdir}/man'
  784. oldincludedir='/usr/include'
  785. openssl_CFLAGS=' '
  786. openssl_LIBS='-lssl -lcrypto  '
  787. pdfdir='${docdir}'
  788. prefix='/home/swarfega/znc'
  789. program_transform_name='s,x,x,'
  790. psdir='${docdir}'
  791. python_CFLAGS=''
  792. python_LIBS=''
  793. sbindir='${exec_prefix}/sbin'
  794. sharedstatedir='${prefix}/com'
  795. sysconfdir='${prefix}/etc'
  796. systemdsystemunitdir=''
  797. target_alias=''
  798.  
  799. ## ----------- ##
  800. ## confdefs.h. ##
  801. ## ----------- ##
  802.  
  803. /* confdefs.h */
  804. #define PACKAGE_NAME "znc"
  805. #define PACKAGE_TARNAME "znc"
  806. #define PACKAGE_VERSION "1.3"
  807. #define PACKAGE_STRING "znc 1.3"
  808. #define PACKAGE_BUGREPORT ""
  809. #define PACKAGE_URL ""
  810. #define HAVE_VISIBILITY 1
  811. #define HAVE_IPV6 1
  812. #define CSOCK_USE_POLL 1
  813. #define HAVE_LSTAT 1
  814. #define HAVE_GETOPT_LONG 1
  815. #define HAVE_PTHREAD_PRIO_INHERIT 1
  816. #define HAVE_PTHREAD 1
  817. #define HAVE_THREADED_DNS 1
  818. #define HAVE_LIBSSL 1
  819. #define HAVE_ZLIB 1
  820. #define HAVE_ICONV 1
  821. #define ICONV_CONST
  822.  
  823. configure: exit 0
Advertisement
Add Comment
Please, Sign In to add comment