Guest User

Test2

a guest
May 14th, 2019
104
0
Never
Not a member of Pastebin yet? Sign Up, it unlocks many cool features!
text 8.99 KB | None | 0 0
  1. Java plugin detected, adding integration...
  2. ForgeGradle plugin detected, adding integration...
  3. #################################################
  4. ForgeGradle 2.2-SNAPSHOT-3966cea
  5. https://github.com/MinecraftForge/ForgeGradle
  6. #################################################
  7. Powered by MCP unknown
  8. http://modcoderpack.com
  9. by: Searge, ProfMobius, Fesh0r,
  10. R4wk, ZeuX, IngisKahn, bspkrs
  11. #################################################
  12. file or directory 'F:\test\Diorite_Trapdoors-masterEdit\src\api\resources', not found
  13. All projects evaluated.
  14. Selected primary task 'build' from project :
  15. Tasks to be executed: [task ':deobfCompileDummyTask', task ':getVersionJson', task ':extractUserdev', task ':downloadClient', task ':downloadServer', task ':splitServerJar', task ':mergeJars', task ':applyBinaryPatches', task ':deobfProvidedDummyTask', task ':extractDependencyATs', task ':extractMcpData', task ':extractMcpMappings', task ':genSrgs', task ':deobfMcMCP', task ':sourceApiJava', task ':compileApiJava', task ':processApiResources', task ':apiClasses', task ':sourceMainJava', task ':compileJava', task ':processResources', task ':classes', task ':jar', task ':sourceTestJava', task ':compileTestJava', task ':processTestResources', task ':testClasses', task ':test', task ':reobfJar', task ':extractRangemapReplacedMain', task ':retromapReplacedMain', task ':sourceJar', task ':assemble', task ':check', task ':build']
  16. :deobfCompileDummyTask (Thread[main,5,main]) started.
  17. :deobfCompileDummyTask
  18. Executing task ':deobfCompileDummyTask' (up-to-date check took 0.0 secs) due to:
  19. Task has not declared any outputs.
  20. :deobfCompileDummyTask (Thread[main,5,main]) completed. Took 0.031 secs.
  21. :getVersionJson (Thread[main,5,main]) started.
  22. :getVersionJson
  23. Executing task ':getVersionJson' (up-to-date check took 0.015 secs) due to:
  24. Task.upToDateWhen is false.
  25. :getVersionJson (Thread[main,5,main]) completed. Took 0.254 secs.
  26. :extractUserdev (Thread[main,5,main]) started.
  27. :extractUserdev
  28. Skipping task ':extractUserdev' as it is up-to-date (took 0.151 secs).
  29. :extractUserdev UP-TO-DATE
  30. :extractUserdev (Thread[main,5,main]) completed. Took 0.151 secs.
  31. :downloadClient (Thread[main,5,main]) started.
  32. :downloadClient
  33. Skipping task ':downloadClient' as task onlyIf is false.
  34. :downloadClient SKIPPED
  35. :downloadClient (Thread[main,5,main]) completed. Took 1.301 secs.
  36. :downloadServer (Thread[main,5,main]) started.
  37. :downloadServer
  38. Skipping task ':downloadServer' as task onlyIf is false.
  39. :downloadServer SKIPPED
  40. :downloadServer (Thread[main,5,main]) completed. Took 1.608 secs.
  41. :splitServerJar (Thread[main,5,main]) started.
  42. :splitServerJar
  43. Skipping task ':splitServerJar' as task onlyIf is false.
  44. :splitServerJar SKIPPED
  45. :splitServerJar (Thread[main,5,main]) completed. Took 3.617 secs.
  46. :mergeJars (Thread[main,5,main]) started.
  47. :mergeJars
  48. Skipping task ':mergeJars' as task onlyIf is false.
  49. :mergeJars SKIPPED
  50. :mergeJars (Thread[main,5,main]) completed. Took 3.1 secs.
  51. :applyBinaryPatches (Thread[main,5,main]) started.
  52. :applyBinaryPatches
  53. Skipping task ':applyBinaryPatches' as task onlyIf is false.
  54. :applyBinaryPatches SKIPPED
  55. :applyBinaryPatches (Thread[main,5,main]) completed. Took 1.792 secs.
  56. :deobfProvidedDummyTask (Thread[main,5,main]) started.
  57. :deobfProvidedDummyTask
  58. Executing task ':deobfProvidedDummyTask' (up-to-date check took 0.0 secs) due to:
  59. Task has not declared any outputs.
  60. :deobfProvidedDummyTask (Thread[main,5,main]) completed. Took 0.016 secs.
  61. :extractDependencyATs (Thread[main,5,main]) started.
  62. :extractDependencyATs
  63. Skipping task ':extractDependencyATs' as task onlyIf is false.
  64. :extractDependencyATs SKIPPED
  65. :extractDependencyATs (Thread[main,5,main]) completed. Took 0.0 secs.
  66. :extractMcpData (Thread[main,5,main]) started.
  67. :extractMcpData
  68. Skipping task ':extractMcpData' as task onlyIf is false.
  69. :extractMcpData SKIPPED
  70. :extractMcpData (Thread[main,5,main]) completed. Took 4.775 secs.
  71. :extractMcpMappings (Thread[main,5,main]) started.
  72. :extractMcpMappings
  73. Skipping task ':extractMcpMappings' as task onlyIf is false.
  74. :extractMcpMappings SKIPPED
  75. :extractMcpMappings (Thread[main,5,main]) completed. Took 1.344 secs.
  76. :genSrgs (Thread[main,5,main]) started.
  77. :genSrgs
  78. Skipping task ':genSrgs' as task onlyIf is false.
  79. :genSrgs SKIPPED
  80. :genSrgs (Thread[main,5,main]) completed. Took 1.137 secs.
  81. :deobfMcMCP (Thread[main,5,main]) started.
  82. :deobfMcMCP
  83. Skipping task ':deobfMcMCP' as task onlyIf is false.
  84. :deobfMcMCP SKIPPED
  85. :deobfMcMCP (Thread[main,5,main]) completed. Took 2.237 secs.
  86. :sourceApiJava (Thread[main,5,main]) started.
  87. :sourceApiJava
  88. file or directory 'F:\test\Diorite_Trapdoors-masterEdit\src\api\java', not found
  89. Skipping task ':sourceApiJava' as it is up-to-date (took 0.016 secs).
  90. :sourceApiJava UP-TO-DATE
  91. :sourceApiJava (Thread[main,5,main]) completed. Took 0.016 secs.
  92. :compileApiJava (Thread[main,5,main]) started.
  93. :compileApiJava
  94. Skipping task ':compileApiJava' as it has no source files.
  95. :compileApiJava UP-TO-DATE
  96. :compileApiJava (Thread[main,5,main]) completed. Took 0.0 secs.
  97. :processApiResources (Thread[main,5,main]) started.
  98. :processApiResources
  99. file or directory 'F:\test\Diorite_Trapdoors-masterEdit\src\api\resources', not found
  100. Skipping task ':processApiResources' as it has no source files.
  101. :processApiResources UP-TO-DATE
  102. :processApiResources (Thread[main,5,main]) completed. Took 0.0 secs.
  103. :apiClasses (Thread[main,5,main]) started.
  104. :apiClasses
  105. Skipping task ':apiClasses' as it has no actions.
  106. :apiClasses UP-TO-DATE
  107. :apiClasses (Thread[main,5,main]) completed. Took 0.0 secs.
  108. :sourceMainJava (Thread[main,5,main]) started.
  109. :sourceMainJava
  110. Skipping task ':sourceMainJava' as it is up-to-date (took 0.123 secs).
  111. :sourceMainJava UP-TO-DATE
  112. :sourceMainJava (Thread[main,5,main]) completed. Took 0.123 secs.
  113. :compileJava (Thread[main,5,main]) started.
  114. :compileJava
  115. file or directory 'F:\test\Diorite_Trapdoors-masterEdit\libs', not found
  116. Executing task ':compileJava' (up-to-date check took 3.216 secs) due to:
  117. No history is available.
  118. All input files are considered out-of-date for incremental task ':compileJava'.
  119. file or directory 'F:\test\Diorite_Trapdoors-masterEdit\libs', not found
  120. Compiling with JDK Java compiler API.
  121. F:\test\Diorite_Trapdoors-masterEdit\build\sources\main\java\de\Mari_023\diorite_trapdoors\blocks\BlockTrapDoor.java:17: error: cannot find symbol
  122. import net.minecraft.block.state.BlockFaceShape;
  123. ^
  124. symbol: class BlockFaceShape
  125. location: package net.minecraft.block.state
  126. F:\test\Diorite_Trapdoors-masterEdit\build\sources\main\java\de\Mari_023\diorite_trapdoors\blocks\BlockTrapDoor.java:280: error: cannot find symbol
  127. public BlockFaceShape getBlockFaceShape(IBlockAccess worldIn, IBlockState state, BlockPos pos, EnumFacing face)
  128. ^
  129. symbol: class BlockFaceShape
  130. location: class BlockTrapDoor
  131. F:\test\Diorite_Trapdoors-masterEdit\build\sources\main\java\de\Mari_023\diorite_trapdoors\blocks\BlockTrapDoor.java:282: error: cannot find symbol
  132. return (face == EnumFacing.UP && state.getValue(HALF) == BlockTrapDoor.DoorHalf.TOP || face == EnumFacing.DOWN && state.getValue(HALF) == BlockTrapDoor.DoorHalf.BOTTOM) && !((Boolean)state.getValue(OPEN)).booleanValue() ? BlockFaceShape.SOLID : BlockFaceShape.UNDEFINED;
  133. ^
  134. symbol: variable BlockFaceShape
  135. location: class BlockTrapDoor
  136. F:\test\Diorite_Trapdoors-masterEdit\build\sources\main\java\de\Mari_023\diorite_trapdoors\blocks\BlockTrapDoor.java:282: error: cannot find symbol
  137. return (face == EnumFacing.UP && state.getValue(HALF) == BlockTrapDoor.DoorHalf.TOP || face == EnumFacing.DOWN && state.getValue(HALF) == BlockTrapDoor.DoorHalf.BOTTOM) && !((Boolean)state.getValue(OPEN)).booleanValue() ? BlockFaceShape.SOLID : BlockFaceShape.UNDEFINED;
  138. ^
  139. symbol: variable BlockFaceShape
  140. location: class BlockTrapDoor
  141. Note: F:\test\Diorite_Trapdoors-masterEdit\build\sources\main\java\de\Mari_023\diorite_trapdoors\blocks\BlockTrapDoor.java uses or overrides a deprecated API.
  142. Note: Recompile with -Xlint:deprecation for details.
  143. 4 errors
  144. :compileJava FAILED
  145. :compileJava (Thread[main,5,main]) completed. Took 5.504 secs.
  146.  
  147. FAILURE: Build failed with an exception.
  148.  
  149. * What went wrong:
  150. Execution failed for task ':compileJava'.
  151. > Compilation failed; see the compiler error output for details.
  152.  
  153. * Try:
  154. Run with --stacktrace option to get the stack trace. Run with --debug option to get more log output.
  155.  
  156. BUILD FAILED
  157.  
  158. Total time: 45.61 secs
Advertisement
Add Comment
Please, Sign In to add comment