A-Vladimir

ai log 3

Nov 9th, 2025
62
0
Never
Not a member of Pastebin yet? Sign Up, it unlocks many cool features!
text 139.18 KB | None | 0 0
  1.    /mnt/Linux F/Invoke-/python311    master !1 ?2  makepkg -si  ✔
  2. ==> Making package: python311 3.11.14-1 (Mon Nov 10 01:14:09 2025)
  3. ==> Checking runtime dependencies...
  4. ==> Checking buildtime dependencies...
  5. ==> Retrieving sources...
  6. -> Found Python-3.11.14.tar.xz
  7. -> Found EXTERNALLY-MANAGED
  8. ==> Validating source files with sha256sums...
  9. Python-3.11.14.tar.xz ... Passed
  10. EXTERNALLY-MANAGED ... Passed
  11. ==> Extracting sources...
  12. -> Extracting Python-3.11.14.tar.xz with bsdtar
  13. ==> Starting prepare()...
  14. ==> Removing existing $pkgdir/ directory...
  15. ==> Starting build()...
  16. checking build system type... x86_64-pc-linux-gnu
  17. checking host system type... x86_64-pc-linux-gnu
  18. checking for Python interpreter freezing... ./_bootstrap_python
  19. checking for python3.11... no
  20. checking for python3.10... no
  21. checking for python3.9... no
  22. checking for python3.8... no
  23. checking for python3.7... no
  24. checking for python3.6... no
  25. checking for python3... python3
  26. checking Python for regen version... Python 3.13.7
  27. checking for pkg-config... /usr/bin/pkg-config
  28. checking pkg-config is at least version 0.9.0... yes
  29. checking for --enable-universalsdk... no
  30. checking for --with-universal-archs... no
  31. checking MACHDEP... "linux"
  32. checking for gcc... gcc
  33. checking whether the C compiler works... yes
  34. checking for C compiler default output file name... a.out
  35. checking for suffix of executables...
  36. checking whether we are cross compiling... no
  37. checking for suffix of object files... o
  38. checking whether we are using the GNU C compiler... yes
  39. checking whether gcc accepts -g... yes
  40. checking for gcc option to accept ISO C89... none needed
  41. checking how to run the C preprocessor... gcc -E
  42. checking for grep that handles long lines and -e... /usr/bin/grep
  43. checking for a sed that does not truncate output... /usr/bin/sed
  44. checking for egrep... /usr/bin/grep -E
  45. checking for CC compiler name... gcc
  46. checking for ANSI C header files... yes
  47. checking for sys/types.h... yes
  48. checking for sys/stat.h... yes
  49. checking for stdlib.h... yes
  50. checking for string.h... yes
  51. checking for memory.h... yes
  52. checking for strings.h... yes
  53. checking for inttypes.h... yes
  54. checking for stdint.h... yes
  55. checking for unistd.h... yes
  56. checking minix/config.h usability... no
  57. checking minix/config.h presence... no
  58. checking for minix/config.h... no
  59. checking whether it is safe to define __EXTENSIONS__... yes
  60. checking for --with-cxx-main=<compiler>... no
  61. checking for g++... no
  62. configure:
  63.  
  64. By default, distutils will build C++ extension modules with "g++".
  65. If this is not intended, then set CXX on the configure command line.
  66.  
  67. checking for the platform triplet based on compiler characteristics... x86_64-linux-gnu
  68. checking for multiarch...
  69. checking for PEP 11 support tier... x86_64-pc-linux-gnu/gcc has tier 1 (supported)
  70. checking for -Wl,--no-as-needed... yes
  71. checking for the Android API level... not Android
  72. checking for --with-emscripten-target...
  73. checking for --enable-wasm-dynamic-linking... missing
  74. checking for --enable-wasm-pthreads... missing
  75. checking for --with-suffix...
  76. checking for case-insensitive build directory... no
  77. checking LIBRARY... libpython$(VERSION)$(ABIFLAGS).a
  78. checking LINKCC... $(PURIFY) $(MAINCC)
  79. checking EXPORTSYMS...
  80. checking for GNU ld... yes
  81. checking for --enable-shared... yes
  82. checking for --with-static-libpython... yes
  83. checking for --enable-profiling... no
  84. checking LDLIBRARY... checking HOSTRUNNER...
  85. libpython$(LDVERSION).so
  86. checking for ar... ar
  87. checking for readelf... readelf
  88. checking for a BSD-compatible install... /usr/bin/install -c
  89. checking for a thread-safe mkdir -p... /usr/bin/mkdir -p
  90. checking for --with-pydebug... no
  91. checking for --with-trace-refs... no
  92. checking for --enable-pystats... no
  93. checking for --with-assertions... no
  94. checking for --enable-optimizations... no
  95. checking PROFILE_TASK... -m test --pgo --timeout=$(TESTTIMEOUT)
  96. checking for --with-lto... no
  97. checking for llvm-profdata... no
  98. checking if gcc supports -Og optimization level... yes
  99. checking if we can add -Wextra... no
  100. checking whether gcc -fno-strict-aliasing accepts and needs -fno-strict-aliasing... no
  101. checking if we can disable gcc unused-parameter warning... no
  102. checking if we can disable gcc int-conversion warning... no
  103. checking if we can disable gcc missing-field-initializers warning... no
  104. checking if we can enable gcc sign-compare warning... no
  105. checking if we can enable gcc unreachable-code warning... no
  106. checking if we can enable gcc strict-prototypes warning... no
  107. checking if we can make implicit function declaration an error in gcc -Werror=implicit-function-declaration... yes
  108. checking if we can use visibility in gcc -fvisibility=hidden... yes
  109. checking whether pthreads are available without options... yes
  110. checking whether g++ also accepts flags for thread support... no
  111. checking alloca.h usability... yes
  112. checking alloca.h presence... yes
  113. checking for alloca.h... yes
  114. checking asm/types.h usability... yes
  115. checking asm/types.h presence... yes
  116. checking for asm/types.h... yes
  117. checking bluetooth.h usability... no
  118. checking bluetooth.h presence... no
  119. checking for bluetooth.h... no
  120. checking conio.h usability... no
  121. checking conio.h presence... no
  122. checking for conio.h... no
  123. checking crypt.h usability... yes
  124. checking crypt.h presence... yes
  125. checking for crypt.h... yes
  126. checking direct.h usability... no
  127. checking direct.h presence... no
  128. checking for direct.h... no
  129. checking dlfcn.h usability... yes
  130. checking dlfcn.h presence... yes
  131. checking for dlfcn.h... yes
  132. checking endian.h usability... yes
  133. checking endian.h presence... yes
  134. checking for endian.h... yes
  135. checking errno.h usability... yes
  136. checking errno.h presence... yes
  137. checking for errno.h... yes
  138. checking fcntl.h usability... yes
  139. checking fcntl.h presence... yes
  140. checking for fcntl.h... yes
  141. checking grp.h usability... yes
  142. checking grp.h presence... yes
  143. checking for grp.h... yes
  144. checking ieeefp.h usability... no
  145. checking ieeefp.h presence... no
  146. checking for ieeefp.h... no
  147. checking io.h usability... no
  148. checking io.h presence... no
  149. checking for io.h... no
  150. checking langinfo.h usability... yes
  151. checking langinfo.h presence... yes
  152. checking for langinfo.h... yes
  153. checking libintl.h usability... yes
  154. checking libintl.h presence... yes
  155. checking for libintl.h... yes
  156. checking libutil.h usability... no
  157. checking libutil.h presence... no
  158. checking for libutil.h... no
  159. checking linux/auxvec.h usability... yes
  160. checking linux/auxvec.h presence... yes
  161. checking for linux/auxvec.h... yes
  162. checking sys/auxv.h usability... yes
  163. checking sys/auxv.h presence... yes
  164. checking for sys/auxv.h... yes
  165. checking linux/limits.h usability... yes
  166. checking linux/limits.h presence... yes
  167. checking for linux/limits.h... yes
  168. checking linux/memfd.h usability... yes
  169. checking linux/memfd.h presence... yes
  170. checking for linux/memfd.h... yes
  171. checking linux/random.h usability... yes
  172. checking linux/random.h presence... yes
  173. checking for linux/random.h... yes
  174. checking linux/soundcard.h usability... yes
  175. checking linux/soundcard.h presence... yes
  176. checking for linux/soundcard.h... yes
  177. checking linux/tipc.h usability... yes
  178. checking linux/tipc.h presence... yes
  179. checking for linux/tipc.h... yes
  180. checking linux/wait.h usability... yes
  181. checking linux/wait.h presence... yes
  182. checking for linux/wait.h... yes
  183. checking netdb.h usability... yes
  184. checking netdb.h presence... yes
  185. checking for netdb.h... yes
  186. checking netinet/in.h usability... yes
  187. checking netinet/in.h presence... yes
  188. checking for netinet/in.h... yes
  189. checking netpacket/packet.h usability... yes
  190. checking netpacket/packet.h presence... yes
  191. checking for netpacket/packet.h... yes
  192. checking poll.h usability... yes
  193. checking poll.h presence... yes
  194. checking for poll.h... yes
  195. checking process.h usability... no
  196. checking process.h presence... no
  197. checking for process.h... no
  198. checking pthread.h usability... yes
  199. checking pthread.h presence... yes
  200. checking for pthread.h... yes
  201. checking pty.h usability... yes
  202. checking pty.h presence... yes
  203. checking for pty.h... yes
  204. checking sched.h usability... yes
  205. checking sched.h presence... yes
  206. checking for sched.h... yes
  207. checking setjmp.h usability... yes
  208. checking setjmp.h presence... yes
  209. checking for setjmp.h... yes
  210. checking shadow.h usability... yes
  211. checking shadow.h presence... yes
  212. checking for shadow.h... yes
  213. checking signal.h usability... yes
  214. checking signal.h presence... yes
  215. checking for signal.h... yes
  216. checking spawn.h usability... yes
  217. checking spawn.h presence... yes
  218. checking for spawn.h... yes
  219. checking stropts.h usability... no
  220. checking stropts.h presence... no
  221. checking for stropts.h... no
  222. checking sys/audioio.h usability... no
  223. checking sys/audioio.h presence... no
  224. checking for sys/audioio.h... no
  225. checking sys/bsdtty.h usability... no
  226. checking sys/bsdtty.h presence... no
  227. checking for sys/bsdtty.h... no
  228. checking sys/devpoll.h usability... no
  229. checking sys/devpoll.h presence... no
  230. checking for sys/devpoll.h... no
  231. checking sys/endian.h usability... no
  232. checking sys/endian.h presence... no
  233. checking for sys/endian.h... no
  234. checking sys/epoll.h usability... yes
  235. checking sys/epoll.h presence... yes
  236. checking for sys/epoll.h... yes
  237. checking sys/event.h usability... no
  238. checking sys/event.h presence... no
  239. checking for sys/event.h... no
  240. checking sys/eventfd.h usability... yes
  241. checking sys/eventfd.h presence... yes
  242. checking for sys/eventfd.h... yes
  243. checking sys/file.h usability... yes
  244. checking sys/file.h presence... yes
  245. checking for sys/file.h... yes
  246. checking sys/ioctl.h usability... yes
  247. checking sys/ioctl.h presence... yes
  248. checking for sys/ioctl.h... yes
  249. checking sys/kern_control.h usability... no
  250. checking sys/kern_control.h presence... no
  251. checking for sys/kern_control.h... no
  252. checking sys/loadavg.h usability... no
  253. checking sys/loadavg.h presence... no
  254. checking for sys/loadavg.h... no
  255. checking sys/lock.h usability... no
  256. checking sys/lock.h presence... no
  257. checking for sys/lock.h... no
  258. checking sys/memfd.h usability... no
  259. checking sys/memfd.h presence... no
  260. checking for sys/memfd.h... no
  261. checking sys/mkdev.h usability... no
  262. checking sys/mkdev.h presence... no
  263. checking for sys/mkdev.h... no
  264. checking sys/mman.h usability... yes
  265. checking sys/mman.h presence... yes
  266. checking for sys/mman.h... yes
  267. checking sys/modem.h usability... no
  268. checking sys/modem.h presence... no
  269. checking for sys/modem.h... no
  270. checking sys/param.h usability... yes
  271. checking sys/param.h presence... yes
  272. checking for sys/param.h... yes
  273. checking sys/poll.h usability... yes
  274. checking sys/poll.h presence... yes
  275. checking for sys/poll.h... yes
  276. checking sys/random.h usability... yes
  277. checking sys/random.h presence... yes
  278. checking for sys/random.h... yes
  279. checking sys/resource.h usability... yes
  280. checking sys/resource.h presence... yes
  281. checking for sys/resource.h... yes
  282. checking sys/select.h usability... yes
  283. checking sys/select.h presence... yes
  284. checking for sys/select.h... yes
  285. checking sys/sendfile.h usability... yes
  286. checking sys/sendfile.h presence... yes
  287. checking for sys/sendfile.h... yes
  288. checking sys/socket.h usability... yes
  289. checking sys/socket.h presence... yes
  290. checking for sys/socket.h... yes
  291. checking sys/soundcard.h usability... yes
  292. checking sys/soundcard.h presence... yes
  293. checking for sys/soundcard.h... yes
  294. checking for sys/stat.h... (cached) yes
  295. checking sys/statvfs.h usability... yes
  296. checking sys/statvfs.h presence... yes
  297. checking for sys/statvfs.h... yes
  298. checking sys/sys_domain.h usability... no
  299. checking sys/sys_domain.h presence... no
  300. checking for sys/sys_domain.h... no
  301. checking sys/syscall.h usability... yes
  302. checking sys/syscall.h presence... yes
  303. checking for sys/syscall.h... yes
  304. checking sys/sysmacros.h usability... yes
  305. checking sys/sysmacros.h presence... yes
  306. checking for sys/sysmacros.h... yes
  307. checking sys/termio.h usability... no
  308. checking sys/termio.h presence... no
  309. checking for sys/termio.h... no
  310. checking sys/time.h usability... yes
  311. checking sys/time.h presence... yes
  312. checking for sys/time.h... yes
  313. checking sys/times.h usability... yes
  314. checking sys/times.h presence... yes
  315. checking for sys/times.h... yes
  316. checking for sys/types.h... (cached) yes
  317. checking sys/uio.h usability... yes
  318. checking sys/uio.h presence... yes
  319. checking for sys/uio.h... yes
  320. checking sys/un.h usability... yes
  321. checking sys/un.h presence... yes
  322. checking for sys/un.h... yes
  323. checking sys/utsname.h usability... yes
  324. checking sys/utsname.h presence... yes
  325. checking for sys/utsname.h... yes
  326. checking sys/wait.h usability... yes
  327. checking sys/wait.h presence... yes
  328. checking for sys/wait.h... yes
  329. checking sys/xattr.h usability... yes
  330. checking sys/xattr.h presence... yes
  331. checking for sys/xattr.h... yes
  332. checking sysexits.h usability... yes
  333. checking sysexits.h presence... yes
  334. checking for sysexits.h... yes
  335. checking syslog.h usability... yes
  336. checking syslog.h presence... yes
  337. checking for syslog.h... yes
  338. checking termios.h usability... yes
  339. checking termios.h presence... yes
  340. checking for termios.h... yes
  341. checking util.h usability... no
  342. checking util.h presence... no
  343. checking for util.h... no
  344. checking utime.h usability... yes
  345. checking utime.h presence... yes
  346. checking for utime.h... yes
  347. checking utmp.h usability... yes
  348. checking utmp.h presence... yes
  349. checking for utmp.h... yes
  350. checking for dirent.h that defines DIR... yes
  351. checking for library containing opendir... none required
  352. checking whether sys/types.h defines makedev... no
  353. checking for sys/mkdev.h... (cached) no
  354. checking for sys/sysmacros.h... (cached) yes
  355. checking bluetooth/bluetooth.h usability... yes
  356. checking bluetooth/bluetooth.h presence... yes
  357. checking for bluetooth/bluetooth.h... yes
  358. checking for net/if.h... yes
  359. checking for linux/netlink.h... yes
  360. checking for linux/qrtr.h... yes
  361. checking for linux/vm_sockets.h... yes
  362. checking for linux/can.h... yes
  363. checking for linux/can/bcm.h... yes
  364. checking for linux/can/j1939.h... yes
  365. checking for linux/can/raw.h... yes
  366. checking for netcan/can.h... no
  367. checking for clock_t in time.h... yes
  368. checking for makedev... yes
  369. checking for le64toh... yes
  370. checking for mode_t... yes
  371. checking for off_t... yes
  372. checking for pid_t... yes
  373. checking for size_t... yes
  374. checking for uid_t in sys/types.h... yes
  375. checking for ssize_t... yes
  376. checking for __uint128_t... yes
  377. checking size of int... 4
  378. checking size of long... 8
  379. checking alignment of long... 8
  380. checking size of long long... 8
  381. checking size of void *... 8
  382. checking size of short... 2
  383. checking size of float... 4
  384. checking size of double... 8
  385. checking size of fpos_t... 16
  386. checking size of size_t... 8
  387. checking alignment of size_t... 8
  388. checking size of pid_t... 4
  389. checking size of uintptr_t... 8
  390. checking for long double... yes
  391. checking size of long double... 16
  392. checking size of _Bool... 1
  393. checking size of off_t... 8
  394. checking whether to enable large file support... no
  395. checking size of time_t... 8
  396. checking for pthread_t... yes
  397. checking size of pthread_t... 8
  398. checking size of pthread_key_t... 4
  399. checking whether pthread_key_t is compatible with int... yes
  400. checking for --enable-framework... no
  401. checking for dyld... no
  402. checking for --with-address-sanitizer... no
  403. checking for --with-memory-sanitizer... no
  404. checking for --with-undefined-behavior-sanitizer... no
  405. checking the extension of shared libraries... .so
  406. checking LDSHARED... $(CC) -shared
  407. checking BLDSHARED flags... $(CC) -shared
  408. checking CCSHARED... -fPIC
  409. checking LINKFORSHARED... -Xlinker -export-dynamic
  410. checking CFLAGSFORSHARED... $(CCSHARED)
  411. checking SHLIBS... $(LIBS)
  412. checking for sendfile in -lsendfile... no
  413. checking for dlopen in -ldl... yes
  414. checking for shl_load in -ldld... no
  415. checking uuid.h usability... no
  416. checking uuid.h presence... no
  417. checking for uuid.h... no
  418. checking for LIBUUID... yes
  419. checking for library containing sem_init... none required
  420. checking for textdomain in -lintl... no
  421. checking aligned memory access is required... no
  422. checking for --with-hash-algorithm... default
  423. checking for --with-tzpath... "/usr/share/zoneinfo"
  424. checking for t_open in -lnsl... no
  425. checking for socket in -lsocket... no
  426. checking for --with-libs... no
  427. checking for --with-system-expat... yes
  428. checking for --with-system-ffi... yes
  429. checking for --with-system-libmpdec... yes
  430. checking for --with-decimal-contextvar... yes
  431. checking for decimal libmpdec machine... uint128
  432. checking for LIBNSL... yes
  433. checking rpc/rpc.h usability... yes
  434. checking rpc/rpc.h presence... yes
  435. checking for rpc/rpc.h... yes
  436. checking for LIBSQLITE3... yes
  437. checking sqlite3.h usability... yes
  438. checking sqlite3.h presence... yes
  439. checking for sqlite3.h... yes
  440. checking for sqlite3_bind_double in -lsqlite3... yes
  441. checking for sqlite3_column_decltype in -lsqlite3... yes
  442. checking for sqlite3_column_double in -lsqlite3... yes
  443. checking for sqlite3_complete in -lsqlite3... yes
  444. checking for sqlite3_enable_shared_cache in -lsqlite3... yes
  445. checking for sqlite3_progress_handler in -lsqlite3... yes
  446. checking for sqlite3_result_double in -lsqlite3... yes
  447. checking for sqlite3_set_authorizer in -lsqlite3... yes
  448. checking for sqlite3_trace_v2 in -lsqlite3... yes
  449. checking for sqlite3_value_double in -lsqlite3... yes
  450. checking for sqlite3_load_extension in -lsqlite3... yes
  451. checking for sqlite3_serialize in -lsqlite3... yes
  452. checking for --enable-loadable-sqlite-extensions... yes
  453. checking for TCLTK... yes
  454. checking gdbm.h usability... yes
  455. checking gdbm.h presence... yes
  456. checking for gdbm.h... yes
  457. checking for gdbm_open in -lgdbm... yes
  458. checking ndbm.h usability... yes
  459. checking ndbm.h presence... yes
  460. checking for ndbm.h... yes
  461. checking for dbm_open in -lndbm... no
  462. checking for dbm_open in -lgdbm_compat... yes
  463. checking gdbm/ndbm.h usability... no
  464. checking gdbm/ndbm.h presence... no
  465. checking for gdbm/ndbm.h... no
  466. checking gdbm-ndbm.h usability... no
  467. checking gdbm-ndbm.h presence... no
  468. checking for gdbm-ndbm.h... no
  469. checking db.h usability... no
  470. checking db.h presence... no
  471. checking for db.h... no
  472. checking for --with-dbmliborder... gdbm:ndbm
  473. checking if PTHREAD_SCOPE_SYSTEM is supported... yes
  474. checking for pthread_sigmask... yes
  475. checking for pthread_getcpuclockid... yes
  476. checking if --enable-ipv6 is specified... yes
  477. checking ipv6 stack type... linux-glibc
  478. checking CAN_RAW_FD_FRAMES... yes
  479. checking for CAN_RAW_JOIN_FILTERS... yes
  480. checking for --with-doc-strings... yes
  481. checking for --with-pymalloc... yes
  482. checking for --with-freelists... yes
  483. checking for --with-c-locale-coercion... yes
  484. checking for --with-valgrind... no
  485. checking for --with-dtrace... no
  486. checking for dlopen... yes
  487. checking DYNLOADFILE... dynload_shlib.o
  488. checking MACHDEP_OBJS... none
  489. checking for accept4... yes
  490. checking for alarm... yes
  491. checking for bind_textdomain_codeset... yes
  492. checking for chmod... yes
  493. checking for chown... yes
  494. checking for clock... yes
  495. checking for close_range... yes
  496. checking for confstr... yes
  497. checking for copy_file_range... yes
  498. checking for ctermid... yes
  499. checking for dup... yes
  500. checking for dup3... yes
  501. checking for execv... yes
  502. checking for explicit_bzero... yes
  503. checking for explicit_memset... no
  504. checking for faccessat... yes
  505. checking for fchmod... yes
  506. checking for fchmodat... yes
  507. checking for fchown... yes
  508. checking for fchownat... yes
  509. checking for fdopendir... yes
  510. checking for fdwalk... no
  511. checking for fexecve... yes
  512. checking for fork... yes
  513. checking for fork1... no
  514. checking for fpathconf... yes
  515. checking for fstatat... yes
  516. checking for ftime... yes
  517. checking for ftruncate... yes
  518. checking for futimens... yes
  519. checking for futimes... yes
  520. checking for futimesat... yes
  521. checking for gai_strerror... yes
  522. checking for getegid... yes
  523. checking for getentropy... yes
  524. checking for geteuid... yes
  525. checking for getgid... yes
  526. checking for getgrgid... yes
  527. checking for getgrgid_r... yes
  528. checking for getgrnam_r... yes
  529. checking for getgrouplist... yes
  530. checking for getgroups... yes
  531. checking for gethostname... yes
  532. checking for getitimer... yes
  533. checking for getloadavg... yes
  534. checking for getlogin... yes
  535. checking for getpeername... yes
  536. checking for getpgid... yes
  537. checking for getpid... yes
  538. checking for getppid... yes
  539. checking for getpriority... yes
  540. checking for _getpty... no
  541. checking for getpwent... yes
  542. checking for getpwnam_r... yes
  543. checking for getpwuid... yes
  544. checking for getpwuid_r... yes
  545. checking for getresgid... yes
  546. checking for getresuid... yes
  547. checking for getrusage... yes
  548. checking for getsid... yes
  549. checking for getspent... yes
  550. checking for getspnam... yes
  551. checking for getuid... yes
  552. checking for getwd... yes
  553. checking for if_nameindex... yes
  554. checking for initgroups... yes
  555. checking for kill... yes
  556. checking for killpg... yes
  557. checking for lchown... yes
  558. checking for linkat... yes
  559. checking for lockf... yes
  560. checking for lstat... yes
  561. checking for lutimes... yes
  562. checking for madvise... yes
  563. checking for mbrtowc... yes
  564. checking for memrchr... yes
  565. checking for mkdirat... yes
  566. checking for mkfifo... yes
  567. checking for mkfifoat... yes
  568. checking for mknod... yes
  569. checking for mknodat... yes
  570. checking for mktime... yes
  571. checking for mmap... yes
  572. checking for mremap... yes
  573. checking for nice... yes
  574. checking for openat... yes
  575. checking for opendir... yes
  576. checking for pathconf... yes
  577. checking for pause... yes
  578. checking for pipe... yes
  579. checking for pipe2... yes
  580. checking for plock... no
  581. checking for poll... yes
  582. checking for posix_fadvise... yes
  583. checking for posix_fallocate... yes
  584. checking for posix_spawn... yes
  585. checking for posix_spawnp... yes
  586. checking for pread... yes
  587. checking for preadv... yes
  588. checking for preadv2... yes
  589. checking for pthread_condattr_setclock... yes
  590. checking for pthread_init... no
  591. checking for pthread_kill... yes
  592. checking for pwrite... yes
  593. checking for pwritev... yes
  594. checking for pwritev2... yes
  595. checking for readlink... yes
  596. checking for readlinkat... yes
  597. checking for readv... yes
  598. checking for realpath... yes
  599. checking for renameat... yes
  600. checking for rtpSpawn... no
  601. checking for sched_get_priority_max... yes
  602. checking for sched_rr_get_interval... yes
  603. checking for sched_setaffinity... yes
  604. checking for sched_setparam... yes
  605. checking for sched_setscheduler... yes
  606. checking for sem_clockwait... yes
  607. checking for sem_getvalue... yes
  608. checking for sem_open... yes
  609. checking for sem_timedwait... yes
  610. checking for sem_unlink... yes
  611. checking for sendfile... yes
  612. checking for setegid... yes
  613. checking for seteuid... yes
  614. checking for setgid... yes
  615. checking for sethostname... yes
  616. checking for setitimer... yes
  617. checking for setlocale... yes
  618. checking for setpgid... yes
  619. checking for setpgrp... yes
  620. checking for setpriority... yes
  621. checking for setregid... yes
  622. checking for setresgid... yes
  623. checking for setresuid... yes
  624. checking for setreuid... yes
  625. checking for setsid... yes
  626. checking for setuid... yes
  627. checking for setvbuf... yes
  628. checking for shutdown... yes
  629. checking for sigaction... yes
  630. checking for sigaltstack... yes
  631. checking for sigfillset... yes
  632. checking for siginterrupt... yes
  633. checking for sigpending... yes
  634. checking for sigrelse... yes
  635. checking for sigtimedwait... yes
  636. checking for sigwait... yes
  637. checking for sigwaitinfo... yes
  638. checking for snprintf... yes
  639. checking for splice... yes
  640. checking for strftime... yes
  641. checking for strlcpy... yes
  642. checking for strsignal... yes
  643. checking for symlinkat... yes
  644. checking for sync... yes
  645. checking for sysconf... yes
  646. checking for system... yes
  647. checking for tcgetpgrp... yes
  648. checking for tcsetpgrp... yes
  649. checking for tempnam... yes
  650. checking for timegm... yes
  651. checking for times... yes
  652. checking for tmpfile... yes
  653. checking for tmpnam... yes
  654. checking for tmpnam_r... yes
  655. checking for truncate... yes
  656. checking for ttyname... yes
  657. checking for umask... yes
  658. checking for uname... yes
  659. checking for unlinkat... yes
  660. checking for utimensat... yes
  661. checking for utimes... yes
  662. checking for vfork... yes
  663. checking for wait... yes
  664. checking for wait3... yes
  665. checking for wait4... yes
  666. checking for waitid... yes
  667. checking for waitpid... yes
  668. checking for wcscoll... yes
  669. checking for wcsftime... yes
  670. checking for wcsxfrm... yes
  671. checking for wmemcmp... yes
  672. checking for writev... yes
  673. checking whether dirfd is declared... yes
  674. checking for chroot... yes
  675. checking for link... yes
  676. checking for symlink... yes
  677. checking for fchdir... yes
  678. checking for fsync... yes
  679. checking for fdatasync... yes
  680. checking for epoll_create... yes
  681. checking for epoll_create1... yes
  682. checking for kqueue... no
  683. checking for prlimit... yes
  684. checking for _dyld_shared_cache_contains_path... no
  685. checking for memfd_create... yes
  686. checking for eventfd... yes
  687. checking for ctermid_r... no
  688. checking for flock declaration... yes
  689. checking for flock... yes
  690. checking for getpagesize... yes
  691. checking for broken unsetenv... no
  692. checking for true... true
  693. checking for inet_aton in -lc... yes
  694. checking for chflags... no
  695. checking for lchflags... no
  696. checking for ZLIB... yes
  697. checking for BZIP2... yes
  698. checking for LIBLZMA... yes
  699. checking for hstrerror... yes
  700. checking for getservbyname... yes
  701. checking for getservbyport... yes
  702. checking for gethostbyname... yes
  703. checking for gethostbyaddr... yes
  704. checking for getprotobyname... yes
  705. checking for inet_aton... yes
  706. checking for inet_ntoa... yes
  707. checking for inet_pton... yes
  708. checking for getpeername... (cached) yes
  709. checking for getsockname... yes
  710. checking for accept... yes
  711. checking for bind... yes
  712. checking for connect... yes
  713. checking for listen... yes
  714. checking for recvfrom... yes
  715. checking for sendto... yes
  716. checking for setsockopt... yes
  717. checking for socket... yes
  718. checking for setgroups... yes
  719. checking for openpty... yes
  720. checking for library containing login_tty... none required
  721. checking for forkpty... yes
  722. checking for fseek64... no
  723. checking for fseeko... yes
  724. checking for fstatvfs... yes
  725. checking for ftell64... no
  726. checking for ftello... yes
  727. checking for statvfs... yes
  728. checking for dup2... yes
  729. checking for getpgrp... yes
  730. checking for setpgrp... (cached) yes
  731. checking for LIBCRYPT... yes
  732. checking for crypt or crypt_r... yes
  733. checking for clock_gettime... yes
  734. checking for clock_getres... yes
  735. checking for clock_settime... yes
  736. checking for clock_nanosleep... yes
  737. checking for nanosleep... yes
  738. checking for major, minor, and makedev... yes
  739. checking for getaddrinfo... yes
  740. checking getaddrinfo bug... no
  741. checking for getnameinfo... yes
  742. checking whether struct tm is in sys/time.h or time.h... time.h
  743. checking for struct tm.tm_zone... yes
  744. checking for struct stat.st_rdev... yes
  745. checking for struct stat.st_blksize... yes
  746. checking for struct stat.st_flags... no
  747. checking for struct stat.st_gen... no
  748. checking for struct stat.st_birthtime... no
  749. checking for struct stat.st_blocks... yes
  750. checking for struct passwd.pw_gecos... yes
  751. checking for struct passwd.pw_passwd... yes
  752. checking for siginfo_t.si_band... yes
  753. checking for time.h that defines altzone... no
  754. checking for addrinfo... yes
  755. checking for sockaddr_storage... yes
  756. checking for sockaddr_alg... yes
  757. checking for an ANSI C-conforming const... yes
  758. checking for working signed char... yes
  759. checking for prototypes... yes
  760. checking for variable length prototypes and stdarg.h... yes
  761. checking for socketpair... yes
  762. checking if sockaddr has sa_len member... no
  763. checking for gethostbyname_r... yes
  764. checking gethostbyname_r with 6 args... yes
  765. checking for __fpu_control... yes
  766. checking for --with-libm=STRING... default LIBM="-lm"
  767. checking for --with-libc=STRING... default LIBC=""
  768. checking for x64 gcc inline assembler... yes
  769. checking whether float word ordering is bigendian... (cached) no
  770. checking whether we can use gcc inline assembler to get and set x87 control word... yes
  771. checking whether we can use gcc inline assembler to get and set mc68881 fpcr... no
  772. checking for x87-style double rounding... no
  773. checking for acosh... yes
  774. checking for asinh... yes
  775. checking for atanh... yes
  776. checking for erf... yes
  777. checking for erfc... yes
  778. checking for expm1... yes
  779. checking for log1p... yes
  780. checking for log2... yes
  781. checking whether POSIX semaphores are enabled... yes
  782. checking for broken sem_getvalue... no
  783. checking whether RTLD_LAZY is declared... yes
  784. checking whether RTLD_NOW is declared... yes
  785. checking whether RTLD_GLOBAL is declared... yes
  786. checking whether RTLD_LOCAL is declared... yes
  787. checking whether RTLD_NODELETE is declared... yes
  788. checking whether RTLD_NOLOAD is declared... yes
  789. checking whether RTLD_DEEPBIND is declared... yes
  790. checking whether RTLD_MEMBER is declared... no
  791. checking digit size for Python's longs... no value specified
  792. checking wchar.h usability... yes
  793. checking wchar.h presence... yes
  794. checking for wchar.h... yes
  795. checking size of wchar_t... 4
  796. checking whether wchar_t is signed... yes
  797. checking whether wchar_t is usable... no
  798. checking whether byte ordering is bigendian... no
  799. checking ABIFLAGS...
  800. checking SOABI... cpython-311-x86_64-linux-gnu
  801. checking LDVERSION... $(VERSION)$(ABIFLAGS)
  802. checking for --with-platlibdir... no
  803. checking for --with-wheel-pkg-dir... no
  804. checking whether right shift extends the sign bit... yes
  805. checking for getc_unlocked() and friends... yes
  806. checking how to link readline libs... -lreadline
  807. checking whether rl_completion_append_character is declared... yes
  808. checking whether rl_completion_suppress_append is declared... yes
  809. checking for rl_pre_input_hook in -lreadline... yes
  810. checking for rl_completion_display_matches_hook in -lreadline... yes
  811. checking for rl_resize_terminal in -lreadline... yes
  812. checking for rl_completion_matches in -lreadline... yes
  813. checking whether rl_catch_signals is declared... yes
  814. checking for append_history in -lreadline... yes
  815. checking for rl_compdisp_func_t... yes
  816. checking for broken nice()... no
  817. checking for broken poll()... no
  818. checking for working tzset()... yes
  819. checking for tv_nsec in struct stat... yes
  820. checking for tv_nsec2 in struct stat... no
  821. checking curses.h usability... yes
  822. checking curses.h presence... yes
  823. checking for curses.h... yes
  824. checking ncurses.h usability... yes
  825. checking ncurses.h presence... yes
  826. checking for ncurses.h... yes
  827. checking for term.h... yes
  828. checking whether mvwdelch is an expression... yes
  829. checking whether WINDOW has _flags... no
  830. checking for curses function is_pad... yes
  831. checking for curses function is_term_resized... yes
  832. checking for curses function resize_term... yes
  833. checking for curses function resizeterm... yes
  834. checking for curses function immedok... yes
  835. checking for curses function syncok... yes
  836. checking for curses function wchgat... yes
  837. checking for curses function filter... yes
  838. checking for curses function has_key... yes
  839. checking for curses function typeahead... yes
  840. checking for curses function use_env... yes
  841. configure: checking for device files
  842. checking for /dev/ptmx... yes
  843. checking for /dev/ptc... no
  844. checking for %zd printf() format support... yes
  845. checking for socklen_t... yes
  846. checking for broken mbstowcs... no
  847. checking for --with-computed-gotos... yes
  848. checking whether gcc supports computed gotos... yes
  849. checking for build directories... done
  850. checking for -O2... yes
  851. checking for glibc _FORTIFY_SOURCE/memmove bug... no
  852. checking for gcc ipa-pure-const bug... no
  853. checking for stdatomic.h... yes
  854. checking for builtin __atomic_load_n and __atomic_store_n functions... yes
  855. checking for ensurepip... no
  856. checking if the dirent structure of a d_type field... yes
  857. checking for the Linux getrandom() syscall... yes
  858. checking for the getrandom() function... yes
  859. checking for library containing shm_open... none required
  860. checking for shm_open... yes
  861. checking for shm_unlink... yes
  862. checking for pkg-config... /usr/bin/pkg-config
  863. checking whether compiling and linking against OpenSSL works... yes
  864. checking for --with-openssl-rpath...
  865. checking whether OpenSSL provides required ssl module APIs... yes
  866. checking whether OpenSSL provides required hashlib module APIs... yes
  867. checking for --with-ssl-default-suites... python
  868. checking for --with-builtin-hashlib-hashes... md5,sha1,sha256,sha512,sha3,blake2
  869. checking for LIBB2... yes
  870. checking for --disable-test-modules... yes
  871. checking for additional Modules/Setup files...
  872. checking for stdlib extension module _multiprocessing... yes
  873. checking for stdlib extension module _posixshmem... yes
  874. checking for stdlib extension module fcntl... yes
  875. checking for stdlib extension module mmap... yes
  876. checking for stdlib extension module _socket... yes
  877. checking for stdlib extension module grp... yes
  878. checking for stdlib extension module ossaudiodev... yes
  879. checking for stdlib extension module pwd... yes
  880. checking for stdlib extension module resource... yes
  881. checking for stdlib extension module _scproxy... n/a
  882. checking for stdlib extension module spwd... yes
  883. checking for stdlib extension module syslog... yes
  884. checking for stdlib extension module termios... yes
  885. checking for stdlib extension module pyexpat... yes
  886. checking for stdlib extension module _elementtree... yes
  887. checking for stdlib extension module _md5... yes
  888. checking for stdlib extension module _sha1... yes
  889. checking for stdlib extension module _sha256... yes
  890. checking for stdlib extension module _sha512... yes
  891. checking for stdlib extension module _sha3... yes
  892. checking for stdlib extension module _blake2... yes
  893. checking for stdlib extension module _crypt... yes
  894. checking for stdlib extension module _decimal... yes
  895. checking for stdlib extension module _gdbm... yes
  896. checking for stdlib extension module nis... yes
  897. checking for stdlib extension module _sqlite3... yes
  898. checking for stdlib extension module _tkinter... yes
  899. checking for stdlib extension module _uuid... yes
  900. checking for stdlib extension module zlib... yes
  901. checking for stdlib extension module _bz2... yes
  902. checking for stdlib extension module _lzma... yes
  903. checking for stdlib extension module _ssl... yes
  904. checking for stdlib extension module _hashlib... yes
  905. checking for stdlib extension module _testcapi... yes
  906. checking for stdlib extension module _testclinic... yes
  907. checking for stdlib extension module _testinternalcapi... yes
  908. checking for stdlib extension module _testbuffer... yes
  909. checking for stdlib extension module _testimportmultiple... yes
  910. checking for stdlib extension module _testmultiphase... yes
  911. checking for stdlib extension module _xxtestfuzz... yes
  912. checking for stdlib extension module _ctypes_test... yes
  913. checking for stdlib extension module xxlimited... yes
  914. checking for stdlib extension module xxlimited_35... yes
  915. configure: creating ./config.status
  916. config.status: creating Makefile.pre
  917. config.status: creating Misc/python.pc
  918. config.status: creating Misc/python-embed.pc
  919. config.status: creating Misc/python-config.sh
  920. config.status: creating Modules/Setup.bootstrap
  921. config.status: creating Modules/Setup.stdlib
  922. config.status: creating Modules/ld_so_aix
  923. config.status: creating pyconfig.h
  924. config.status: pyconfig.h is unchanged
  925. configure: creating Modules/Setup.local
  926. configure: creating Makefile
  927. configure:
  928.  
  929. If you want a release build with all stable optimizations active (PGO, etc),
  930. please run ./configure --enable-optimizations
  931.  
  932. gcc -c -DNDEBUG -g -fwrapv -O3 -Wall -march=x86-64 -mtune=generic -O3 -pipe -fno-plt -fexceptions -Wp,-D_FORTIFY_SOURCE=3 -Wformat -Werror=format-security -fstack-clash-protection -fcf-protection -fno-omit-frame-pointer -mno-omit-leaf-frame-pointer -ffat-lto-objects -march=x86-64 -mtune=generic -O3 -pipe -fno-plt -fexceptions -Wp,-D_FORTIFY_SOURCE=3 -Wformat -Werror=format-security -fstack-clash-protection -fcf-protection -fno-omit-frame-pointer -mno-omit-leaf-frame-pointer -ffat-lto-objects -march=x86-64 -mtune=generic -O3 -pipe -fno-plt -fexceptions -Wp,-D_FORTIFY_SOURCE=3 -Wformat -Werror=format-security -fstack-clash-protection -fcf-protection -fno-omit-frame-pointer -mno-omit-leaf-frame-pointer -ffat-lto-objects -std=c11 -Werror=implicit-function-declaration -fvisibility=hidden -I./Include/internal -I. -I./Include -fPIC -DPy_BUILD_CORE \
  933. -DABIFLAGS='""' \
  934. -DMULTIARCH=\"x86_64-linux-gnu\" \
  935. -o Python/sysmodule.o ./Python/sysmodule.c
  936. gcc -c -DNDEBUG -g -fwrapv -O3 -Wall -march=x86-64 -mtune=generic -O3 -pipe -fno-plt -fexceptions -Wp,-D_FORTIFY_SOURCE=3 -Wformat -Werror=format-security -fstack-clash-protection -fcf-protection -fno-omit-frame-pointer -mno-omit-leaf-frame-pointer -ffat-lto-objects -march=x86-64 -mtune=generic -O3 -pipe -fno-plt -fexceptions -Wp,-D_FORTIFY_SOURCE=3 -Wformat -Werror=format-security -fstack-clash-protection -fcf-protection -fno-omit-frame-pointer -mno-omit-leaf-frame-pointer -ffat-lto-objects -march=x86-64 -mtune=generic -O3 -pipe -fno-plt -fexceptions -Wp,-D_FORTIFY_SOURCE=3 -Wformat -Werror=format-security -fstack-clash-protection -fcf-protection -fno-omit-frame-pointer -mno-omit-leaf-frame-pointer -ffat-lto-objects -std=c11 -Werror=implicit-function-declaration -fvisibility=hidden -I./Include/internal -I. -I./Include -fPIC -DPy_BUILD_CORE \
  937. -DSOABI='"cpython-311-x86_64-linux-gnu"' \
  938. -o Python/dynload_shlib.o ./Python/dynload_shlib.c
  939. gcc -c -DNDEBUG -g -fwrapv -O3 -Wall -march=x86-64 -mtune=generic -O3 -pipe -fno-plt -fexceptions -Wp,-D_FORTIFY_SOURCE=3 -Wformat -Werror=format-security -fstack-clash-protection -fcf-protection -fno-omit-frame-pointer -mno-omit-leaf-frame-pointer -ffat-lto-objects -march=x86-64 -mtune=generic -O3 -pipe -fno-plt -fexceptions -Wp,-D_FORTIFY_SOURCE=3 -Wformat -Werror=format-security -fstack-clash-protection -fcf-protection -fno-omit-frame-pointer -mno-omit-leaf-frame-pointer -ffat-lto-objects -march=x86-64 -mtune=generic -O3 -pipe -fno-plt -fexceptions -Wp,-D_FORTIFY_SOURCE=3 -Wformat -Werror=format-security -fstack-clash-protection -fcf-protection -fno-omit-frame-pointer -mno-omit-leaf-frame-pointer -ffat-lto-objects -std=c11 -Werror=implicit-function-declaration -fvisibility=hidden -I./Include/internal -I. -I./Include -fPIC -DPy_BUILD_CORE -o Modules/config.o Modules/config.c
  940. gcc -DNDEBUG -g -fwrapv -O3 -Wall -march=x86-64 -mtune=generic -O3 -pipe -fno-plt -fexceptions -Wp,-D_FORTIFY_SOURCE=3 -Wformat -Werror=format-security -fstack-clash-protection -fcf-protection -fno-omit-frame-pointer -mno-omit-leaf-frame-pointer -ffat-lto-objects -march=x86-64 -mtune=generic -O3 -pipe -fno-plt -fexceptions -Wp,-D_FORTIFY_SOURCE=3 -Wformat -Werror=format-security -fstack-clash-protection -fcf-protection -fno-omit-frame-pointer -mno-omit-leaf-frame-pointer -ffat-lto-objects -march=x86-64 -mtune=generic -O3 -pipe -fno-plt -fexceptions -Wp,-D_FORTIFY_SOURCE=3 -Wformat -Werror=format-security -fstack-clash-protection -fcf-protection -fno-omit-frame-pointer -mno-omit-leaf-frame-pointer -ffat-lto-objects -std=c11 -Werror=implicit-function-declaration -fvisibility=hidden -I./Include/internal -I. -I./Include -fPIC -DPy_BUILD_CORE_BUILTIN -c ./Modules/atexitmodule.c -o Modules/atexitmodule.o
  941. gcc -DNDEBUG -g -fwrapv -O3 -Wall -march=x86-64 -mtune=generic -O3 -pipe -fno-plt -fexceptions -Wp,-D_FORTIFY_SOURCE=3 -Wformat -Werror=format-security -fstack-clash-protection -fcf-protection -fno-omit-frame-pointer -mno-omit-leaf-frame-pointer -ffat-lto-objects -march=x86-64 -mtune=generic -O3 -pipe -fno-plt -fexceptions -Wp,-D_FORTIFY_SOURCE=3 -Wformat -Werror=format-security -fstack-clash-protection -fcf-protection -fno-omit-frame-pointer -mno-omit-leaf-frame-pointer -ffat-lto-objects -march=x86-64 -mtune=generic -O3 -pipe -fno-plt -fexceptions -Wp,-D_FORTIFY_SOURCE=3 -Wformat -Werror=format-security -fstack-clash-protection -fcf-protection -fno-omit-frame-pointer -mno-omit-leaf-frame-pointer -ffat-lto-objects -std=c11 -Werror=implicit-function-declaration -fvisibility=hidden -I./Include/internal -I. -I./Include -fPIC -DPy_BUILD_CORE_BUILTIN -c ./Modules/faulthandler.c -o Modules/faulthandler.o
  942. gcc -DNDEBUG -g -fwrapv -O3 -Wall -march=x86-64 -mtune=generic -O3 -pipe -fno-plt -fexceptions -Wp,-D_FORTIFY_SOURCE=3 -Wformat -Werror=format-security -fstack-clash-protection -fcf-protection -fno-omit-frame-pointer -mno-omit-leaf-frame-pointer -ffat-lto-objects -march=x86-64 -mtune=generic -O3 -pipe -fno-plt -fexceptions -Wp,-D_FORTIFY_SOURCE=3 -Wformat -Werror=format-security -fstack-clash-protection -fcf-protection -fno-omit-frame-pointer -mno-omit-leaf-frame-pointer -ffat-lto-objects -march=x86-64 -mtune=generic -O3 -pipe -fno-plt -fexceptions -Wp,-D_FORTIFY_SOURCE=3 -Wformat -Werror=format-security -fstack-clash-protection -fcf-protection -fno-omit-frame-pointer -mno-omit-leaf-frame-pointer -ffat-lto-objects -std=c11 -Werror=implicit-function-declaration -fvisibility=hidden -I./Include/internal -I. -I./Include -fPIC -DPy_BUILD_CORE_BUILTIN -c ./Modules/posixmodule.c -o Modules/posixmodule.o
  943. gcc -DNDEBUG -g -fwrapv -O3 -Wall -march=x86-64 -mtune=generic -O3 -pipe -fno-plt -fexceptions -Wp,-D_FORTIFY_SOURCE=3 -Wformat -Werror=format-security -fstack-clash-protection -fcf-protection -fno-omit-frame-pointer -mno-omit-leaf-frame-pointer -ffat-lto-objects -march=x86-64 -mtune=generic -O3 -pipe -fno-plt -fexceptions -Wp,-D_FORTIFY_SOURCE=3 -Wformat -Werror=format-security -fstack-clash-protection -fcf-protection -fno-omit-frame-pointer -mno-omit-leaf-frame-pointer -ffat-lto-objects -march=x86-64 -mtune=generic -O3 -pipe -fno-plt -fexceptions -Wp,-D_FORTIFY_SOURCE=3 -Wformat -Werror=format-security -fstack-clash-protection -fcf-protection -fno-omit-frame-pointer -mno-omit-leaf-frame-pointer -ffat-lto-objects -std=c11 -Werror=implicit-function-declaration -fvisibility=hidden -I./Include/internal -I. -I./Include -fPIC -DPy_BUILD_CORE_BUILTIN -c ./Modules/signalmodule.c -o Modules/signalmodule.o
  944. gcc -DNDEBUG -g -fwrapv -O3 -Wall -march=x86-64 -mtune=generic -O3 -pipe -fno-plt -fexceptions -Wp,-D_FORTIFY_SOURCE=3 -Wformat -Werror=format-security -fstack-clash-protection -fcf-protection -fno-omit-frame-pointer -mno-omit-leaf-frame-pointer -ffat-lto-objects -march=x86-64 -mtune=generic -O3 -pipe -fno-plt -fexceptions -Wp,-D_FORTIFY_SOURCE=3 -Wformat -Werror=format-security -fstack-clash-protection -fcf-protection -fno-omit-frame-pointer -mno-omit-leaf-frame-pointer -ffat-lto-objects -march=x86-64 -mtune=generic -O3 -pipe -fno-plt -fexceptions -Wp,-D_FORTIFY_SOURCE=3 -Wformat -Werror=format-security -fstack-clash-protection -fcf-protection -fno-omit-frame-pointer -mno-omit-leaf-frame-pointer -ffat-lto-objects -std=c11 -Werror=implicit-function-declaration -fvisibility=hidden -I./Include/internal -I. -I./Include -fPIC -DPy_BUILD_CORE_BUILTIN -c ./Modules/_tracemalloc.c -o Modules/_tracemalloc.o
  945. gcc -DNDEBUG -g -fwrapv -O3 -Wall -march=x86-64 -mtune=generic -O3 -pipe -fno-plt -fexceptions -Wp,-D_FORTIFY_SOURCE=3 -Wformat -Werror=format-security -fstack-clash-protection -fcf-protection -fno-omit-frame-pointer -mno-omit-leaf-frame-pointer -ffat-lto-objects -march=x86-64 -mtune=generic -O3 -pipe -fno-plt -fexceptions -Wp,-D_FORTIFY_SOURCE=3 -Wformat -Werror=format-security -fstack-clash-protection -fcf-protection -fno-omit-frame-pointer -mno-omit-leaf-frame-pointer -ffat-lto-objects -march=x86-64 -mtune=generic -O3 -pipe -fno-plt -fexceptions -Wp,-D_FORTIFY_SOURCE=3 -Wformat -Werror=format-security -fstack-clash-protection -fcf-protection -fno-omit-frame-pointer -mno-omit-leaf-frame-pointer -ffat-lto-objects -std=c11 -Werror=implicit-function-declaration -fvisibility=hidden -I./Include/internal -I. -I./Include -fPIC -DPy_BUILD_CORE_BUILTIN -c ./Modules/_codecsmodule.c -o Modules/_codecsmodule.o
  946. gcc -DNDEBUG -g -fwrapv -O3 -Wall -march=x86-64 -mtune=generic -O3 -pipe -fno-plt -fexceptions -Wp,-D_FORTIFY_SOURCE=3 -Wformat -Werror=format-security -fstack-clash-protection -fcf-protection -fno-omit-frame-pointer -mno-omit-leaf-frame-pointer -ffat-lto-objects -march=x86-64 -mtune=generic -O3 -pipe -fno-plt -fexceptions -Wp,-D_FORTIFY_SOURCE=3 -Wformat -Werror=format-security -fstack-clash-protection -fcf-protection -fno-omit-frame-pointer -mno-omit-leaf-frame-pointer -ffat-lto-objects -march=x86-64 -mtune=generic -O3 -pipe -fno-plt -fexceptions -Wp,-D_FORTIFY_SOURCE=3 -Wformat -Werror=format-security -fstack-clash-protection -fcf-protection -fno-omit-frame-pointer -mno-omit-leaf-frame-pointer -ffat-lto-objects -std=c11 -Werror=implicit-function-declaration -fvisibility=hidden -I./Include/internal -I. -I./Include -fPIC -DPy_BUILD_CORE_BUILTIN -c ./Modules/_collectionsmodule.c -o Modules/_collectionsmodule.o
  947. gcc -DNDEBUG -g -fwrapv -O3 -Wall -march=x86-64 -mtune=generic -O3 -pipe -fno-plt -fexceptions -Wp,-D_FORTIFY_SOURCE=3 -Wformat -Werror=format-security -fstack-clash-protection -fcf-protection -fno-omit-frame-pointer -mno-omit-leaf-frame-pointer -ffat-lto-objects -march=x86-64 -mtune=generic -O3 -pipe -fno-plt -fexceptions -Wp,-D_FORTIFY_SOURCE=3 -Wformat -Werror=format-security -fstack-clash-protection -fcf-protection -fno-omit-frame-pointer -mno-omit-leaf-frame-pointer -ffat-lto-objects -march=x86-64 -mtune=generic -O3 -pipe -fno-plt -fexceptions -Wp,-D_FORTIFY_SOURCE=3 -Wformat -Werror=format-security -fstack-clash-protection -fcf-protection -fno-omit-frame-pointer -mno-omit-leaf-frame-pointer -ffat-lto-objects -std=c11 -Werror=implicit-function-declaration -fvisibility=hidden -I./Include/internal -I. -I./Include -fPIC -DPy_BUILD_CORE_BUILTIN -c ./Modules/errnomodule.c -o Modules/errnomodule.o
  948. gcc -I./Modules/_io -DNDEBUG -g -fwrapv -O3 -Wall -march=x86-64 -mtune=generic -O3 -pipe -fno-plt -fexceptions -Wp,-D_FORTIFY_SOURCE=3 -Wformat -Werror=format-security -fstack-clash-protection -fcf-protection -fno-omit-frame-pointer -mno-omit-leaf-frame-pointer -ffat-lto-objects -march=x86-64 -mtune=generic -O3 -pipe -fno-plt -fexceptions -Wp,-D_FORTIFY_SOURCE=3 -Wformat -Werror=format-security -fstack-clash-protection -fcf-protection -fno-omit-frame-pointer -mno-omit-leaf-frame-pointer -ffat-lto-objects -march=x86-64 -mtune=generic -O3 -pipe -fno-plt -fexceptions -Wp,-D_FORTIFY_SOURCE=3 -Wformat -Werror=format-security -fstack-clash-protection -fcf-protection -fno-omit-frame-pointer -mno-omit-leaf-frame-pointer -ffat-lto-objects -std=c11 -Werror=implicit-function-declaration -fvisibility=hidden -I./Include/internal -I. -I./Include -fPIC -DPy_BUILD_CORE_BUILTIN -c ./Modules/_io/_iomodule.c -o Modules/_io/_iomodule.o
  949. gcc -I./Modules/_io -DNDEBUG -g -fwrapv -O3 -Wall -march=x86-64 -mtune=generic -O3 -pipe -fno-plt -fexceptions -Wp,-D_FORTIFY_SOURCE=3 -Wformat -Werror=format-security -fstack-clash-protection -fcf-protection -fno-omit-frame-pointer -mno-omit-leaf-frame-pointer -ffat-lto-objects -march=x86-64 -mtune=generic -O3 -pipe -fno-plt -fexceptions -Wp,-D_FORTIFY_SOURCE=3 -Wformat -Werror=format-security -fstack-clash-protection -fcf-protection -fno-omit-frame-pointer -mno-omit-leaf-frame-pointer -ffat-lto-objects -march=x86-64 -mtune=generic -O3 -pipe -fno-plt -fexceptions -Wp,-D_FORTIFY_SOURCE=3 -Wformat -Werror=format-security -fstack-clash-protection -fcf-protection -fno-omit-frame-pointer -mno-omit-leaf-frame-pointer -ffat-lto-objects -std=c11 -Werror=implicit-function-declaration -fvisibility=hidden -I./Include/internal -I. -I./Include -fPIC -DPy_BUILD_CORE_BUILTIN -c ./Modules/_io/iobase.c -o Modules/_io/iobase.o
  950. gcc -I./Modules/_io -DNDEBUG -g -fwrapv -O3 -Wall -march=x86-64 -mtune=generic -O3 -pipe -fno-plt -fexceptions -Wp,-D_FORTIFY_SOURCE=3 -Wformat -Werror=format-security -fstack-clash-protection -fcf-protection -fno-omit-frame-pointer -mno-omit-leaf-frame-pointer -ffat-lto-objects -march=x86-64 -mtune=generic -O3 -pipe -fno-plt -fexceptions -Wp,-D_FORTIFY_SOURCE=3 -Wformat -Werror=format-security -fstack-clash-protection -fcf-protection -fno-omit-frame-pointer -mno-omit-leaf-frame-pointer -ffat-lto-objects -march=x86-64 -mtune=generic -O3 -pipe -fno-plt -fexceptions -Wp,-D_FORTIFY_SOURCE=3 -Wformat -Werror=format-security -fstack-clash-protection -fcf-protection -fno-omit-frame-pointer -mno-omit-leaf-frame-pointer -ffat-lto-objects -std=c11 -Werror=implicit-function-declaration -fvisibility=hidden -I./Include/internal -I. -I./Include -fPIC -DPy_BUILD_CORE_BUILTIN -c ./Modules/_io/fileio.c -o Modules/_io/fileio.o
  951. gcc -I./Modules/_io -DNDEBUG -g -fwrapv -O3 -Wall -march=x86-64 -mtune=generic -O3 -pipe -fno-plt -fexceptions -Wp,-D_FORTIFY_SOURCE=3 -Wformat -Werror=format-security -fstack-clash-protection -fcf-protection -fno-omit-frame-pointer -mno-omit-leaf-frame-pointer -ffat-lto-objects -march=x86-64 -mtune=generic -O3 -pipe -fno-plt -fexceptions -Wp,-D_FORTIFY_SOURCE=3 -Wformat -Werror=format-security -fstack-clash-protection -fcf-protection -fno-omit-frame-pointer -mno-omit-leaf-frame-pointer -ffat-lto-objects -march=x86-64 -mtune=generic -O3 -pipe -fno-plt -fexceptions -Wp,-D_FORTIFY_SOURCE=3 -Wformat -Werror=format-security -fstack-clash-protection -fcf-protection -fno-omit-frame-pointer -mno-omit-leaf-frame-pointer -ffat-lto-objects -std=c11 -Werror=implicit-function-declaration -fvisibility=hidden -I./Include/internal -I. -I./Include -fPIC -DPy_BUILD_CORE_BUILTIN -c ./Modules/_io/bytesio.c -o Modules/_io/bytesio.o
  952. gcc -I./Modules/_io -DNDEBUG -g -fwrapv -O3 -Wall -march=x86-64 -mtune=generic -O3 -pipe -fno-plt -fexceptions -Wp,-D_FORTIFY_SOURCE=3 -Wformat -Werror=format-security -fstack-clash-protection -fcf-protection -fno-omit-frame-pointer -mno-omit-leaf-frame-pointer -ffat-lto-objects -march=x86-64 -mtune=generic -O3 -pipe -fno-plt -fexceptions -Wp,-D_FORTIFY_SOURCE=3 -Wformat -Werror=format-security -fstack-clash-protection -fcf-protection -fno-omit-frame-pointer -mno-omit-leaf-frame-pointer -ffat-lto-objects -march=x86-64 -mtune=generic -O3 -pipe -fno-plt -fexceptions -Wp,-D_FORTIFY_SOURCE=3 -Wformat -Werror=format-security -fstack-clash-protection -fcf-protection -fno-omit-frame-pointer -mno-omit-leaf-frame-pointer -ffat-lto-objects -std=c11 -Werror=implicit-function-declaration -fvisibility=hidden -I./Include/internal -I. -I./Include -fPIC -DPy_BUILD_CORE_BUILTIN -c ./Modules/_io/bufferedio.c -o Modules/_io/bufferedio.o
  953. gcc -I./Modules/_io -DNDEBUG -g -fwrapv -O3 -Wall -march=x86-64 -mtune=generic -O3 -pipe -fno-plt -fexceptions -Wp,-D_FORTIFY_SOURCE=3 -Wformat -Werror=format-security -fstack-clash-protection -fcf-protection -fno-omit-frame-pointer -mno-omit-leaf-frame-pointer -ffat-lto-objects -march=x86-64 -mtune=generic -O3 -pipe -fno-plt -fexceptions -Wp,-D_FORTIFY_SOURCE=3 -Wformat -Werror=format-security -fstack-clash-protection -fcf-protection -fno-omit-frame-pointer -mno-omit-leaf-frame-pointer -ffat-lto-objects -march=x86-64 -mtune=generic -O3 -pipe -fno-plt -fexceptions -Wp,-D_FORTIFY_SOURCE=3 -Wformat -Werror=format-security -fstack-clash-protection -fcf-protection -fno-omit-frame-pointer -mno-omit-leaf-frame-pointer -ffat-lto-objects -std=c11 -Werror=implicit-function-declaration -fvisibility=hidden -I./Include/internal -I. -I./Include -fPIC -DPy_BUILD_CORE_BUILTIN -c ./Modules/_io/textio.c -o Modules/_io/textio.o
  954. gcc -I./Modules/_io -DNDEBUG -g -fwrapv -O3 -Wall -march=x86-64 -mtune=generic -O3 -pipe -fno-plt -fexceptions -Wp,-D_FORTIFY_SOURCE=3 -Wformat -Werror=format-security -fstack-clash-protection -fcf-protection -fno-omit-frame-pointer -mno-omit-leaf-frame-pointer -ffat-lto-objects -march=x86-64 -mtune=generic -O3 -pipe -fno-plt -fexceptions -Wp,-D_FORTIFY_SOURCE=3 -Wformat -Werror=format-security -fstack-clash-protection -fcf-protection -fno-omit-frame-pointer -mno-omit-leaf-frame-pointer -ffat-lto-objects -march=x86-64 -mtune=generic -O3 -pipe -fno-plt -fexceptions -Wp,-D_FORTIFY_SOURCE=3 -Wformat -Werror=format-security -fstack-clash-protection -fcf-protection -fno-omit-frame-pointer -mno-omit-leaf-frame-pointer -ffat-lto-objects -std=c11 -Werror=implicit-function-declaration -fvisibility=hidden -I./Include/internal -I. -I./Include -fPIC -DPy_BUILD_CORE_BUILTIN -c ./Modules/_io/stringio.c -o Modules/_io/stringio.o
  955. gcc -DNDEBUG -g -fwrapv -O3 -Wall -march=x86-64 -mtune=generic -O3 -pipe -fno-plt -fexceptions -Wp,-D_FORTIFY_SOURCE=3 -Wformat -Werror=format-security -fstack-clash-protection -fcf-protection -fno-omit-frame-pointer -mno-omit-leaf-frame-pointer -ffat-lto-objects -march=x86-64 -mtune=generic -O3 -pipe -fno-plt -fexceptions -Wp,-D_FORTIFY_SOURCE=3 -Wformat -Werror=format-security -fstack-clash-protection -fcf-protection -fno-omit-frame-pointer -mno-omit-leaf-frame-pointer -ffat-lto-objects -march=x86-64 -mtune=generic -O3 -pipe -fno-plt -fexceptions -Wp,-D_FORTIFY_SOURCE=3 -Wformat -Werror=format-security -fstack-clash-protection -fcf-protection -fno-omit-frame-pointer -mno-omit-leaf-frame-pointer -ffat-lto-objects -std=c11 -Werror=implicit-function-declaration -fvisibility=hidden -I./Include/internal -I. -I./Include -fPIC -DPy_BUILD_CORE_BUILTIN -c ./Modules/itertoolsmodule.c -o Modules/itertoolsmodule.o
  956. gcc -DNDEBUG -g -fwrapv -O3 -Wall -march=x86-64 -mtune=generic -O3 -pipe -fno-plt -fexceptions -Wp,-D_FORTIFY_SOURCE=3 -Wformat -Werror=format-security -fstack-clash-protection -fcf-protection -fno-omit-frame-pointer -mno-omit-leaf-frame-pointer -ffat-lto-objects -march=x86-64 -mtune=generic -O3 -pipe -fno-plt -fexceptions -Wp,-D_FORTIFY_SOURCE=3 -Wformat -Werror=format-security -fstack-clash-protection -fcf-protection -fno-omit-frame-pointer -mno-omit-leaf-frame-pointer -ffat-lto-objects -march=x86-64 -mtune=generic -O3 -pipe -fno-plt -fexceptions -Wp,-D_FORTIFY_SOURCE=3 -Wformat -Werror=format-security -fstack-clash-protection -fcf-protection -fno-omit-frame-pointer -mno-omit-leaf-frame-pointer -ffat-lto-objects -std=c11 -Werror=implicit-function-declaration -fvisibility=hidden -I./Include/internal -I. -I./Include -fPIC -DPy_BUILD_CORE_BUILTIN -c ./Modules/_sre/sre.c -o Modules/_sre/sre.o
  957. gcc -DNDEBUG -g -fwrapv -O3 -Wall -march=x86-64 -mtune=generic -O3 -pipe -fno-plt -fexceptions -Wp,-D_FORTIFY_SOURCE=3 -Wformat -Werror=format-security -fstack-clash-protection -fcf-protection -fno-omit-frame-pointer -mno-omit-leaf-frame-pointer -ffat-lto-objects -march=x86-64 -mtune=generic -O3 -pipe -fno-plt -fexceptions -Wp,-D_FORTIFY_SOURCE=3 -Wformat -Werror=format-security -fstack-clash-protection -fcf-protection -fno-omit-frame-pointer -mno-omit-leaf-frame-pointer -ffat-lto-objects -march=x86-64 -mtune=generic -O3 -pipe -fno-plt -fexceptions -Wp,-D_FORTIFY_SOURCE=3 -Wformat -Werror=format-security -fstack-clash-protection -fcf-protection -fno-omit-frame-pointer -mno-omit-leaf-frame-pointer -ffat-lto-objects -std=c11 -Werror=implicit-function-declaration -fvisibility=hidden -I./Include/internal -I. -I./Include -fPIC -DPy_BUILD_CORE_BUILTIN -c ./Modules/_threadmodule.c -o Modules/_threadmodule.o
  958. gcc -DNDEBUG -g -fwrapv -O3 -Wall -march=x86-64 -mtune=generic -O3 -pipe -fno-plt -fexceptions -Wp,-D_FORTIFY_SOURCE=3 -Wformat -Werror=format-security -fstack-clash-protection -fcf-protection -fno-omit-frame-pointer -mno-omit-leaf-frame-pointer -ffat-lto-objects -march=x86-64 -mtune=generic -O3 -pipe -fno-plt -fexceptions -Wp,-D_FORTIFY_SOURCE=3 -Wformat -Werror=format-security -fstack-clash-protection -fcf-protection -fno-omit-frame-pointer -mno-omit-leaf-frame-pointer -ffat-lto-objects -march=x86-64 -mtune=generic -O3 -pipe -fno-plt -fexceptions -Wp,-D_FORTIFY_SOURCE=3 -Wformat -Werror=format-security -fstack-clash-protection -fcf-protection -fno-omit-frame-pointer -mno-omit-leaf-frame-pointer -ffat-lto-objects -std=c11 -Werror=implicit-function-declaration -fvisibility=hidden -I./Include/internal -I. -I./Include -fPIC -DPy_BUILD_CORE_BUILTIN -c ./Modules/timemodule.c -o Modules/timemodule.o
  959. gcc -DNDEBUG -g -fwrapv -O3 -Wall -march=x86-64 -mtune=generic -O3 -pipe -fno-plt -fexceptions -Wp,-D_FORTIFY_SOURCE=3 -Wformat -Werror=format-security -fstack-clash-protection -fcf-protection -fno-omit-frame-pointer -mno-omit-leaf-frame-pointer -ffat-lto-objects -march=x86-64 -mtune=generic -O3 -pipe -fno-plt -fexceptions -Wp,-D_FORTIFY_SOURCE=3 -Wformat -Werror=format-security -fstack-clash-protection -fcf-protection -fno-omit-frame-pointer -mno-omit-leaf-frame-pointer -ffat-lto-objects -march=x86-64 -mtune=generic -O3 -pipe -fno-plt -fexceptions -Wp,-D_FORTIFY_SOURCE=3 -Wformat -Werror=format-security -fstack-clash-protection -fcf-protection -fno-omit-frame-pointer -mno-omit-leaf-frame-pointer -ffat-lto-objects -std=c11 -Werror=implicit-function-declaration -fvisibility=hidden -I./Include/internal -I. -I./Include -fPIC -DPy_BUILD_CORE_BUILTIN -c ./Modules/_weakref.c -o Modules/_weakref.o
  960. gcc -DNDEBUG -g -fwrapv -O3 -Wall -march=x86-64 -mtune=generic -O3 -pipe -fno-plt -fexceptions -Wp,-D_FORTIFY_SOURCE=3 -Wformat -Werror=format-security -fstack-clash-protection -fcf-protection -fno-omit-frame-pointer -mno-omit-leaf-frame-pointer -ffat-lto-objects -march=x86-64 -mtune=generic -O3 -pipe -fno-plt -fexceptions -Wp,-D_FORTIFY_SOURCE=3 -Wformat -Werror=format-security -fstack-clash-protection -fcf-protection -fno-omit-frame-pointer -mno-omit-leaf-frame-pointer -ffat-lto-objects -march=x86-64 -mtune=generic -O3 -pipe -fno-plt -fexceptions -Wp,-D_FORTIFY_SOURCE=3 -Wformat -Werror=format-security -fstack-clash-protection -fcf-protection -fno-omit-frame-pointer -mno-omit-leaf-frame-pointer -ffat-lto-objects -std=c11 -Werror=implicit-function-declaration -fvisibility=hidden -I./Include/internal -I. -I./Include -fPIC -DPy_BUILD_CORE_BUILTIN -c ./Modules/_abc.c -o Modules/_abc.o
  961. gcc -DNDEBUG -g -fwrapv -O3 -Wall -march=x86-64 -mtune=generic -O3 -pipe -fno-plt -fexceptions -Wp,-D_FORTIFY_SOURCE=3 -Wformat -Werror=format-security -fstack-clash-protection -fcf-protection -fno-omit-frame-pointer -mno-omit-leaf-frame-pointer -ffat-lto-objects -march=x86-64 -mtune=generic -O3 -pipe -fno-plt -fexceptions -Wp,-D_FORTIFY_SOURCE=3 -Wformat -Werror=format-security -fstack-clash-protection -fcf-protection -fno-omit-frame-pointer -mno-omit-leaf-frame-pointer -ffat-lto-objects -march=x86-64 -mtune=generic -O3 -pipe -fno-plt -fexceptions -Wp,-D_FORTIFY_SOURCE=3 -Wformat -Werror=format-security -fstack-clash-protection -fcf-protection -fno-omit-frame-pointer -mno-omit-leaf-frame-pointer -ffat-lto-objects -std=c11 -Werror=implicit-function-declaration -fvisibility=hidden -I./Include/internal -I. -I./Include -fPIC -DPy_BUILD_CORE_BUILTIN -c ./Modules/_functoolsmodule.c -o Modules/_functoolsmodule.o
  962. gcc -DNDEBUG -g -fwrapv -O3 -Wall -march=x86-64 -mtune=generic -O3 -pipe -fno-plt -fexceptions -Wp,-D_FORTIFY_SOURCE=3 -Wformat -Werror=format-security -fstack-clash-protection -fcf-protection -fno-omit-frame-pointer -mno-omit-leaf-frame-pointer -ffat-lto-objects -march=x86-64 -mtune=generic -O3 -pipe -fno-plt -fexceptions -Wp,-D_FORTIFY_SOURCE=3 -Wformat -Werror=format-security -fstack-clash-protection -fcf-protection -fno-omit-frame-pointer -mno-omit-leaf-frame-pointer -ffat-lto-objects -march=x86-64 -mtune=generic -O3 -pipe -fno-plt -fexceptions -Wp,-D_FORTIFY_SOURCE=3 -Wformat -Werror=format-security -fstack-clash-protection -fcf-protection -fno-omit-frame-pointer -mno-omit-leaf-frame-pointer -ffat-lto-objects -std=c11 -Werror=implicit-function-declaration -fvisibility=hidden -I./Include/internal -I. -I./Include -fPIC -DPy_BUILD_CORE_BUILTIN -c ./Modules/_localemodule.c -o Modules/_localemodule.o
  963. gcc -DNDEBUG -g -fwrapv -O3 -Wall -march=x86-64 -mtune=generic -O3 -pipe -fno-plt -fexceptions -Wp,-D_FORTIFY_SOURCE=3 -Wformat -Werror=format-security -fstack-clash-protection -fcf-protection -fno-omit-frame-pointer -mno-omit-leaf-frame-pointer -ffat-lto-objects -march=x86-64 -mtune=generic -O3 -pipe -fno-plt -fexceptions -Wp,-D_FORTIFY_SOURCE=3 -Wformat -Werror=format-security -fstack-clash-protection -fcf-protection -fno-omit-frame-pointer -mno-omit-leaf-frame-pointer -ffat-lto-objects -march=x86-64 -mtune=generic -O3 -pipe -fno-plt -fexceptions -Wp,-D_FORTIFY_SOURCE=3 -Wformat -Werror=format-security -fstack-clash-protection -fcf-protection -fno-omit-frame-pointer -mno-omit-leaf-frame-pointer -ffat-lto-objects -std=c11 -Werror=implicit-function-declaration -fvisibility=hidden -I./Include/internal -I. -I./Include -fPIC -DPy_BUILD_CORE_BUILTIN -c ./Modules/_operator.c -o Modules/_operator.o
  964. gcc -DNDEBUG -g -fwrapv -O3 -Wall -march=x86-64 -mtune=generic -O3 -pipe -fno-plt -fexceptions -Wp,-D_FORTIFY_SOURCE=3 -Wformat -Werror=format-security -fstack-clash-protection -fcf-protection -fno-omit-frame-pointer -mno-omit-leaf-frame-pointer -ffat-lto-objects -march=x86-64 -mtune=generic -O3 -pipe -fno-plt -fexceptions -Wp,-D_FORTIFY_SOURCE=3 -Wformat -Werror=format-security -fstack-clash-protection -fcf-protection -fno-omit-frame-pointer -mno-omit-leaf-frame-pointer -ffat-lto-objects -march=x86-64 -mtune=generic -O3 -pipe -fno-plt -fexceptions -Wp,-D_FORTIFY_SOURCE=3 -Wformat -Werror=format-security -fstack-clash-protection -fcf-protection -fno-omit-frame-pointer -mno-omit-leaf-frame-pointer -ffat-lto-objects -std=c11 -Werror=implicit-function-declaration -fvisibility=hidden -I./Include/internal -I. -I./Include -fPIC -DPy_BUILD_CORE_BUILTIN -c ./Modules/_stat.c -o Modules/_stat.o
  965. gcc -DNDEBUG -g -fwrapv -O3 -Wall -march=x86-64 -mtune=generic -O3 -pipe -fno-plt -fexceptions -Wp,-D_FORTIFY_SOURCE=3 -Wformat -Werror=format-security -fstack-clash-protection -fcf-protection -fno-omit-frame-pointer -mno-omit-leaf-frame-pointer -ffat-lto-objects -march=x86-64 -mtune=generic -O3 -pipe -fno-plt -fexceptions -Wp,-D_FORTIFY_SOURCE=3 -Wformat -Werror=format-security -fstack-clash-protection -fcf-protection -fno-omit-frame-pointer -mno-omit-leaf-frame-pointer -ffat-lto-objects -march=x86-64 -mtune=generic -O3 -pipe -fno-plt -fexceptions -Wp,-D_FORTIFY_SOURCE=3 -Wformat -Werror=format-security -fstack-clash-protection -fcf-protection -fno-omit-frame-pointer -mno-omit-leaf-frame-pointer -ffat-lto-objects -std=c11 -Werror=implicit-function-declaration -fvisibility=hidden -I./Include/internal -I. -I./Include -fPIC -DPy_BUILD_CORE_BUILTIN -c ./Modules/symtablemodule.c -o Modules/symtablemodule.o
  966. gcc -DNDEBUG -g -fwrapv -O3 -Wall -march=x86-64 -mtune=generic -O3 -pipe -fno-plt -fexceptions -Wp,-D_FORTIFY_SOURCE=3 -Wformat -Werror=format-security -fstack-clash-protection -fcf-protection -fno-omit-frame-pointer -mno-omit-leaf-frame-pointer -ffat-lto-objects -march=x86-64 -mtune=generic -O3 -pipe -fno-plt -fexceptions -Wp,-D_FORTIFY_SOURCE=3 -Wformat -Werror=format-security -fstack-clash-protection -fcf-protection -fno-omit-frame-pointer -mno-omit-leaf-frame-pointer -ffat-lto-objects -march=x86-64 -mtune=generic -O3 -pipe -fno-plt -fexceptions -Wp,-D_FORTIFY_SOURCE=3 -Wformat -Werror=format-security -fstack-clash-protection -fcf-protection -fno-omit-frame-pointer -mno-omit-leaf-frame-pointer -ffat-lto-objects -std=c11 -Werror=implicit-function-declaration -fvisibility=hidden -I./Include/internal -I. -I./Include -fPIC -DPy_BUILD_CORE_BUILTIN -c ./Modules/pwdmodule.c -o Modules/pwdmodule.o
  967. gcc -DNDEBUG -g -fwrapv -O3 -Wall -march=x86-64 -mtune=generic -O3 -pipe -fno-plt -fexceptions -Wp,-D_FORTIFY_SOURCE=3 -Wformat -Werror=format-security -fstack-clash-protection -fcf-protection -fno-omit-frame-pointer -mno-omit-leaf-frame-pointer -ffat-lto-objects -march=x86-64 -mtune=generic -O3 -pipe -fno-plt -fexceptions -Wp,-D_FORTIFY_SOURCE=3 -Wformat -Werror=format-security -fstack-clash-protection -fcf-protection -fno-omit-frame-pointer -mno-omit-leaf-frame-pointer -ffat-lto-objects -march=x86-64 -mtune=generic -O3 -pipe -fno-plt -fexceptions -Wp,-D_FORTIFY_SOURCE=3 -Wformat -Werror=format-security -fstack-clash-protection -fcf-protection -fno-omit-frame-pointer -mno-omit-leaf-frame-pointer -ffat-lto-objects -std=c11 -Werror=implicit-function-declaration -fvisibility=hidden -I./Include/internal -I. -I./Include -fPIC -DPy_BUILD_CORE_BUILTIN -c ./Modules/xxsubtype.c -o Modules/xxsubtype.o
  968. gcc -c -DNDEBUG -g -fwrapv -O3 -Wall -march=x86-64 -mtune=generic -O3 -pipe -fno-plt -fexceptions -Wp,-D_FORTIFY_SOURCE=3 -Wformat -Werror=format-security -fstack-clash-protection -fcf-protection -fno-omit-frame-pointer -mno-omit-leaf-frame-pointer -ffat-lto-objects -march=x86-64 -mtune=generic -O3 -pipe -fno-plt -fexceptions -Wp,-D_FORTIFY_SOURCE=3 -Wformat -Werror=format-security -fstack-clash-protection -fcf-protection -fno-omit-frame-pointer -mno-omit-leaf-frame-pointer -ffat-lto-objects -march=x86-64 -mtune=generic -O3 -pipe -fno-plt -fexceptions -Wp,-D_FORTIFY_SOURCE=3 -Wformat -Werror=format-security -fstack-clash-protection -fcf-protection -fno-omit-frame-pointer -mno-omit-leaf-frame-pointer -ffat-lto-objects -std=c11 -Werror=implicit-function-declaration -fvisibility=hidden -I./Include/internal -I. -I./Include -fPIC -DPy_BUILD_CORE -o Programs/_freeze_module.o Programs/_freeze_module.c
  969. gcc -c -DNDEBUG -g -fwrapv -O3 -Wall -march=x86-64 -mtune=generic -O3 -pipe -fno-plt -fexceptions -Wp,-D_FORTIFY_SOURCE=3 -Wformat -Werror=format-security -fstack-clash-protection -fcf-protection -fno-omit-frame-pointer -mno-omit-leaf-frame-pointer -ffat-lto-objects -march=x86-64 -mtune=generic -O3 -pipe -fno-plt -fexceptions -Wp,-D_FORTIFY_SOURCE=3 -Wformat -Werror=format-security -fstack-clash-protection -fcf-protection -fno-omit-frame-pointer -mno-omit-leaf-frame-pointer -ffat-lto-objects -march=x86-64 -mtune=generic -O3 -pipe -fno-plt -fexceptions -Wp,-D_FORTIFY_SOURCE=3 -Wformat -Werror=format-security -fstack-clash-protection -fcf-protection -fno-omit-frame-pointer -mno-omit-leaf-frame-pointer -ffat-lto-objects -std=c11 -Werror=implicit-function-declaration -fvisibility=hidden -I./Include/internal -I. -I./Include -fPIC -DPy_BUILD_CORE -o Modules/getpath_noop.o Modules/getpath_noop.c
  970. sed -e "s,@EXENAME@,/usr/bin/python3.11," < ./Misc/python-config.in >python-config.py
  971. LC_ALL=C sed -e 's,\$(\([A-Za-z0-9_]*\)),\$\{\1\},g' < Misc/python-config.sh >python-config
  972. gcc -c -DNDEBUG -g -fwrapv -O3 -Wall -march=x86-64 -mtune=generic -O3 -pipe -fno-plt -fexceptions -Wp,-D_FORTIFY_SOURCE=3 -Wformat -Werror=format-security -fstack-clash-protection -fcf-protection -fno-omit-frame-pointer -mno-omit-leaf-frame-pointer -ffat-lto-objects -march=x86-64 -mtune=generic -O3 -pipe -fno-plt -fexceptions -Wp,-D_FORTIFY_SOURCE=3 -Wformat -Werror=format-security -fstack-clash-protection -fcf-protection -fno-omit-frame-pointer -mno-omit-leaf-frame-pointer -ffat-lto-objects -march=x86-64 -mtune=generic -O3 -pipe -fno-plt -fexceptions -Wp,-D_FORTIFY_SOURCE=3 -Wformat -Werror=format-security -fstack-clash-protection -fcf-protection -fno-omit-frame-pointer -mno-omit-leaf-frame-pointer -ffat-lto-objects -std=c11 -Werror=implicit-function-declaration -fvisibility=hidden -I./Include/internal -I. -I./Include -fPIC -DPy_BUILD_CORE \
  973. -DGITVERSION="\"`LC_ALL=C `\"" \
  974. -DGITTAG="\"`LC_ALL=C `\"" \
  975. -DGITBRANCH="\"`LC_ALL=C `\"" \
  976. -o Modules/getbuildinfo.o ./Modules/getbuildinfo.c
  977. gcc -Wl,-O1 -Wl,--sort-common -Wl,--as-needed -Wl,-z,relro -Wl,-z,now -Wl,-z,pack-relative-relocs -Wl,-O1 -Wl,--sort-common -Wl,--as-needed -Wl,-z,relro -Wl,-z,now -Wl,-z,pack-relative-relocs -o Programs/_freeze_module Programs/_freeze_module.o Modules/getpath_noop.o Modules/getbuildinfo.o Parser/token.o Parser/pegen.o Parser/pegen_errors.o Parser/action_helpers.o Parser/parser.o Parser/string_parser.o Parser/peg_api.o Parser/myreadline.o Parser/tokenizer.o Objects/abstract.o Objects/accu.o Objects/boolobject.o Objects/bytes_methods.o Objects/bytearrayobject.o Objects/bytesobject.o Objects/call.o Objects/capsule.o Objects/cellobject.o Objects/classobject.o Objects/codeobject.o Objects/complexobject.o Objects/descrobject.o Objects/enumobject.o Objects/exceptions.o Objects/genericaliasobject.o Objects/genobject.o Objects/fileobject.o Objects/floatobject.o Objects/frameobject.o Objects/funcobject.o Objects/interpreteridobject.o Objects/iterobject.o Objects/listobject.o Objects/longobject.o Objects/dictobject.o Objects/odictobject.o Objects/memoryobject.o Objects/methodobject.o Objects/moduleobject.o Objects/namespaceobject.o Objects/object.o Objects/obmalloc.o Objects/picklebufobject.o Objects/rangeobject.o Objects/setobject.o Objects/sliceobject.o Objects/structseq.o Objects/tupleobject.o Objects/typeobject.o Objects/unicodeobject.o Objects/unicodectype.o Objects/unionobject.o Objects/weakrefobject.o Python/_warnings.o Python/Python-ast.o Python/Python-tokenize.o Python/asdl.o Python/ast.o Python/ast_opt.o Python/ast_unparse.o Python/bltinmodule.o Python/ceval.o Python/codecs.o Python/compile.o Python/context.o Python/dynamic_annotations.o Python/errors.o Python/frame.o Python/frozenmain.o Python/future.o Python/getargs.o Python/getcompiler.o Python/getcopyright.o Python/getplatform.o Python/getversion.o Python/hamt.o Python/hashtable.o Python/import.o Python/importdl.o Python/initconfig.o Python/marshal.o Python/modsupport.o Python/mysnprintf.o Python/mystrtoul.o Python/pathconfig.o Python/preconfig.o Python/pyarena.o Python/pyctype.o Python/pyfpe.o Python/pyhash.o Python/pylifecycle.o Python/pymath.o Python/pystate.o Python/pythonrun.o Python/pytime.o Python/bootstrap_hash.o Python/specialize.o Python/structmember.o Python/symtable.o Python/sysmodule.o Python/thread.o Python/traceback.o Python/getopt.o Python/pystrcmp.o Python/pystrtod.o Python/pystrhex.o Python/dtoa.o Python/formatter_unicode.o Python/fileutils.o Python/suggestions.o Python/dynload_shlib.o Modules/config.o Modules/main.o Modules/gcmodule.o Modules/atexitmodule.o Modules/faulthandler.o Modules/posixmodule.o Modules/signalmodule.o Modules/_tracemalloc.o Modules/_codecsmodule.o Modules/_collectionsmodule.o Modules/errnomodule.o Modules/_io/_iomodule.o Modules/_io/iobase.o Modules/_io/fileio.o Modules/_io/bytesio.o Modules/_io/bufferedio.o Modules/_io/textio.o Modules/_io/stringio.o Modules/itertoolsmodule.o Modules/_sre/sre.o Modules/_threadmodule.o Modules/timemodule.o Modules/_weakref.o Modules/_abc.o Modules/_functoolsmodule.o Modules/_localemodule.o Modules/_operator.o Modules/_stat.o Modules/symtablemodule.o Modules/pwdmodule.o Modules/xxsubtype.o -ldl -lm
  978. ./Programs/_freeze_module importlib._bootstrap ./Lib/importlib/_bootstrap.py Python/frozen_modules/importlib._bootstrap.h
  979. ./Programs/_freeze_module importlib._bootstrap_external ./Lib/importlib/_bootstrap_external.py Python/frozen_modules/importlib._bootstrap_external.h
  980. ./Programs/_freeze_module getpath ./Modules/getpath.py Python/frozen_modules/getpath.h
  981. ./Programs/_freeze_module zipimport ./Lib/zipimport.py Python/frozen_modules/zipimport.h
  982. gcc -c -DNDEBUG -g -fwrapv -O3 -Wall -march=x86-64 -mtune=generic -O3 -pipe -fno-plt -fexceptions -Wp,-D_FORTIFY_SOURCE=3 -Wformat -Werror=format-security -fstack-clash-protection -fcf-protection -fno-omit-frame-pointer -mno-omit-leaf-frame-pointer -ffat-lto-objects -march=x86-64 -mtune=generic -O3 -pipe -fno-plt -fexceptions -Wp,-D_FORTIFY_SOURCE=3 -Wformat -Werror=format-security -fstack-clash-protection -fcf-protection -fno-omit-frame-pointer -mno-omit-leaf-frame-pointer -ffat-lto-objects -march=x86-64 -mtune=generic -O3 -pipe -fno-plt -fexceptions -Wp,-D_FORTIFY_SOURCE=3 -Wformat -Werror=format-security -fstack-clash-protection -fcf-protection -fno-omit-frame-pointer -mno-omit-leaf-frame-pointer -ffat-lto-objects -std=c11 -Werror=implicit-function-declaration -fvisibility=hidden -I./Include/internal -I. -I./Include -fPIC -DPy_BUILD_CORE -o Programs/_bootstrap_python.o Programs/_bootstrap_python.c
  983. gcc -c -DNDEBUG -g -fwrapv -O3 -Wall -march=x86-64 -mtune=generic -O3 -pipe -fno-plt -fexceptions -Wp,-D_FORTIFY_SOURCE=3 -Wformat -Werror=format-security -fstack-clash-protection -fcf-protection -fno-omit-frame-pointer -mno-omit-leaf-frame-pointer -ffat-lto-objects -march=x86-64 -mtune=generic -O3 -pipe -fno-plt -fexceptions -Wp,-D_FORTIFY_SOURCE=3 -Wformat -Werror=format-security -fstack-clash-protection -fcf-protection -fno-omit-frame-pointer -mno-omit-leaf-frame-pointer -ffat-lto-objects -march=x86-64 -mtune=generic -O3 -pipe -fno-plt -fexceptions -Wp,-D_FORTIFY_SOURCE=3 -Wformat -Werror=format-security -fstack-clash-protection -fcf-protection -fno-omit-frame-pointer -mno-omit-leaf-frame-pointer -ffat-lto-objects -std=c11 -Werror=implicit-function-declaration -fvisibility=hidden -I./Include/internal -I. -I./Include -fPIC -DPy_BUILD_CORE -DPYTHONPATH='""' \
  984. -DPREFIX='"/usr"' \
  985. -DEXEC_PREFIX='"/usr"' \
  986. -DVERSION='"3.11"' \
  987. -DVPATH='""' \
  988. -DPLATLIBDIR='"lib"' \
  989. -DPYTHONFRAMEWORK='""' \
  990. -o Modules/getpath.o ./Modules/getpath.c
  991. gcc -Wl,-O1 -Wl,--sort-common -Wl,--as-needed -Wl,-z,relro -Wl,-z,now -Wl,-z,pack-relative-relocs -Wl,-O1 -Wl,--sort-common -Wl,--as-needed -Wl,-z,relro -Wl,-z,now -Wl,-z,pack-relative-relocs -o _bootstrap_python Modules/getbuildinfo.o Parser/token.o Parser/pegen.o Parser/pegen_errors.o Parser/action_helpers.o Parser/parser.o Parser/string_parser.o Parser/peg_api.o Parser/myreadline.o Parser/tokenizer.o Objects/abstract.o Objects/accu.o Objects/boolobject.o Objects/bytes_methods.o Objects/bytearrayobject.o Objects/bytesobject.o Objects/call.o Objects/capsule.o Objects/cellobject.o Objects/classobject.o Objects/codeobject.o Objects/complexobject.o Objects/descrobject.o Objects/enumobject.o Objects/exceptions.o Objects/genericaliasobject.o Objects/genobject.o Objects/fileobject.o Objects/floatobject.o Objects/frameobject.o Objects/funcobject.o Objects/interpreteridobject.o Objects/iterobject.o Objects/listobject.o Objects/longobject.o Objects/dictobject.o Objects/odictobject.o Objects/memoryobject.o Objects/methodobject.o Objects/moduleobject.o Objects/namespaceobject.o Objects/object.o Objects/obmalloc.o Objects/picklebufobject.o Objects/rangeobject.o Objects/setobject.o Objects/sliceobject.o Objects/structseq.o Objects/tupleobject.o Objects/typeobject.o Objects/unicodeobject.o Objects/unicodectype.o Objects/unionobject.o Objects/weakrefobject.o Python/_warnings.o Python/Python-ast.o Python/Python-tokenize.o Python/asdl.o Python/ast.o Python/ast_opt.o Python/ast_unparse.o Python/bltinmodule.o Python/ceval.o Python/codecs.o Python/compile.o Python/context.o Python/dynamic_annotations.o Python/errors.o Python/frame.o Python/frozenmain.o Python/future.o Python/getargs.o Python/getcompiler.o Python/getcopyright.o Python/getplatform.o Python/getversion.o Python/hamt.o Python/hashtable.o Python/import.o Python/importdl.o Python/initconfig.o Python/marshal.o Python/modsupport.o Python/mysnprintf.o Python/mystrtoul.o Python/pathconfig.o Python/preconfig.o Python/pyarena.o Python/pyctype.o Python/pyfpe.o Python/pyhash.o Python/pylifecycle.o Python/pymath.o Python/pystate.o Python/pythonrun.o Python/pytime.o Python/bootstrap_hash.o Python/specialize.o Python/structmember.o Python/symtable.o Python/sysmodule.o Python/thread.o Python/traceback.o Python/getopt.o Python/pystrcmp.o Python/pystrtod.o Python/pystrhex.o Python/dtoa.o Python/formatter_unicode.o Python/fileutils.o Python/suggestions.o Python/dynload_shlib.o Modules/config.o Modules/main.o Modules/gcmodule.o Modules/atexitmodule.o Modules/faulthandler.o Modules/posixmodule.o Modules/signalmodule.o Modules/_tracemalloc.o Modules/_codecsmodule.o Modules/_collectionsmodule.o Modules/errnomodule.o Modules/_io/_iomodule.o Modules/_io/iobase.o Modules/_io/fileio.o Modules/_io/bytesio.o Modules/_io/bufferedio.o Modules/_io/textio.o Modules/_io/stringio.o Modules/itertoolsmodule.o Modules/_sre/sre.o Modules/_threadmodule.o Modules/timemodule.o Modules/_weakref.o Modules/_abc.o Modules/_functoolsmodule.o Modules/_localemodule.o Modules/_operator.o Modules/_stat.o Modules/symtablemodule.o Modules/pwdmodule.o Modules/xxsubtype.o \
  992. Programs/_bootstrap_python.o Modules/getpath.o -ldl -lm
  993. ./_bootstrap_python ./Programs/_freeze_module.py abc ./Lib/abc.py Python/frozen_modules/abc.h
  994. ./_bootstrap_python ./Programs/_freeze_module.py codecs ./Lib/codecs.py Python/frozen_modules/codecs.h
  995. ./_bootstrap_python ./Programs/_freeze_module.py io ./Lib/io.py Python/frozen_modules/io.h
  996. ./_bootstrap_python ./Programs/_freeze_module.py _collections_abc ./Lib/_collections_abc.py Python/frozen_modules/_collections_abc.h
  997. ./_bootstrap_python ./Programs/_freeze_module.py _sitebuiltins ./Lib/_sitebuiltins.py Python/frozen_modules/_sitebuiltins.h
  998. ./_bootstrap_python ./Programs/_freeze_module.py genericpath ./Lib/genericpath.py Python/frozen_modules/genericpath.h
  999. ./_bootstrap_python ./Programs/_freeze_module.py ntpath ./Lib/ntpath.py Python/frozen_modules/ntpath.h
  1000. ./_bootstrap_python ./Programs/_freeze_module.py posixpath ./Lib/posixpath.py Python/frozen_modules/posixpath.h
  1001. ./_bootstrap_python ./Programs/_freeze_module.py os ./Lib/os.py Python/frozen_modules/os.h
  1002. ./_bootstrap_python ./Programs/_freeze_module.py site ./Lib/site.py Python/frozen_modules/site.h
  1003. ./_bootstrap_python ./Programs/_freeze_module.py stat ./Lib/stat.py Python/frozen_modules/stat.h
  1004. ./_bootstrap_python ./Programs/_freeze_module.py importlib.util ./Lib/importlib/util.py Python/frozen_modules/importlib.util.h
  1005. ./_bootstrap_python ./Programs/_freeze_module.py importlib.machinery ./Lib/importlib/machinery.py Python/frozen_modules/importlib.machinery.h
  1006. ./_bootstrap_python ./Programs/_freeze_module.py runpy ./Lib/runpy.py Python/frozen_modules/runpy.h
  1007. ./_bootstrap_python ./Programs/_freeze_module.py __hello__ ./Lib/__hello__.py Python/frozen_modules/__hello__.h
  1008. ./_bootstrap_python ./Programs/_freeze_module.py __phello__ ./Lib/__phello__/__init__.py Python/frozen_modules/__phello__.h
  1009. ./_bootstrap_python ./Programs/_freeze_module.py __phello__.ham ./Lib/__phello__/ham/__init__.py Python/frozen_modules/__phello__.ham.h
  1010. ./_bootstrap_python ./Programs/_freeze_module.py __phello__.ham.eggs ./Lib/__phello__/ham/eggs.py Python/frozen_modules/__phello__.ham.eggs.h
  1011. ./_bootstrap_python ./Programs/_freeze_module.py __phello__.spam ./Lib/__phello__/spam.py Python/frozen_modules/__phello__.spam.h
  1012. ./_bootstrap_python ./Programs/_freeze_module.py frozen_only ./Tools/freeze/flag.py Python/frozen_modules/frozen_only.h
  1013. ./_bootstrap_python ./Tools/scripts/deepfreeze.py \
  1014. Python/frozen_modules/importlib._bootstrap.h:importlib._bootstrap \
  1015. Python/frozen_modules/importlib._bootstrap_external.h:importlib._bootstrap_external \
  1016. Python/frozen_modules/zipimport.h:zipimport \
  1017. Python/frozen_modules/abc.h:abc \
  1018. Python/frozen_modules/codecs.h:codecs \
  1019. Python/frozen_modules/io.h:io \
  1020. Python/frozen_modules/_collections_abc.h:_collections_abc \
  1021. Python/frozen_modules/_sitebuiltins.h:_sitebuiltins \
  1022. Python/frozen_modules/genericpath.h:genericpath \
  1023. Python/frozen_modules/ntpath.h:ntpath \
  1024. Python/frozen_modules/posixpath.h:posixpath \
  1025. Python/frozen_modules/os.h:os \
  1026. Python/frozen_modules/site.h:site \
  1027. Python/frozen_modules/stat.h:stat \
  1028. Python/frozen_modules/importlib.util.h:importlib.util \
  1029. Python/frozen_modules/importlib.machinery.h:importlib.machinery \
  1030. Python/frozen_modules/runpy.h:runpy \
  1031. Python/frozen_modules/__hello__.h:__hello__ \
  1032. Python/frozen_modules/__phello__.h:__phello__ \
  1033. Python/frozen_modules/__phello__.ham.h:__phello__.ham \
  1034. Python/frozen_modules/__phello__.ham.eggs.h:__phello__.ham.eggs \
  1035. Python/frozen_modules/__phello__.spam.h:__phello__.spam \
  1036. Python/frozen_modules/frozen_only.h:frozen_only \
  1037. -o Python/deepfreeze/deepfreeze.c
  1038. gcc -c -DNDEBUG -g -fwrapv -O3 -Wall -march=x86-64 -mtune=generic -O3 -pipe -fno-plt -fexceptions -Wp,-D_FORTIFY_SOURCE=3 -Wformat -Werror=format-security -fstack-clash-protection -fcf-protection -fno-omit-frame-pointer -mno-omit-leaf-frame-pointer -ffat-lto-objects -march=x86-64 -mtune=generic -O3 -pipe -fno-plt -fexceptions -Wp,-D_FORTIFY_SOURCE=3 -Wformat -Werror=format-security -fstack-clash-protection -fcf-protection -fno-omit-frame-pointer -mno-omit-leaf-frame-pointer -ffat-lto-objects -march=x86-64 -mtune=generic -O3 -pipe -fno-plt -fexceptions -Wp,-D_FORTIFY_SOURCE=3 -Wformat -Werror=format-security -fstack-clash-protection -fcf-protection -fno-omit-frame-pointer -mno-omit-leaf-frame-pointer -ffat-lto-objects -std=c11 -Werror=implicit-function-declaration -fvisibility=hidden -I./Include/internal -I. -I./Include -fPIC -DPy_BUILD_CORE -o Python/frozen.o Python/frozen.c
  1039. gcc -c -DNDEBUG -g -fwrapv -O3 -Wall -march=x86-64 -mtune=generic -O3 -pipe -fno-plt -fexceptions -Wp,-D_FORTIFY_SOURCE=3 -Wformat -Werror=format-security -fstack-clash-protection -fcf-protection -fno-omit-frame-pointer -mno-omit-leaf-frame-pointer -ffat-lto-objects -march=x86-64 -mtune=generic -O3 -pipe -fno-plt -fexceptions -Wp,-D_FORTIFY_SOURCE=3 -Wformat -Werror=format-security -fstack-clash-protection -fcf-protection -fno-omit-frame-pointer -mno-omit-leaf-frame-pointer -ffat-lto-objects -march=x86-64 -mtune=generic -O3 -pipe -fno-plt -fexceptions -Wp,-D_FORTIFY_SOURCE=3 -Wformat -Werror=format-security -fstack-clash-protection -fcf-protection -fno-omit-frame-pointer -mno-omit-leaf-frame-pointer -ffat-lto-objects -std=c11 -Werror=implicit-function-declaration -fvisibility=hidden -I./Include/internal -I. -I./Include -fPIC -DPy_BUILD_CORE -o Python/deepfreeze/deepfreeze.o Python/deepfreeze/deepfreeze.c
  1040. rm -f libpython3.11.a
  1041. if test libpython3.11.so.1.0 != libpython3.11.so; then \
  1042. gcc -shared -Wl,-O1 -Wl,--sort-common -Wl,--as-needed -Wl,-z,relro -Wl,-z,now -Wl,-z,pack-relative-relocs -Wl,-O1 -Wl,--sort-common -Wl,--as-needed -Wl,-z,relro -Wl,-z,now -Wl,-z,pack-relative-relocs -Wl,-hlibpython3.11.so.1.0 -o libpython3.11.so.1.0 Modules/getbuildinfo.o Parser/token.o Parser/pegen.o Parser/pegen_errors.o Parser/action_helpers.o Parser/parser.o Parser/string_parser.o Parser/peg_api.o Parser/myreadline.o Parser/tokenizer.o Objects/abstract.o Objects/accu.o Objects/boolobject.o Objects/bytes_methods.o Objects/bytearrayobject.o Objects/bytesobject.o Objects/call.o Objects/capsule.o Objects/cellobject.o Objects/classobject.o Objects/codeobject.o Objects/complexobject.o Objects/descrobject.o Objects/enumobject.o Objects/exceptions.o Objects/genericaliasobject.o Objects/genobject.o Objects/fileobject.o Objects/floatobject.o Objects/frameobject.o Objects/funcobject.o Objects/interpreteridobject.o Objects/iterobject.o Objects/listobject.o Objects/longobject.o Objects/dictobject.o Objects/odictobject.o Objects/memoryobject.o Objects/methodobject.o Objects/moduleobject.o Objects/namespaceobject.o Objects/object.o Objects/obmalloc.o Objects/picklebufobject.o Objects/rangeobject.o Objects/setobject.o Objects/sliceobject.o Objects/structseq.o Objects/tupleobject.o Objects/typeobject.o Objects/unicodeobject.o Objects/unicodectype.o Objects/unionobject.o Objects/weakrefobject.o Python/_warnings.o Python/Python-ast.o Python/Python-tokenize.o Python/asdl.o Python/ast.o Python/ast_opt.o Python/ast_unparse.o Python/bltinmodule.o Python/ceval.o Python/codecs.o Python/compile.o Python/context.o Python/dynamic_annotations.o Python/errors.o Python/frame.o Python/frozenmain.o Python/future.o Python/getargs.o Python/getcompiler.o Python/getcopyright.o Python/getplatform.o Python/getversion.o Python/hamt.o Python/hashtable.o Python/import.o Python/importdl.o Python/initconfig.o Python/marshal.o Python/modsupport.o Python/mysnprintf.o Python/mystrtoul.o Python/pathconfig.o Python/preconfig.o Python/pyarena.o Python/pyctype.o Python/pyfpe.o Python/pyhash.o Python/pylifecycle.o Python/pymath.o Python/pystate.o Python/pythonrun.o Python/pytime.o Python/bootstrap_hash.o Python/specialize.o Python/structmember.o Python/symtable.o Python/sysmodule.o Python/thread.o Python/traceback.o Python/getopt.o Python/pystrcmp.o Python/pystrtod.o Python/pystrhex.o Python/dtoa.o Python/formatter_unicode.o Python/fileutils.o Python/suggestions.o Python/dynload_shlib.o Modules/config.o Modules/main.o Modules/gcmodule.o Modules/atexitmodule.o Modules/faulthandler.o Modules/posixmodule.o Modules/signalmodule.o Modules/_tracemalloc.o Modules/_codecsmodule.o Modules/_collectionsmodule.o Modules/errnomodule.o Modules/_io/_iomodule.o Modules/_io/iobase.o Modules/_io/fileio.o Modules/_io/bytesio.o Modules/_io/bufferedio.o Modules/_io/textio.o Modules/_io/stringio.o Modules/itertoolsmodule.o Modules/_sre/sre.o Modules/_threadmodule.o Modules/timemodule.o Modules/_weakref.o Modules/_abc.o Modules/_functoolsmodule.o Modules/_localemodule.o Modules/_operator.o Modules/_stat.o Modules/symtablemodule.o Modules/pwdmodule.o Modules/xxsubtype.o Python/deepfreeze/deepfreeze.o Modules/getpath.o Python/frozen.o -ldl -lm; \
  1043. ln -f libpython3.11.so.1.0 libpython3.11.so; \
  1044. else \
  1045. gcc -shared -Wl,-O1 -Wl,--sort-common -Wl,--as-needed -Wl,-z,relro -Wl,-z,now -Wl,-z,pack-relative-relocs -Wl,-O1 -Wl,--sort-common -Wl,--as-needed -Wl,-z,relro -Wl,-z,now -Wl,-z,pack-relative-relocs -o libpython3.11.so Modules/getbuildinfo.o Parser/token.o Parser/pegen.o Parser/pegen_errors.o Parser/action_helpers.o Parser/parser.o Parser/string_parser.o Parser/peg_api.o Parser/myreadline.o Parser/tokenizer.o Objects/abstract.o Objects/accu.o Objects/boolobject.o Objects/bytes_methods.o Objects/bytearrayobject.o Objects/bytesobject.o Objects/call.o Objects/capsule.o Objects/cellobject.o Objects/classobject.o Objects/codeobject.o Objects/complexobject.o Objects/descrobject.o Objects/enumobject.o Objects/exceptions.o Objects/genericaliasobject.o Objects/genobject.o Objects/fileobject.o Objects/floatobject.o Objects/frameobject.o Objects/funcobject.o Objects/interpreteridobject.o Objects/iterobject.o Objects/listobject.o Objects/longobject.o Objects/dictobject.o Objects/odictobject.o Objects/memoryobject.o Objects/methodobject.o Objects/moduleobject.o Objects/namespaceobject.o Objects/object.o Objects/obmalloc.o Objects/picklebufobject.o Objects/rangeobject.o Objects/setobject.o Objects/sliceobject.o Objects/structseq.o Objects/tupleobject.o Objects/typeobject.o Objects/unicodeobject.o Objects/unicodectype.o Objects/unionobject.o Objects/weakrefobject.o Python/_warnings.o Python/Python-ast.o Python/Python-tokenize.o Python/asdl.o Python/ast.o Python/ast_opt.o Python/ast_unparse.o Python/bltinmodule.o Python/ceval.o Python/codecs.o Python/compile.o Python/context.o Python/dynamic_annotations.o Python/errors.o Python/frame.o Python/frozenmain.o Python/future.o Python/getargs.o Python/getcompiler.o Python/getcopyright.o Python/getplatform.o Python/getversion.o Python/hamt.o Python/hashtable.o Python/import.o Python/importdl.o Python/initconfig.o Python/marshal.o Python/modsupport.o Python/mysnprintf.o Python/mystrtoul.o Python/pathconfig.o Python/preconfig.o Python/pyarena.o Python/pyctype.o Python/pyfpe.o Python/pyhash.o Python/pylifecycle.o Python/pymath.o Python/pystate.o Python/pythonrun.o Python/pytime.o Python/bootstrap_hash.o Python/specialize.o Python/structmember.o Python/symtable.o Python/sysmodule.o Python/thread.o Python/traceback.o Python/getopt.o Python/pystrcmp.o Python/pystrtod.o Python/pystrhex.o Python/dtoa.o Python/formatter_unicode.o Python/fileutils.o Python/suggestions.o Python/dynload_shlib.o Modules/config.o Modules/main.o Modules/gcmodule.o Modules/atexitmodule.o Modules/faulthandler.o Modules/posixmodule.o Modules/signalmodule.o Modules/_tracemalloc.o Modules/_codecsmodule.o Modules/_collectionsmodule.o Modules/errnomodule.o Modules/_io/_iomodule.o Modules/_io/iobase.o Modules/_io/fileio.o Modules/_io/bytesio.o Modules/_io/bufferedio.o Modules/_io/textio.o Modules/_io/stringio.o Modules/itertoolsmodule.o Modules/_sre/sre.o Modules/_threadmodule.o Modules/timemodule.o Modules/_weakref.o Modules/_abc.o Modules/_functoolsmodule.o Modules/_localemodule.o Modules/_operator.o Modules/_stat.o Modules/symtablemodule.o Modules/pwdmodule.o Modules/xxsubtype.o Python/deepfreeze/deepfreeze.o Modules/getpath.o Python/frozen.o -ldl -lm; \
  1046. fi
  1047. ar rcs libpython3.11.a Modules/getbuildinfo.o Parser/token.o Parser/pegen.o Parser/pegen_errors.o Parser/action_helpers.o Parser/parser.o Parser/string_parser.o Parser/peg_api.o Parser/myreadline.o Parser/tokenizer.o Objects/abstract.o Objects/accu.o Objects/boolobject.o Objects/bytes_methods.o Objects/bytearrayobject.o Objects/bytesobject.o Objects/call.o Objects/capsule.o Objects/cellobject.o Objects/classobject.o Objects/codeobject.o Objects/complexobject.o Objects/descrobject.o Objects/enumobject.o Objects/exceptions.o Objects/genericaliasobject.o Objects/genobject.o Objects/fileobject.o Objects/floatobject.o Objects/frameobject.o Objects/funcobject.o Objects/interpreteridobject.o Objects/iterobject.o Objects/listobject.o Objects/longobject.o Objects/dictobject.o Objects/odictobject.o Objects/memoryobject.o Objects/methodobject.o Objects/moduleobject.o Objects/namespaceobject.o Objects/object.o Objects/obmalloc.o Objects/picklebufobject.o Objects/rangeobject.o Objects/setobject.o Objects/sliceobject.o Objects/structseq.o Objects/tupleobject.o Objects/typeobject.o Objects/unicodeobject.o Objects/unicodectype.o Objects/unionobject.o Objects/weakrefobject.o Python/_warnings.o Python/Python-ast.o Python/Python-tokenize.o Python/asdl.o Python/ast.o Python/ast_opt.o Python/ast_unparse.o Python/bltinmodule.o Python/ceval.o Python/codecs.o Python/compile.o Python/context.o Python/dynamic_annotations.o Python/errors.o Python/frame.o Python/frozenmain.o Python/future.o Python/getargs.o Python/getcompiler.o Python/getcopyright.o Python/getplatform.o Python/getversion.o Python/hamt.o Python/hashtable.o Python/import.o Python/importdl.o Python/initconfig.o Python/marshal.o Python/modsupport.o Python/mysnprintf.o Python/mystrtoul.o Python/pathconfig.o Python/preconfig.o Python/pyarena.o Python/pyctype.o Python/pyfpe.o Python/pyhash.o Python/pylifecycle.o Python/pymath.o Python/pystate.o Python/pythonrun.o Python/pytime.o Python/bootstrap_hash.o Python/specialize.o Python/structmember.o Python/symtable.o Python/sysmodule.o Python/thread.o Python/traceback.o Python/getopt.o Python/pystrcmp.o Python/pystrtod.o Python/pystrhex.o Python/dtoa.o Python/formatter_unicode.o Python/fileutils.o Python/suggestions.o Python/dynload_shlib.o Modules/config.o Modules/main.o Modules/gcmodule.o Modules/atexitmodule.o Modules/faulthandler.o Modules/posixmodule.o Modules/signalmodule.o Modules/_tracemalloc.o Modules/_codecsmodule.o Modules/_collectionsmodule.o Modules/errnomodule.o Modules/_io/_iomodule.o Modules/_io/iobase.o Modules/_io/fileio.o Modules/_io/bytesio.o Modules/_io/bufferedio.o Modules/_io/textio.o Modules/_io/stringio.o Modules/itertoolsmodule.o Modules/_sre/sre.o Modules/_threadmodule.o Modules/timemodule.o Modules/_weakref.o Modules/_abc.o Modules/_functoolsmodule.o Modules/_localemodule.o Modules/_operator.o Modules/_stat.o Modules/symtablemodule.o Modules/pwdmodule.o Modules/xxsubtype.o Python/deepfreeze/deepfreeze.o Modules/getpath.o Python/frozen.o
  1048. gcc -shared -Wl,-O1 -Wl,--sort-common -Wl,--as-needed -Wl,-z,relro -Wl,-z,now -Wl,-z,pack-relative-relocs -Wl,-O1 -Wl,--sort-common -Wl,--as-needed -Wl,-z,relro -Wl,-z,now -Wl,-z,pack-relative-relocs -Wl,--no-as-needed -o libpython3.so -Wl,-hlibpython3.so libpython3.11.so
  1049. gcc -Wl,-O1 -Wl,--sort-common -Wl,--as-needed -Wl,-z,relro -Wl,-z,now -Wl,-z,pack-relative-relocs -Wl,-O1 -Wl,--sort-common -Wl,--as-needed -Wl,-z,relro -Wl,-z,now -Wl,-z,pack-relative-relocs -Xlinker -export-dynamic -o python Programs/python.o -L. -lpython3.11 -ldl -lm
  1050. gcc -Wl,-O1 -Wl,--sort-common -Wl,--as-needed -Wl,-z,relro -Wl,-z,now -Wl,-z,pack-relative-relocs -Wl,-O1 -Wl,--sort-common -Wl,--as-needed -Wl,-z,relro -Wl,-z,now -Wl,-z,pack-relative-relocs -Xlinker -export-dynamic -o Programs/_testembed Programs/_testembed.o -L. -lpython3.11 -ldl -lm
  1051. /usr/bin/ld: LD_LIBRARY_PATH=/mnt/Linux Files/Invoke-manual/python311/src/Python-3.11.14 ./python -E -S -m sysconfig --generate-posix-vars ;\
  1052. if test $? -ne 0 ; then \
  1053. echo "generate-posix-vars failed" ; \
  1054. rm -f ./pybuilddir.txt ; \
  1055. exit 1 ; \
  1056. fi
  1057. Programs/_testembed.o: in function `config_set_string':
  1058. /mnt/Linux Files/Invoke-manual/python311/src/Python-3.11.14/./Programs/_testembed.c:56:(.text+0x93): undefined reference to `__gcov_time_profiler_counter'
  1059. /usr/bin/ld: Programs/_testembed.o: in function `init_from_config_clear':
  1060. /mnt/Linux Files/Invoke-manual/python311/src/Python-3.11.14/./Programs/_testembed.c:73:(.text+0x19b): undefined reference to `__gcov_time_profiler_counter'
  1061. /usr/bin/ld: Programs/_testembed.o: in function `_testembed_Py_InitializeFromConfig':
  1062. /mnt/Linux Files/Invoke-manual/python311/src/Python-3.11.14/./Programs/_testembed.c:82:(.text+0x283): undefined reference to `__gcov_time_profiler_counter'
  1063. /usr/bin/ld: Programs/_testembed.o: in function `config_set_argv':
  1064. /mnt/Linux Files/Invoke-manual/python311/src/Python-3.11.14/./Programs/_testembed.c:456:(.text+0x333): undefined reference to `__gcov_time_profiler_counter'
  1065. /usr/bin/ld: Programs/_testembed.o: in function `set_all_env_vars':
  1066. /mnt/Linux Files/Invoke-manual/python311/src/Python-3.11.14/./Programs/_testembed.c:783:(.text+0x583): undefined reference to `__gcov_time_profiler_counter'
  1067. /usr/bin/ld: Programs/_testembed.o:/mnt/Linux Files/Invoke-manual/python311/src/Python-3.11.14/./Programs/_testembed.c:783: more undefined references to `__gcov_time_profiler_counter' follow
  1068. /usr/bin/ld: Programs/_testembed.o: in function `free_wrapper':
  1069. /mnt/Linux Files/Invoke-manual/python311/src/Python-3.11.14/./Programs/_testembed.c:2005:(.text+0x8fb): undefined reference to `__gcov_indirect_call'
  1070. /usr/bin/ld: /mnt/Linux Files/Invoke-manual/python311/src/Python-3.11.14/./Programs/_testembed.c:2007:(.text+0x923): undefined reference to `__gcov_indirect_call'
  1071. /usr/bin/ld: /mnt/Linux Files/Invoke-manual/python311/src/Python-3.11.14/./Programs/_testembed.c:2008:(.text+0x976): undefined reference to `__gcov_indirect_call_profiler_v4'
  1072. /usr/bin/ld: /mnt/Linux Files/Invoke-manual/python311/src/Python-3.11.14/./Programs/_testembed.c:2008:(.text+0x983): undefined reference to `__gcov_time_profiler_counter'
  1073. /usr/bin/ld: Programs/_testembed.o: in function `realloc_wrapper':
  1074. /mnt/Linux Files/Invoke-manual/python311/src/Python-3.11.14/./Programs/_testembed.c:1998:(.text+0x9bc): undefined reference to `__gcov_indirect_call'
  1075. /usr/bin/ld: /mnt/Linux Files/Invoke-manual/python311/src/Python-3.11.14/./Programs/_testembed.c:2000:(.text+0x9e4): undefined reference to `__gcov_indirect_call'
  1076. /usr/bin/ld: /mnt/Linux Files/Invoke-manual/python311/src/Python-3.11.14/./Programs/_testembed.c:2001:(.text+0xa36): undefined reference to `__gcov_indirect_call_profiler_v4'
  1077. /usr/bin/ld: /mnt/Linux Files/Invoke-manual/python311/src/Python-3.11.14/./Programs/_testembed.c:2001:(.text+0xa43): undefined reference to `__gcov_time_profiler_counter'
  1078. /usr/bin/ld: Programs/_testembed.o: in function `calloc_wrapper':
  1079. /mnt/Linux Files/Invoke-manual/python311/src/Python-3.11.14/./Programs/_testembed.c:1991:(.text+0xa7c): undefined reference to `__gcov_indirect_call'
  1080. /usr/bin/ld: /mnt/Linux Files/Invoke-manual/python311/src/Python-3.11.14/./Programs/_testembed.c:1993:(.text+0xaa4): undefined reference to `__gcov_indirect_call'
  1081. /usr/bin/ld: /mnt/Linux Files/Invoke-manual/python311/src/Python-3.11.14/./Programs/_testembed.c:1994:(.text+0xaf6): undefined reference to `__gcov_indirect_call_profiler_v4'
  1082. /usr/bin/ld: /mnt/Linux Files/Invoke-manual/python311/src/Python-3.11.14/./Programs/_testembed.c:1994:(.text+0xb03): undefined reference to `__gcov_time_profiler_counter'
  1083. /usr/bin/ld: Programs/_testembed.o: in function `malloc_wrapper':
  1084. /mnt/Linux Files/Invoke-manual/python311/src/Python-3.11.14/./Programs/_testembed.c:1981:(.text+0xb64): undefined reference to `__gcov_indirect_call'
  1085. /usr/bin/ld: /mnt/Linux Files/Invoke-manual/python311/src/Python-3.11.14/./Programs/_testembed.c:1986:(.text+0xc33): undefined reference to `__gcov_indirect_call'
  1086. /usr/bin/ld: /mnt/Linux Files/Invoke-manual/python311/src/Python-3.11.14/./Programs/_testembed.c:1987:(.text+0xc8e): undefined reference to `__gcov_indirect_call_profiler_v4'
  1087. /usr/bin/ld: /mnt/Linux Files/Invoke-manual/python311/src/Python-3.11.14/./Programs/_testembed.c:1987:(.text+0xca3): undefined reference to `__gcov_time_profiler_counter'
  1088. /usr/bin/ld: /mnt/Linux Files/Invoke-manual/python311/src/Python-3.11.14/./Programs/_testembed.c:1987:(.text+0xcc3): undefined reference to `__gcov_time_profiler_counter'
  1089. /usr/bin/ld: Programs/_testembed.o: in function `test_repeated_init_and_inittab':
  1090. /mnt/Linux Files/Invoke-manual/python311/src/Python-3.11.14/./Programs/_testembed.c:1945:(.text+0xd34): undefined reference to `__gcov_indirect_call'
  1091. /usr/bin/ld: /mnt/Linux Files/Invoke-manual/python311/src/Python-3.11.14/./Programs/_testembed.c:1974:(.text+0xe66): undefined reference to `__gcov_indirect_call_profiler_v4'
  1092. /usr/bin/ld: /mnt/Linux Files/Invoke-manual/python311/src/Python-3.11.14/./Programs/_testembed.c:1974:(.text+0xe73): undefined reference to `__gcov_time_profiler_counter'
  1093. /usr/bin/ld: Programs/_testembed.o: in function `test_frozenmain':
  1094. /mnt/Linux Files/Invoke-manual/python311/src/Python-3.11.14/./Programs/_testembed.c:1927:(.text+0xf0f): undefined reference to `__gcov_indirect_call'
  1095. /usr/bin/ld: /mnt/Linux Files/Invoke-manual/python311/src/Python-3.11.14/./Programs/_testembed.c:1941:(.text+0xfbe): undefined reference to `__gcov_indirect_call_profiler_v4'
  1096. /usr/bin/ld: /mnt/Linux Files/Invoke-manual/python311/src/Python-3.11.14/./Programs/_testembed.c:1941:(.text+0xfd3): undefined reference to `__gcov_time_profiler_counter'
  1097. /usr/bin/ld: Programs/_testembed.o: in function `test_unicode_id_init':
  1098. /mnt/Linux Files/Invoke-manual/python311/src/Python-3.11.14/./Programs/_testembed.c:1889:(.text+0x1013): undefined reference to `__gcov_indirect_call'
  1099. /usr/bin/ld: /mnt/Linux Files/Invoke-manual/python311/src/Python-3.11.14/./Programs/_testembed.c:1900:(.text+0x113e): undefined reference to `__gcov_indirect_call_profiler_v4'
  1100. /usr/bin/ld: /mnt/Linux Files/Invoke-manual/python311/src/Python-3.11.14/./Programs/_testembed.c:1900:(.text+0x1153): undefined reference to `__gcov_time_profiler_counter'
  1101. /usr/bin/ld: Programs/_testembed.o: in function `test_get_argc_argv':
  1102. /mnt/Linux Files/Invoke-manual/python311/src/Python-3.11.14/./Programs/_testembed.c:1808:(.text+0x1193): undefined reference to `__gcov_indirect_call'
  1103. /usr/bin/ld: /mnt/Linux Files/Invoke-manual/python311/src/Python-3.11.14/./Programs/_testembed.c:1841:(.text+0x14e3): undefined reference to `__gcov_time_profiler_counter'
  1104. /usr/bin/ld: /mnt/Linux Files/Invoke-manual/python311/src/Python-3.11.14/./Programs/_testembed.c:1841:(.text+0x150e): undefined reference to `__gcov_indirect_call_profiler_v4'
  1105. /usr/bin/ld: Programs/_testembed.o: in function `test_run_main':
  1106. /mnt/Linux Files/Invoke-manual/python311/src/Python-3.11.14/./Programs/_testembed.c:1777:(.text+0x1593): undefined reference to `__gcov_indirect_call'
  1107. /usr/bin/ld: /mnt/Linux Files/Invoke-manual/python311/src/Python-3.11.14/./Programs/_testembed.c:1790:(.text+0x1696): undefined reference to `__gcov_indirect_call_profiler_v4'
  1108. /usr/bin/ld: /mnt/Linux Files/Invoke-manual/python311/src/Python-3.11.14/./Programs/_testembed.c:1790:(.text+0x16a3): undefined reference to `__gcov_time_profiler_counter'
  1109. /usr/bin/ld: Programs/_testembed.o: in function `test_run_main_loop':
  1110. /mnt/Linux Files/Invoke-manual/python311/src/Python-3.11.14/./Programs/_testembed.c:1794:(.text+0x16e1): undefined reference to `__gcov_indirect_call'
  1111. /usr/bin/ld: /mnt/Linux Files/Invoke-manual/python311/src/Python-3.11.14/./Programs/_testembed.c:1804:(.text+0x1743): undefined reference to `__gcov_time_profiler_counter'
  1112. /usr/bin/ld: /mnt/Linux Files/Invoke-manual/python311/src/Python-3.11.14/./Programs/_testembed.c:1804:(.text+0x176e): undefined reference to `__gcov_indirect_call_profiler_v4'
  1113. /usr/bin/ld: Programs/_testembed.o: in function `test_init_main':
  1114. /mnt/Linux Files/Invoke-manual/python311/src/Python-3.11.14/./Programs/_testembed.c:1750:(.text+0x17a3): undefined reference to `__gcov_indirect_call'
  1115. /usr/bin/ld: /mnt/Linux Files/Invoke-manual/python311/src/Python-3.11.14/./Programs/_testembed.c:1773:(.text+0x193e): undefined reference to `__gcov_indirect_call_profiler_v4'
  1116. /usr/bin/ld: /mnt/Linux Files/Invoke-manual/python311/src/Python-3.11.14/./Programs/_testembed.c:1773:(.text+0x1953): undefined reference to `__gcov_time_profiler_counter'
  1117. /usr/bin/ld: /mnt/Linux Files/Invoke-manual/python311/src/Python-3.11.14/./Programs/_testembed.c:1773:(.text+0x1973): undefined reference to `__gcov_time_profiler_counter'
  1118. /usr/bin/ld: Programs/_testembed.o: in function `test_init_set_config':
  1119. /mnt/Linux Files/Invoke-manual/python311/src/Python-3.11.14/./Programs/_testembed.c:1695:(.text+0x1a03): undefined reference to `__gcov_indirect_call'
  1120. /usr/bin/ld: /mnt/Linux Files/Invoke-manual/python311/src/Python-3.11.14/./Programs/_testembed.c:1719:(.text+0x1bae): undefined reference to `__gcov_indirect_call_profiler_v4'
  1121. /usr/bin/ld: /mnt/Linux Files/Invoke-manual/python311/src/Python-3.11.14/./Programs/_testembed.c:1719:(.text+0x1bc3): undefined reference to `__gcov_time_profiler_counter'
  1122. /usr/bin/ld: /mnt/Linux Files/Invoke-manual/python311/src/Python-3.11.14/./Programs/_testembed.c:1719:(.text+0x1be3): undefined reference to `__gcov_time_profiler_counter'
  1123. /usr/bin/ld: Programs/_testembed.o: in function `test_init_warnoptions':
  1124. /mnt/Linux Files/Invoke-manual/python311/src/Python-3.11.14/./Programs/_testembed.c:1621:(.text+0x1cc7): undefined reference to `__gcov_indirect_call'
  1125. /usr/bin/ld: /mnt/Linux Files/Invoke-manual/python311/src/Python-3.11.14/./Programs/_testembed.c:1670:(.text+0x1f9e): undefined reference to `__gcov_indirect_call_profiler_v4'
  1126. /usr/bin/ld: /mnt/Linux Files/Invoke-manual/python311/src/Python-3.11.14/./Programs/_testembed.c:1670:(.text+0x1fb3): undefined reference to `__gcov_time_profiler_counter'
  1127. /usr/bin/ld: Programs/_testembed.o: in function `test_init_sys_add':
  1128. /mnt/Linux Files/Invoke-manual/python311/src/Python-3.11.14/./Programs/_testembed.c:1451:(.text+0x2085): undefined reference to `__gcov_indirect_call'
  1129. /usr/bin/ld: /mnt/Linux Files/Invoke-manual/python311/src/Python-3.11.14/./Programs/_testembed.c:1492:(.text+0x22ae): undefined reference to `__gcov_indirect_call_profiler_v4'
  1130. /usr/bin/ld: /mnt/Linux Files/Invoke-manual/python311/src/Python-3.11.14/./Programs/_testembed.c:1492:(.text+0x22c3): undefined reference to `__gcov_time_profiler_counter'
  1131. /usr/bin/ld: Programs/_testembed.o: in function `test_init_read_set':
  1132. /mnt/Linux Files/Invoke-manual/python311/src/Python-3.11.14/./Programs/_testembed.c:1408:(.text+0x2367): undefined reference to `__gcov_indirect_call'
  1133. /usr/bin/ld: /mnt/Linux Files/Invoke-manual/python311/src/Python-3.11.14/./Programs/_testembed.c:1447:(.text+0x259e): undefined reference to `__gcov_indirect_call_profiler_v4'
  1134. /usr/bin/ld: /mnt/Linux Files/Invoke-manual/python311/src/Python-3.11.14/./Programs/_testembed.c:1447:(.text+0x25b3): undefined reference to `__gcov_time_profiler_counter'
  1135. /usr/bin/ld: Programs/_testembed.o: in function `test_audit_run_file':
  1136. /mnt/Linux Files/Invoke-manual/python311/src/Python-3.11.14/./Programs/_testembed.c:1352:(.text+0x265f): undefined reference to `__gcov_indirect_call'
  1137. /usr/bin/ld: /mnt/Linux Files/Invoke-manual/python311/src/Python-3.11.14/./Programs/_testembed.c:1360:(.text+0x271e): undefined reference to `__gcov_indirect_call_profiler_v4'
  1138. /usr/bin/ld: /mnt/Linux Files/Invoke-manual/python311/src/Python-3.11.14/./Programs/_testembed.c:1360:(.text+0x2733): undefined reference to `__gcov_time_profiler_counter'
  1139. /usr/bin/ld: Programs/_testembed.o: in function `test_audit_run_command':
  1140. /mnt/Linux Files/Invoke-manual/python311/src/Python-3.11.14/./Programs/_testembed.c:1341:(.text+0x277f): undefined reference to `__gcov_indirect_call'
  1141. /usr/bin/ld: /mnt/Linux Files/Invoke-manual/python311/src/Python-3.11.14/./Programs/_testembed.c:1349:(.text+0x2846): undefined reference to `__gcov_indirect_call_profiler_v4'
  1142. /usr/bin/ld: /mnt/Linux Files/Invoke-manual/python311/src/Python-3.11.14/./Programs/_testembed.c:1349:(.text+0x2853): undefined reference to `__gcov_time_profiler_counter'
  1143. /usr/bin/ld: Programs/_testembed.o: in function `_audit_hook_run':
  1144. /mnt/Linux Files/Invoke-manual/python311/src/Python-3.11.14/./Programs/_testembed.c:1321:(.text+0x289e): undefined reference to `__gcov_indirect_call'
  1145. /usr/bin/ld: /mnt/Linux Files/Invoke-manual/python311/src/Python-3.11.14/./Programs/_testembed.c:1338:(.text+0x293b): undefined reference to `__gcov_time_profiler_counter'
  1146. /usr/bin/ld: /mnt/Linux Files/Invoke-manual/python311/src/Python-3.11.14/./Programs/_testembed.c:1338:(.text+0x2966): undefined reference to `__gcov_indirect_call_profiler_v4'
  1147. /usr/bin/ld: Programs/_testembed.o: in function `test_audit_subinterpreter':
  1148. /mnt/Linux Files/Invoke-manual/python311/src/Python-3.11.14/./Programs/_testembed.c:1297:(.text+0x2a0c): undefined reference to `__gcov_indirect_call'
  1149. /usr/bin/ld: /mnt/Linux Files/Invoke-manual/python311/src/Python-3.11.14/./Programs/_testembed.c:1313:(.text+0x2ae3): undefined reference to `__gcov_time_profiler_counter'
  1150. /usr/bin/ld: /mnt/Linux Files/Invoke-manual/python311/src/Python-3.11.14/./Programs/_testembed.c:1313:(.text+0x2b0e): undefined reference to `__gcov_indirect_call_profiler_v4'
  1151. /usr/bin/ld: Programs/_testembed.o: in function `_audit_subinterpreter_hook':
  1152. /mnt/Linux Files/Invoke-manual/python311/src/Python-3.11.14/./Programs/_testembed.c:1288:(.text+0x2b34): undefined reference to `__gcov_indirect_call'
  1153. /usr/bin/ld: /mnt/Linux Files/Invoke-manual/python311/src/Python-3.11.14/./Programs/_testembed.c:1294:(.text+0x2bbe): undefined reference to `__gcov_indirect_call_profiler_v4'
  1154. /usr/bin/ld: /mnt/Linux Files/Invoke-manual/python311/src/Python-3.11.14/./Programs/_testembed.c:1294:(.text+0x2bcb): undefined reference to `__gcov_time_profiler_counter'
  1155. /usr/bin/ld: Programs/_testembed.o: in function `_audit_hook':
  1156. /mnt/Linux Files/Invoke-manual/python311/src/Python-3.11.14/./Programs/_testembed.c:1222:(.text+0x2c0e): undefined reference to `__gcov_indirect_call'
  1157. /usr/bin/ld: /mnt/Linux Files/Invoke-manual/python311/src/Python-3.11.14/./Programs/_testembed.c:1226:(.text+0x2d0e): undefined reference to `__gcov_indirect_call_profiler_v4'
  1158. /usr/bin/ld: /mnt/Linux Files/Invoke-manual/python311/src/Python-3.11.14/./Programs/_testembed.c:1226:(.text+0x2d23): undefined reference to `__gcov_time_profiler_counter'
  1159. /usr/bin/ld: Programs/_testembed.o: in function `test_open_code_hook':
  1160. /mnt/Linux Files/Invoke-manual/python311/src/Python-3.11.14/./Programs/_testembed.c:1163:(.text+0x2d90): undefined reference to `__gcov_indirect_call'
  1161. /usr/bin/ld: /mnt/Linux Files/Invoke-manual/python311/src/Python-3.11.14/./Programs/_testembed.c:1186:(.text+0x300e): undefined reference to `__gcov_indirect_call_profiler_v4'
  1162. /usr/bin/ld: /mnt/Linux Files/Invoke-manual/python311/src/Python-3.11.14/./Programs/_testembed.c:1186:(.text+0x3023): undefined reference to `__gcov_time_profiler_counter'
  1163. /usr/bin/ld: Programs/_testembed.o: in function `_open_code_hook':
  1164. /mnt/Linux Files/Invoke-manual/python311/src/Python-3.11.14/./Programs/_testembed.c:1151:(.text+0x3175): undefined reference to `__gcov_indirect_call'
  1165. /usr/bin/ld: /mnt/Linux Files/Invoke-manual/python311/src/Python-3.11.14/./Programs/_testembed.c:1160:(.text+0x3233): undefined reference to `__gcov_time_profiler_counter'
  1166. /usr/bin/ld: /mnt/Linux Files/Invoke-manual/python311/src/Python-3.11.14/./Programs/_testembed.c:1160:(.text+0x325e): undefined reference to `__gcov_indirect_call_profiler_v4'
  1167. /usr/bin/ld: Programs/_testembed.o: in function `test_init_dev_mode':
  1168. /mnt/Linux Files/Invoke-manual/python311/src/Python-3.11.14/./Programs/_testembed.c:1135:(.text+0x32a3): undefined reference to `__gcov_indirect_call'
  1169. /usr/bin/ld: /mnt/Linux Files/Invoke-manual/python311/src/Python-3.11.14/./Programs/_testembed.c:1148:(.text+0x339e): undefined reference to `__gcov_indirect_call_profiler_v4'
  1170. /usr/bin/ld: /mnt/Linux Files/Invoke-manual/python311/src/Python-3.11.14/./Programs/_testembed.c:1148:(.text+0x33b3): undefined reference to `__gcov_time_profiler_counter'
  1171. /usr/bin/ld: Programs/_testembed.o: in function `test_init_dont_configure_locale':
  1172. /mnt/Linux Files/Invoke-manual/python311/src/Python-3.11.14/./Programs/_testembed.c:1109:(.text+0x3403): undefined reference to `__gcov_indirect_call'
  1173. /usr/bin/ld: /mnt/Linux Files/Invoke-manual/python311/src/Python-3.11.14/./Programs/_testembed.c:1131:(.text+0x354e): undefined reference to `__gcov_indirect_call_profiler_v4'
  1174. /usr/bin/ld: /mnt/Linux Files/Invoke-manual/python311/src/Python-3.11.14/./Programs/_testembed.c:1131:(.text+0x3563): undefined reference to `__gcov_time_profiler_counter'
  1175. /usr/bin/ld: Programs/_testembed.o: in function `test_preinit_parse_argv':
  1176. /mnt/Linux Files/Invoke-manual/python311/src/Python-3.11.14/./Programs/_testembed.c:965:(.text+0x35e3): undefined reference to `__gcov_indirect_call'
  1177. /usr/bin/ld: /mnt/Linux Files/Invoke-manual/python311/src/Python-3.11.14/./Programs/_testembed.c:979:(.text+0x370e): undefined reference to `__gcov_indirect_call_profiler_v4'
  1178. /usr/bin/ld: /mnt/Linux Files/Invoke-manual/python311/src/Python-3.11.14/./Programs/_testembed.c:979:(.text+0x3723): undefined reference to `__gcov_time_profiler_counter'
  1179. /usr/bin/ld: Programs/_testembed.o: in function `test_preinit_dont_parse_argv':
  1180. /mnt/Linux Files/Invoke-manual/python311/src/Python-3.11.14/./Programs/_testembed.c:927:(.text+0x37b1): undefined reference to `__gcov_indirect_call'
  1181. /usr/bin/ld: /mnt/Linux Files/Invoke-manual/python311/src/Python-3.11.14/./Programs/_testembed.c:961:(.text+0x3976): undefined reference to `__gcov_indirect_call_profiler_v4'
  1182. /usr/bin/ld: /mnt/Linux Files/Invoke-manual/python311/src/Python-3.11.14/./Programs/_testembed.c:961:(.text+0x3983): undefined reference to `__gcov_time_profiler_counter'
  1183. /usr/bin/ld: Programs/_testembed.o: in function `test_preinit_isolated2':
  1184. /mnt/Linux Files/Invoke-manual/python311/src/Python-3.11.14/./Programs/_testembed.c:898:(.text+0x3a03): undefined reference to `__gcov_indirect_call'
  1185. /usr/bin/ld: /mnt/Linux Files/Invoke-manual/python311/src/Python-3.11.14/./Programs/_testembed.c:923:(.text+0x3b5e): undefined reference to `__gcov_indirect_call_profiler_v4'
  1186. /usr/bin/ld: /mnt/Linux Files/Invoke-manual/python311/src/Python-3.11.14/./Programs/_testembed.c:923:(.text+0x3b73): undefined reference to `__gcov_time_profiler_counter'
  1187. /usr/bin/ld: Programs/_testembed.o: in function `test_preinit_isolated1':
  1188. /mnt/Linux Files/Invoke-manual/python311/src/Python-3.11.14/./Programs/_testembed.c:872:(.text+0x3bf3): undefined reference to `__gcov_indirect_call'
  1189. /usr/bin/ld: /mnt/Linux Files/Invoke-manual/python311/src/Python-3.11.14/./Programs/_testembed.c:893:(.text+0x3d36): undefined reference to `__gcov_indirect_call_profiler_v4'
  1190. /usr/bin/ld: /mnt/Linux Files/Invoke-manual/python311/src/Python-3.11.14/./Programs/_testembed.c:893:(.text+0x3d43): undefined reference to `__gcov_time_profiler_counter'
  1191. /usr/bin/ld: Programs/_testembed.o: in function `test_init_isolated_flag':
  1192. /mnt/Linux Files/Invoke-manual/python311/src/Python-3.11.14/./Programs/_testembed.c:848:(.text+0x3dc3): undefined reference to `__gcov_indirect_call'
  1193. /usr/bin/ld: /mnt/Linux Files/Invoke-manual/python311/src/Python-3.11.14/./Programs/_testembed.c:867:(.text+0x3ec6): undefined reference to `__gcov_indirect_call_profiler_v4'
  1194. /usr/bin/ld: /mnt/Linux Files/Invoke-manual/python311/src/Python-3.11.14/./Programs/_testembed.c:867:(.text+0x3ed3): undefined reference to `__gcov_time_profiler_counter'
  1195. /usr/bin/ld: Programs/_testembed.o: in function `test_init_env_dev_mode_alloc':
  1196. /mnt/Linux Files/Invoke-manual/python311/src/Python-3.11.14/./Programs/_testembed.c:835:(.text+0x3f0c): undefined reference to `__gcov_indirect_call'
  1197. /usr/bin/ld: /mnt/Linux Files/Invoke-manual/python311/src/Python-3.11.14/./Programs/_testembed.c:844:(.text+0x3ffe): undefined reference to `__gcov_indirect_call_profiler_v4'
  1198. /usr/bin/ld: /mnt/Linux Files/Invoke-manual/python311/src/Python-3.11.14/./Programs/_testembed.c:844:(.text+0x4013): undefined reference to `__gcov_time_profiler_counter'
  1199. /usr/bin/ld: /mnt/Linux Files/Invoke-manual/python311/src/Python-3.11.14/./Programs/_testembed.c:844:(.text+0x4033): undefined reference to `__gcov_time_profiler_counter'
  1200. /usr/bin/ld: Programs/_testembed.o: in function `test_init_python_env':
  1201. /mnt/Linux Files/Invoke-manual/python311/src/Python-3.11.14/./Programs/_testembed.c:799:(.text+0x4073): undefined reference to `__gcov_indirect_call'
  1202. /usr/bin/ld: /mnt/Linux Files/Invoke-manual/python311/src/Python-3.11.14/./Programs/_testembed.c:811:(.text+0x4146): undefined reference to `__gcov_indirect_call_profiler_v4'
  1203. /usr/bin/ld/bin/sh: line 1: Files/Invoke-manual/python311/src/Python-3.11.14: No such file or directory
  1204. : /mnt/Linux Files/Invoke-manual/python311/src/Python-3.11.14/./Programs/_testembed.c:811:(.text+0x4153): undefined reference to `__gcov_time_profiler_counter'
  1205. /usr/bin/ld: Programs/_testembed.o: in function `test_init_compat_env':
  1206. /mnt/Linux Files/Invoke-manual/python311/src/Python-3.11.14/./Programs/_testembed.c:787:(.text+0x418c): undefined reference to `__gcov_indirect_call'
  1207. /usr/bin/ld: /mnt/Linux Files/Invoke-manual/python311/src/Python-3.11.14/./Programs/_testembed.c:795:(.text+0x420e): undefined reference to `__gcov_indirect_call_profiler_v4'
  1208. /usr/bin/ld: /mnt/Linux Files/Invoke-manual/python311/src/Python-3.11.14/./Programs/_testembed.c:795:(.text+0x421b): undefined reference to `__gcov_time_profiler_counter'
  1209. /usr/bin/ld: Programs/_testembed.o: in function `test_init_from_config':
  1210. /mnt/Linux Files/Invoke-manual/python311/src/Python-3.11.14/./Programs/_testembed.c:559:(.text+0x4267): undefined reference to `__gcov_indirect_call'
  1211. /usr/bin/ld: /mnt/Linux Files/Invoke-manual/python311/src/Python-3.11.14/./Programs/_testembed.c:714:(.text+0x48ae): undefined reference to `__gcov_indirect_call_profiler_v4'
  1212. /usr/bin/ld: /mnt/Linux Files/Invoke-manual/python311/src/Python-3.11.14/./Programs/_testembed.c:714:(.text+0x48c3): undefined reference to `__gcov_time_profiler_counter'
  1213. /usr/bin/ld: Programs/_testembed.o: in function `test_init_global_config':
  1214. /mnt/Linux Files/Invoke-manual/python311/src/Python-3.11.14/./Programs/_testembed.c:510:(.text+0x495c): undefined reference to `__gcov_indirect_call'
  1215. generate-posix-vars failed
  1216. /usr/bin/ld: /mnt/Linux Files/Invoke-manual/python311/src/Python-3.11.14/./Programs/_testembed.c:555:(.text+0x4b16): undefined reference to `__gcov_indirect_call_profiler_v4'
  1217. /usr/bin/ld: /mnt/Linux Files/Invoke-manual/python311/src/Python-3.11.14/./Programs/_testembed.c:555:(.text+0x4b23): undefined reference to `__gcov_time_profiler_counter'
  1218. /usr/bin/ld: Programs/_testembed.o: in function `test_init_initialize_config':
  1219. /mnt/Linux Files/Invoke-manual/python311/src/Python-3.11.14/./Programs/_testembed.c:441:(.text+0x4b4c): undefined reference to `__gcov_indirect_call'
  1220. /usr/bin/ld: /mnt/Linux Files/Invoke-manual/python311/src/Python-3.11.14/./Programs/_testembed.c:446:(.text+0x4bbe): undefined reference to `__gcov_indirect_call_profiler_v4'
  1221. /usr/bin/ld: /mnt/Linux Files/Invoke-manual/python311/src/Python-3.11.14/./Programs/_testembed.c:446:(.text+0x4bcb): undefined reference to `__gcov_time_profiler_counter'
  1222. /usr/bin/ld: Programs/_testembed.o: in function `test_initialize_pymain':
  1223. /mnt/Linux Files/Invoke-manual/python311/src/Python-3.11.14/./Programs/_testembed.c:413:(.text+0x4c0f): undefined reference to `__gcov_indirect_call'
  1224. /usr/bin/ld: /mnt/Linux Files/Invoke-manual/python311/src/Python-3.11.14/./Programs/_testembed.c:427:(.text+0x4cce): undefined reference to `__gcov_indirect_call_profiler_v4'
  1225. /usr/bin/ld: /mnt/Linux Files/Invoke-manual/python311/src/Python-3.11.14/./Programs/_testembed.c:427:(.text+0x4ce3): undefined reference to `__gcov_time_profiler_counter'
  1226. /usr/bin/ld: Programs/_testembed.o: in function `test_initialize_twice':
  1227. /mnt/Linux Files/Invoke-manual/python311/src/Python-3.11.14/./Programs/_testembed.c:400:(.text+0x4d1c): undefined reference to `__gcov_indirect_call'
  1228. /usr/bin/ld: /mnt/Linux Files/Invoke-manual/python311/src/Python-3.11.14/./Programs/_testembed.c:410:(.text+0x4d7e): undefined reference to `__gcov_indirect_call_profiler_v4'
  1229. /usr/bin/ld: /mnt/Linux Files/Invoke-manual/python311/src/Python-3.11.14/./Programs/_testembed.c:410:(.text+0x4d8b): undefined reference to `__gcov_time_profiler_counter'
  1230. /usr/bin/ld: Programs/_testembed.o: in function `bpo20891_thread':
  1231. /mnt/Linux Files/Invoke-manual/python311/src/Python-3.11.14/./Programs/_testembed.c:351:(.text+0x4dc2): undefined reference to `__gcov_indirect_call'
  1232. /usr/bin/ld: /mnt/Linux Files/Invoke-manual/python311/src/Python-3.11.14/./Programs/_testembed.c:363:(.text+0x4e46): undefined reference to `__gcov_indirect_call_profiler_v4'
  1233. /usr/bin/ld: /mnt/Linux Files/Invoke-manual/python311/src/Python-3.11.14/./Programs/_testembed.c:363:(.text+0x4e53): undefined reference to `__gcov_time_profiler_counter'
  1234. /usr/bin/ld: /mnt/Linux Files/Invoke-manual/python311/src/Python-3.11.14/./Programs/_testembed.c:357:(.text+0x4ed6): undefined reference to `__gcov_time_profiler_counter'
  1235. /usr/bin/ld: Programs/_testembed.o: in function `test_pre_initialization_sys_options':
  1236. /mnt/Linux Files/Invoke-manual/python311/src/Python-3.11.14/./Programs/_testembed.c:299:(.text+0x4f03): undefined reference to `__gcov_indirect_call'
  1237. /usr/bin/ld: /mnt/Linux Files/Invoke-manual/python311/src/Python-3.11.14/./Programs/_testembed.c:346:(.text+0x51ee): undefined reference to `__gcov_indirect_call_profiler_v4'
  1238. /usr/bin/ld: /mnt/Linux Files/Invoke-manual/python311/src/Python-3.11.14/./Programs/_testembed.c:346:(.text+0x5203): undefined reference to `__gcov_time_profiler_counter'
  1239. /usr/bin/ld: Programs/_testembed.o: in function `test_pre_initialization_api':
  1240. /mnt/Linux Files/Invoke-manual/python311/src/Python-3.11.14/./Programs/_testembed.c:269:(.text+0x522f): undefined reference to `__gcov_indirect_call'
  1241. /usr/bin/ld: /mnt/Linux Files/Invoke-manual/python311/src/Python-3.11.14/./Programs/_testembed.c:294:(.text+0x5416): undefined reference to `__gcov_indirect_call_profiler_v4'
  1242. /usr/bin/ld: /mnt/Linux Files/Invoke-manual/python311/src/Python-3.11.14/./Programs/_testembed.c:294:(.text+0x5423): undefined reference to `__gcov_time_profiler_counter'
  1243. /usr/bin/ld: Programs/_testembed.o: in function `test_forced_io_encoding':
  1244. /mnt/Linux Files/Invoke-manual/python311/src/Python-3.11.14/./Programs/_testembed.c:237:(.text+0x548c): undefined reference to `__gcov_indirect_call'
  1245. /usr/bin/ld: Programs/_testembed.o: in function `printf':
  1246. /usr/include/bits/stdio2.h:118:(.text+0x55eb): undefined reference to `__gcov_time_profiler_counter'
  1247. /usr/bin/ld: /usr/include/bits/stdio2.h:118:(.text+0x5616): undefined reference to `__gcov_indirect_call_profiler_v4'
  1248. /usr/bin/ld: Programs/_testembed.o: in function `test_repeated_simple_init':
  1249. /mnt/Linux Files/Invoke-manual/python311/src/Python-3.11.14/./Programs/_testembed.c:192:(.text+0x5635): undefined reference to `__gcov_indirect_call'
  1250. /usr/bin/ld: /mnt/Linux Files/Invoke-manual/python311/src/Python-3.11.14/./Programs/_testembed.c:202:(.text+0x5716): undefined reference to `__gcov_indirect_call_profiler_v4'
  1251. /usr/bin/ld: /mnt/Linux Files/Invoke-manual/python311/src/Python-3.11.14/./Programs/_testembed.c:202:(.text+0x5723): undefined reference to `__gcov_time_profiler_counter'
  1252. /usr/bin/ld: Programs/_testembed.o: in function `test_repeated_init_exec':
  1253. /mnt/Linux Files/Invoke-manual/python311/src/Python-3.11.14/./Programs/_testembed.c:166:(.text+0x5759): undefined reference to `__gcov_indirect_call'
  1254. /usr/bin/ld: /mnt/Linux Files/Invoke-manual/python311/src/Python-3.11.14/./Programs/_testembed.c:185:(.text+0x5846): undefined reference to `__gcov_indirect_call_profiler_v4'
  1255. /usr/bin/ld: /mnt/Linux Files/Invoke-manual/python311/src/Python-3.11.14/./Programs/_testembed.c:185:(.text+0x5863): undefined reference to `__gcov_time_profiler_counter'
  1256. /usr/bin/ld: Programs/_testembed.o: in function `PyInit_embedded_ext':
  1257. /mnt/Linux Files/Invoke-manual/python311/src/Python-3.11.14/./Programs/_testembed.c:154:(.text+0x58dc): undefined reference to `__gcov_indirect_call'
  1258. /usr/bin/ld: /mnt/Linux Files/Invoke-manual/python311/src/Python-3.11.14/./Programs/_testembed.c:156:(.text+0x592e): undefined reference to `__gcov_indirect_call_profiler_v4'
  1259. /usr/bin/ld: /mnt/Linux Files/Invoke-manual/python311/src/Python-3.11.14/./Programs/_testembed.c:156:(.text+0x593b): undefined reference to `__gcov_time_profiler_counter'
  1260. /usr/bin/ld: Programs/_testembed.o: in function `test_repeated_init_and_subinterpreters':
  1261. /mnt/Linux Files/Invoke-manual/python311/src/Python-3.11.14/./Programs/_testembed.c:113:(.text+0x5979): undefined reference to `__gcov_indirect_call'
  1262. /usr/bin/ld: /mnt/Linux Files/Invoke-manual/python311/src/Python-3.11.14/./Programs/_testembed.c:142:(.text+0x5ace): undefined reference to `__gcov_indirect_call_profiler_v4'
  1263. /usr/bin/ld: /mnt/Linux Files/Invoke-manual/python311/src/Python-3.11.14/./Programs/_testembed.c:142:(.text+0x5ae3): undefined reference to `__gcov_time_profiler_counter'
  1264. /usr/bin/ld: Programs/_testembed.o: in function `run_audit_run_test':
  1265. /mnt/Linux Files/Invoke-manual/python311/src/Python-3.11.14/./Programs/_testembed.c:1384:(.text+0x5c33): undefined reference to `__gcov_time_profiler_counter'
  1266. /usr/bin/ld: Programs/_testembed.o: in function `test_audit_run_interactivehook':
  1267. /mnt/Linux Files/Invoke-manual/python311/src/Python-3.11.14/./Programs/_testembed.c:1387:(.text+0x5caf): undefined reference to `__gcov_indirect_call'
  1268. /usr/bin/ld: /mnt/Linux Files/Invoke-manual/python311/src/Python-3.11.14/./Programs/_testembed.c:1391:(.text+0x5d2e): undefined reference to `__gcov_indirect_call_profiler_v4'
  1269. /usr/bin/ld: /mnt/Linux Files/Invoke-manual/python311/src/Python-3.11.14/./Programs/_testembed.c:1391:(.text+0x5d3b): undefined reference to `__gcov_time_profiler_counter'
  1270. /usr/bin/ld: Programs/_testembed.o: in function `test_audit_run_startup':
  1271. /mnt/Linux Files/Invoke-manual/python311/src/Python-3.11.14/./Programs/_testembed.c:1394:(.text+0x5d7f): undefined reference to `__gcov_indirect_call'
  1272. /usr/bin/ld: /mnt/Linux Files/Invoke-manual/python311/src/Python-3.11.14/./Programs/_testembed.c:1398:(.text+0x5dfe): undefined reference to `__gcov_indirect_call_profiler_v4'
  1273. /usr/bin/ld: /mnt/Linux Files/Invoke-manual/python311/src/Python-3.11.14/./Programs/_testembed.c:1398:(.text+0x5e0b): undefined reference to `__gcov_time_profiler_counter'
  1274. /usr/bin/ld: Programs/_testembed.o: in function `test_audit_run_stdin':
  1275. /mnt/Linux Files/Invoke-manual/python311/src/Python-3.11.14/./Programs/_testembed.c:1401:(.text+0x5e4f): undefined reference to `__gcov_indirect_call'
  1276. /usr/bin/ld: /mnt/Linux Files/Invoke-manual/python311/src/Python-3.11.14/./Programs/_testembed.c:1405:(.text+0x5ece): undefined reference to `__gcov_indirect_call_profiler_v4'
  1277. /usr/bin/ld: /mnt/Linux Files/Invoke-manual/python311/src/Python-3.11.14/./Programs/_testembed.c:1405:(.text+0x5edb): undefined reference to `__gcov_time_profiler_counter'
  1278. /usr/bin/ld: Programs/_testembed.o: in function `test_audit':
  1279. /mnt/Linux Files/Invoke-manual/python311/src/Python-3.11.14/./Programs/_testembed.c:1276:(.text+0x5f20): undefined reference to `__gcov_indirect_call'
  1280. /usr/bin/ld: Programs/_testembed.o: in function `_test_audit':
  1281. /mnt/Linux Files/Invoke-manual/python311/src/Python-3.11.14/./Programs/_testembed.c:1258:(.text+0x60f6): undefined reference to `__gcov_indirect_call_profiler_v4'
  1282. /usr/bin/ld: /mnt/Linux Files/Invoke-manual/python311/src/Python-3.11.14/./Programs/_testembed.c:1258:(.text+0x6103): undefined reference to `__gcov_time_profiler_counter'
  1283. /usr/bin/ld: /mnt/Linux Files/Invoke-manual/python311/src/Python-3.11.14/./Programs/_testembed.c:1258:(.text+0x6123): undefined reference to `__gcov_time_profiler_counter'
  1284. /usr/bin/ld: Programs/_testembed.o: in function `check_init_python_config':
  1285. /mnt/Linux Files/Invoke-manual/python311/src/Python-3.11.14/./Programs/_testembed.c:1093:(.text+0x63e3): undefined reference to `__gcov_time_profiler_counter'
  1286. /usr/bin/ld: Programs/_testembed.o: in function `test_preinit_python_config':
  1287. /mnt/Linux Files/Invoke-manual/python311/src/Python-3.11.14/./Programs/_testembed.c:1097:(.text+0x644c): undefined reference to `__gcov_indirect_call'
  1288. /usr/bin/ld: /mnt/Linux Files/Invoke-manual/python311/src/Python-3.11.14/./Programs/_testembed.c:1099:(.text+0x649e): undefined reference to `__gcov_indirect_call_profiler_v4'
  1289. /usr/bin/ld: /mnt/Linux Files/Invoke-manual/python311/src/Python-3.11.14/./Programs/_testembed.c:1099:(.text+0x64ab): undefined reference to `__gcov_time_profiler_counter'
  1290. /usr/bin/ld: Programs/_testembed.o: in function `test_init_python_config':
  1291. /mnt/Linux Files/Invoke-manual/python311/src/Python-3.11.14/./Programs/_testembed.c:1103:(.text+0x64dc): undefined reference to `__gcov_indirect_call'
  1292. /usr/bin/ld: /mnt/Linux Files/Invoke-manual/python311/src/Python-3.11.14/./Programs/_testembed.c:1105:(.text+0x6526): undefined reference to `__gcov_indirect_call_profiler_v4'
  1293. /usr/bin/ld: /mnt/Linux Files/Invoke-manual/python311/src/Python-3.11.14/./Programs/_testembed.c:1105:(.text+0x6533): undefined reference to `__gcov_time_profiler_counter'
  1294. /usr/bin/ld: Programs/_testembed.o: in function `check_preinit_isolated_config':
  1295. /mnt/Linux Files/Invoke-manual/python311/src/Python-3.11.14/./Programs/_testembed.c:1028:(.text+0x67a3): undefined reference to `__gcov_time_profiler_counter'
  1296. /usr/bin/ld: Programs/_testembed.o: in function `test_preinit_isolated_config':
  1297. /mnt/Linux Files/Invoke-manual/python311/src/Python-3.11.14/./Programs/_testembed.c:1048:(.text+0x680c): undefined reference to `__gcov_indirect_call'
  1298. /usr/bin/ld: /mnt/Linux Files/Invoke-manual/python311/src/Python-3.11.14/./Programs/_testembed.c:1050:(.text+0x685e): undefined reference to `__gcov_indirect_call_profiler_v4'
  1299. /usr/bin/ld: /mnt/Linux Files/Invoke-manual/python311/src/Python-3.11.14/./Programs/_testembed.c:1050:(.text+0x686b): undefined reference to `__gcov_time_profiler_counter'
  1300. /usr/bin/ld: Programs/_testembed.o: in function `test_init_isolated_config':
  1301. /mnt/Linux Files/Invoke-manual/python311/src/Python-3.11.14/./Programs/_testembed.c:1054:(.text+0x689c): undefined reference to `__gcov_indirect_call'
  1302. /usr/bin/ld: /mnt/Linux Files/Invoke-manual/python311/src/Python-3.11.14/./Programs/_testembed.c:1056:(.text+0x68e6): undefined reference to `__gcov_indirect_call_profiler_v4'
  1303. /usr/bin/ld: /mnt/Linux Files/Invoke-manual/python311/src/Python-3.11.14/./Programs/_testembed.c:1056:(.text+0x68f3): undefined reference to `__gcov_time_profiler_counter'
  1304. /usr/bin/ld: Programs/_testembed.o: in function `check_init_parse_argv':
  1305. /mnt/Linux Files/Invoke-manual/python311/src/Python-3.11.14/./Programs/_testembed.c:739:(.text+0x6a33): undefined reference to `__gcov_time_profiler_counter'
  1306. /usr/bin/ld: Programs/_testembed.o: in function `test_init_parse_argv':
  1307. /mnt/Linux Files/Invoke-manual/python311/src/Python-3.11.14/./Programs/_testembed.c:743:(.text+0x6a6c): undefined reference to `__gcov_indirect_call'
  1308. /usr/bin/ld: /mnt/Linux Files/Invoke-manual/python311/src/Python-3.11.14/./Programs/_testembed.c:745:(.text+0x6abe): undefined reference to `__gcov_indirect_call_profiler_v4'
  1309. /usr/bin/ld: /mnt/Linux Files/Invoke-manual/python311/src/Python-3.11.14/./Programs/_testembed.c:745:(.text+0x6acb): undefined reference to `__gcov_time_profiler_counter'
  1310. /usr/bin/ld: Programs/_testembed.o: in function `test_init_dont_parse_argv':
  1311. /mnt/Linux Files/Invoke-manual/python311/src/Python-3.11.14/./Programs/_testembed.c:749:(.text+0x6afc): undefined reference to `__gcov_indirect_call'
  1312. /usr/bin/ld: /mnt/Linux Files/Invoke-manual/python311/src/Python-3.11.14/./Programs/_testembed.c:751:(.text+0x6b46): undefined reference to `__gcov_indirect_call_profiler_v4'
  1313. /usr/bin/ld: /mnt/Linux Files/Invoke-manual/python311/src/Python-3.11.14/./Programs/_testembed.c:751:(.text+0x6b53): undefined reference to `__gcov_time_profiler_counter'
  1314. /usr/bin/ld: Programs/_testembed.o: in function `check_init_compat_config':
  1315. /mnt/Linux Files/Invoke-manual/python311/src/Python-3.11.14/./Programs/_testembed.c:494:(.text+0x6c9b): undefined reference to `__gcov_time_profiler_counter'
  1316. /usr/bin/ld: Programs/_testembed.o: in function `test_preinit_compat_config':
  1317. /mnt/Linux Files/Invoke-manual/python311/src/Python-3.11.14/./Programs/_testembed.c:498:(.text+0x6d0c): undefined reference to `__gcov_indirect_call'
  1318. /usr/bin/ld: /mnt/Linux Files/Invoke-manual/python311/src/Python-3.11.14/./Programs/_testembed.c:500:(.text+0x6d5e): undefined reference to `__gcov_indirect_call_profiler_v4'
  1319. /usr/bin/ld: /mnt/Linux Files/Invoke-manual/python311/src/Python-3.11.14/./Programs/_testembed.c:500:(.text+0x6d6b): undefined reference to `__gcov_time_profiler_counter'
  1320. /usr/bin/ld: Programs/_testembed.o: in function `test_init_compat_config':
  1321. /mnt/Linux Files/Invoke-manual/python311/src/Python-3.11.14/./Programs/_testembed.c:504:(.text+0x6d9c): undefined reference to `__gcov_indirect_call'
  1322. /usr/bin/ld: /mnt/Linux Files/Invoke-manual/python311/src/Python-3.11.14/./Programs/_testembed.c:506:(.text+0x6de6): undefined reference to `__gcov_indirect_call_profiler_v4'
  1323. /usr/bin/ld: /mnt/Linux Files/Invoke-manual/python311/src/Python-3.11.14/./Programs/_testembed.c:506:(.text+0x6df3): undefined reference to `__gcov_time_profiler_counter'
  1324. /usr/bin/ld: Programs/_testembed.o: in function `test_init_run_main':
  1325. /mnt/Linux Files/Invoke-manual/python311/src/Python-3.11.14/./Programs/_testembed.c:1738:(.text+0x6e33): undefined reference to `__gcov_indirect_call'
  1326. /usr/bin/ld: /mnt/Linux Files/Invoke-manual/python311/src/Python-3.11.14/./Programs/_testembed.c:1746:(.text+0x6f5e): undefined reference to `__gcov_indirect_call_profiler_v4'
  1327. /usr/bin/ld: /mnt/Linux Files/Invoke-manual/python311/src/Python-3.11.14/./Programs/_testembed.c:1746:(.text+0x6f73): undefined reference to `__gcov_time_profiler_counter'
  1328. /usr/bin/ld: /mnt/Linux Files/Invoke-manual/python311/src/Python-3.11.14/./Programs/_testembed.c:1746:(.text+0x6f93): undefined reference to `__gcov_time_profiler_counter'
  1329. /usr/bin/ld: Programs/_testembed.o: in function `test_init_env_dev_mode':
  1330. /mnt/Linux Files/Invoke-manual/python311/src/Python-3.11.14/./Programs/_testembed.c:823:(.text+0x6fcc): undefined reference to `__gcov_indirect_call'
  1331. /usr/bin/ld: /mnt/Linux Files/Invoke-manual/python311/src/Python-3.11.14/./Programs/_testembed.c:831:(.text+0x70ae): undefined reference to `__gcov_indirect_call_profiler_v4'
  1332. /usr/bin/ld: /mnt/Linux Files/Invoke-manual/python311/src/Python-3.11.14/./Programs/_testembed.c:831:(.text+0x70c3): undefined reference to `__gcov_time_profiler_counter'
  1333. /usr/bin/ld: /mnt/Linux Files/Invoke-manual/python311/src/Python-3.11.14/./Programs/_testembed.c:831:(.text+0x70e3): undefined reference to `__gcov_time_profiler_counter'
  1334. /usr/bin/ld: Programs/_testembed.o: in function `test_get_incomplete_frame':
  1335. /mnt/Linux Files/Invoke-manual/python311/src/Python-3.11.14/./Programs/_testembed.c:2032:(.text+0x7120): undefined reference to `__gcov_indirect_call'
  1336. /usr/bin/ld: /mnt/Linux Files/Invoke-manual/python311/src/Python-3.11.14/./Programs/_testembed.c:2041:(.text+0x724e): undefined reference to `__gcov_indirect_call_profiler_v4'
  1337. /usr/bin/ld: /mnt/Linux Files/Invoke-manual/python311/src/Python-3.11.14/./Programs/_testembed.c:2041:(.text+0x7263): undefined reference to `__gcov_time_profiler_counter'
  1338. /usr/bin/ld: /mnt/Linux Files/Invoke-manual/python311/src/Python-3.11.14/./Programs/_testembed.c:2041:(.text+0x7283): undefined reference to `__gcov_time_profiler_counter'
  1339. /usr/bin/ld: Programs/_testembed.o: in function `test_bpo20891':
  1340. /mnt/Linux Files/Invoke-manual/python311/src/Python-3.11.14/./Programs/_testembed.c:366:(.text+0x72d0): undefined reference to `__gcov_indirect_call'
  1341. /usr/bin/ld: /mnt/Linux Files/Invoke-manual/python311/src/Python-3.11.14/./Programs/_testembed.c:397:(.text+0x73fe): undefined reference to `__gcov_indirect_call_profiler_v4'
  1342. /usr/bin/ld: /mnt/Linux Files/Invoke-manual/python311/src/Python-3.11.14/./Programs/_testembed.c:397:(.text+0x7413): undefined reference to `__gcov_time_profiler_counter'
  1343. /usr/bin/ld: /mnt/Linux Files/Invoke-manual/python311/src/Python-3.11.14/./Programs/_testembed.c:383:(.text+0x751b): undefined reference to `__gcov_time_profiler_counter'
  1344. /usr/bin/ld: /mnt/Linux Files/Invoke-manual/python311/src/Python-3.11.14/./Programs/_testembed.c:383:(.text+0xmake: *** [Makefile:857: pybuilddir.txt] Error 1
  1345. 753b): undefined reference to `__gcov_time_profiler_counter'
  1346. /usr/bin/ld: Programs/_testembed.omake: *** Waiting for unfinished jobs....
  1347. : in function `test_init_setpythonhome':
  1348. /mnt/Linux Files/Invoke-manual/python311/src/Python-3.11.14/./Programs/_testembed.c:1558:(.text+0x7570): undefined reference to `__gcov_indirect_call'
  1349. /usr/bin/ld: /mnt/Linux Files/Invoke-manual/python311/src/Python-3.11.14/./Programs/_testembed.c:1577:(.text+0x765e): undefined reference to `__gcov_indirect_call_profiler_v4'
  1350. /usr/bin/ld: /mnt/Linux Files/Invoke-manual/python311/src/Python-3.11.14/./Programs/_testembed.c:1577:(.text+0x7673): undefined reference to `__gcov_time_profiler_counter'
  1351. /usr/bin/ld: /mnt/Linux Files/Invoke-manual/python311/src/Python-3.11.14/./Programs/_testembed.c:1567:(.text+0x777b): undefined reference to `__gcov_time_profiler_counter'
  1352. /usr/bin/ld: /mnt/Linux Files/Invoke-manual/python311/src/Python-3.11.14/./Programs/_testembed.c:1567:(.text+0x779b): undefined reference to `__gcov_time_profiler_counter'
  1353. /usr/bin/ld: Programs/_testembed.o: in function `test_init_setpath':
  1354. /mnt/Linux Files/Invoke-manual/python311/src/Python-3.11.14/./Programs/_testembed.c:1496:(.text+0x77d0): undefined reference to `__gcov_indirect_call'
  1355. /usr/bin/ld: /mnt/Linux Files/Invoke-manual/python311/src/Python-3.11.14/./Programs/_testembed.c:1515:(.text+0x78be): undefined reference to `__gcov_indirect_call_profiler_v4'
  1356. /usr/bin/ld: /mnt/Linux Files/Invoke-manual/python311/src/Python-3.11.14/./Programs/_testembed.c:1515:(.text+0x78d3): undefined reference to `__gcov_time_profiler_counter'
  1357. /usr/bin/ld: /mnt/Linux Files/Invoke-manual/python311/src/Python-3.11.14/./Programs/_testembed.c:1505:(.text+0x79db): undefined reference to `__gcov_time_profiler_counter'
  1358. /usr/bin/ld: /mnt/Linux Files/Invoke-manual/python311/src/Python-3.11.14/./Programs/_testembed.c:1505:(.text+0x79fb): undefined reference to `__gcov_time_profiler_counter'
  1359. /usr/bin/ld: Programs/_testembed.o: in function `test_init_is_python_build':
  1360. /mnt/Linux Files/Invoke-manual/python311/src/Python-3.11.14/./Programs/_testembed.c:1581:(.text+0x7a45): undefined reference to `__gcov_indirect_call'
  1361. /usr/bin/ld: /mnt/Linux Files/Invoke-manual/python311/src/Python-3.11.14/./Programs/_testembed.c:1607:(.text+0x7c1e): undefined reference to `__gcov_indirect_call_profiler_v4'
  1362. /usr/bin/ld: /mnt/Linux Files/Invoke-manual/python311/src/Python-3.11.14/./Programs/_testembed.c:1607:(.text+0x7c33): undefined reference to `__gcov_time_profiler_counter'
  1363. /usr/bin/ld: /mnt/Linux Files/Invoke-manual/python311/src/Python-3.11.14/./Programs/_testembed.c:1592:(.text+0x7d2b): undefined reference to `__gcov_time_profiler_counter'
  1364. /usr/bin/ld: /mnt/Linux Files/Invoke-manual/python311/src/Python-3.11.14/./Programs/_testembed.c:1592:(.text+0x7d4b): undefined reference to `__gcov_time_profiler_counter'
  1365. /usr/bin/ld: Programs/_testembed.o: in function `test_init_setpath_config':
  1366. /mnt/Linux Files/Invoke-manual/python311/src/Python-3.11.14/./Programs/_testembed.c:1519:(.text+0x7d95): undefined reference to `__gcov_indirect_call'
  1367. /usr/bin/ld: /mnt/Linux Files/Invoke-manual/python311/src/Python-3.11.14/./Programs/_testembed.c:1554:(.text+0x7f5e): undefined reference to `__gcov_indirect_call_profiler_v4'
  1368. /usr/bin/ld: /mnt/Linux Files/Invoke-manual/python311/src/Python-3.11.14/./Programs/_testembed.c:1554:(.text+0x7f73): undefined reference to `__gcov_time_profiler_counter'
  1369. /usr/bin/ld: /mnt/Linux Files/Invoke-manual/python311/src/Python-3.11.14/./Programs/_testembed.c:1538:(.text+0x806b): undefined reference to `__gcov_time_profiler_counter'
  1370. /usr/bin/ld: /mnt/Linux Files/Invoke-manual/python311/src/Python-3.11.14/./Programs/_testembed.c:1538:(.text+0x808b): undefined reference to `__gcov_time_profiler_counter'
  1371. /usr/bin/ld: Programs/_testembed.o: in function `wcscpy':
  1372. /usr/include/bits/wchar2.h:79:(.text+0x828b): undefined reference to `__gcov_time_profiler_counter'
  1373. /usr/bin/ld: Programs/_testembed.o: in function `check_use_frozen_modules':
  1374. /mnt/Linux Files/Invoke-manual/python311/src/Python-3.11.14/./Programs/_testembed.c:1858:(.text+0x8312): undefined reference to `__gcov_time_profiler_counter'
  1375. /usr/bin/ld: Programs/_testembed.o: in function `test_init_use_frozen_modules':
  1376. /mnt/Linux Files/Invoke-manual/python311/src/Python-3.11.14/./Programs/_testembed.c:1882:(.text+0x833c): undefined reference to `__gcov_indirect_call'
  1377. /usr/bin/ld: /mnt/Linux Files/Invoke-manual/python311/src/Python-3.11.14/./Programs/_testembed.c:1885:(.text+0x839e): undefined reference to `__gcov_indirect_call_profiler_v4'
  1378. /usr/bin/ld: /mnt/Linux Files/Invoke-manual/python311/src/Python-3.11.14/./Programs/_testembed.c:1885:(.text+0x83ab): undefined reference to `__gcov_time_profiler_counter'
  1379. /usr/bin/ld: Programs/_testembed.o: in function `main':
  1380. /mnt/Linux Files/Invoke-manual/python311/src/Python-3.11.14/./Programs/_testembed.c:2133:(.text.startup+0x1a): undefined reference to `__gcov_indirect_call'
  1381. /usr/bin/ld: /mnt/Linux Files/Invoke-manual/python311/src/Python-3.11.14/./Programs/_testembed.c:2140:(.text.startup+0xa2): undefined reference to `__gcov_indirect_call'
  1382. /usr/bin/ld: /mnt/Linux Files/Invoke-manual/python311/src/Python-3.11.14/./Programs/_testembed.c:2154:(.text.startup+0x168): undefined reference to `__gcov_time_profiler_counter'
  1383. /usr/bin/ld: /mnt/Linux Files/Invoke-manual/python311/src/Python-3.11.14/./Programs/_testembed.c:2154:(.text.startup+0x190): undefined reference to `__gcov_indirect_call_profiler_v4'
  1384. /usr/bin/ld: Programs/_testembed.o: in function `_sub_I_00100_0':
  1385. /mnt/Linux Files/Invoke-manual/python311/src/Python-3.11.14/./Programs/_testembed.c:2155:(.text.startup+0x1ad): undefined reference to `__gcov_init'
  1386. /usr/bin/ld: Programs/_testembed.o: in function `_sub_D_00100_1':
  1387. /mnt/Linux Files/Invoke-manual/python311/src/Python-3.11.14/./Programs/_testembed.c:2155:(.text.exit+0x6): undefined reference to `__gcov_exit'
  1388. /usr/bin/ld: Programs/_testembed.o:(.data.rel+0x20): undefined reference to `__gcov_merge_add'
  1389. /usr/bin/ld: Programs/_testembed.o:(.data.rel+0x40): undefined reference to `__gcov_merge_topn'
  1390. /usr/bin/ld: Programs/_testembed.o:(.data.rel+0x58): undefined reference to `__gcov_merge_time_profile'
  1391. collect2: error: ld returned 1 exit status
  1392. make: *** [Makefile:1103: Programs/_testembed] Error 1
  1393. ==> ERROR: A failure occurred in build().
  1394. Aborting...
  1395.    /mnt/Linux Files/Invoke-manual/python311    master !1 ?2   4 ✘  25s 
  1396.  
Advertisement
Add Comment
Please, Sign In to add comment