Advertisement
Loontik

Untitled

Mar 19th, 2020
1,347
Never
Not a member of Pastebin yet? Sign Up, it unlocks many cool features!
  1. stderr[
  2.  
  3. FAILURE: Build failed with an exception.
  4.  
  5. * What went wrong:
  6. Execution failed for task ':checkReleaseDuplicateClasses'.
  7. > 1 exception was raised by workers:
  8.   java.lang.RuntimeException: Duplicate class com.android.installreferrer.BuildConfig found in modules classes.jar (:installreferrer-1.0:) and classes.jar (com.android.installreferrer:installreferrer:1.0)
  9.   Duplicate class com.android.installreferrer.api.InstallReferrerClient found in modules classes.jar (:installreferrer-1.0:) and classes.jar (com.android.installreferrer:installreferrer:1.0)
  10.   Duplicate class com.android.installreferrer.api.InstallReferrerClient$1 found in modules classes.jar (:installreferrer-1.0:) and classes.jar (com.android.installreferrer:installreferrer:1.0)
  11.   Duplicate class com.android.installreferrer.api.InstallReferrerClient$Builder found in modules classes.jar (:installreferrer-1.0:) and classes.jar (com.android.installreferrer:installreferrer:1.0)
  12.   Duplicate class com.android.installreferrer.api.InstallReferrerClient$InstallReferrerResponse found in modules classes.jar (:installreferrer-1.0:) and classes.jar (com.android.installreferrer:installreferrer:1.0)
  13.   Duplicate class com.android.installreferrer.api.InstallReferrerClientImpl found in modules classes.jar (:installreferrer-1.0:) and classes.jar (com.android.installreferrer:installreferrer:1.0)
  14.   Duplicate class com.android.installreferrer.api.InstallReferrerClientImpl$1 found in modules classes.jar (:installreferrer-1.0:) and classes.jar (com.android.installreferrer:installreferrer:1.0)
  15.   Duplicate class com.android.installreferrer.api.InstallReferrerClientImpl$ClientState found in modules classes.jar (:installreferrer-1.0:) and classes.jar (com.android.installreferrer:installreferrer:1.0)
  16.   Duplicate class com.android.installreferrer.api.InstallReferrerClientImpl$InstallReferrerServiceConnection found in modules classes.jar (:installreferrer-1.0:) and classes.jar (com.android.installreferrer:installreferrer:1.0)
  17.   Duplicate class com.android.installreferrer.api.InstallReferrerStateListener found in modules classes.jar (:installreferrer-1.0:) and classes.jar (com.android.installreferrer:installreferrer:1.0)
  18.   Duplicate class com.android.installreferrer.api.ReferrerDetails found in modules classes.jar (:installreferrer-1.0:) and classes.jar (com.android.installreferrer:installreferrer:1.0)
  19.   Duplicate class com.android.installreferrer.commons.InstallReferrerCommons found in modules classes.jar (:installreferrer-1.0:) and classes.jar (com.android.installreferrer:installreferrer:1.0)
  20.   Duplicate class com.google.android.finsky.externalreferrer.IGetInstallReferrerService found in modules classes.jar (:installreferrer-1.0:) and classes.jar (com.android.installreferrer:installreferrer:1.0)
  21.   Duplicate class com.google.android.finsky.externalreferrer.IGetInstallReferrerService$Stub found in modules classes.jar (:installreferrer-1.0:) and classes.jar (com.android.installreferrer:installreferrer:1.0)
  22.   Duplicate class com.google.android.finsky.externalreferrer.IGetInstallReferrerService$Stub$Proxy found in modules classes.jar (:installreferrer-1.0:) and classes.jar (com.android.installreferrer:installreferrer:1.0)
  23.  
  24.   Go to the documentation to learn how to <a href="d.android.com/r/tools/classpath-sync-errors">Fix dependency resolution errors</a>.
  25.  
  26.  
  27. * Try:
  28. Run with --stacktrace option to get the stack trace. Run with --info or --debug option to get more log output. Run with --scan to get full insights.
  29.  
  30. * Get more help at https://help.gradle.org
  31.  
  32. BUILD FAILED in 7s
  33. ]
  34. stdout[
  35.  
  36. > Configure project :
  37. WARNING: The option setting 'android.bundle.enableUncompressedNativeLibs=false' is experimental and unsupported.
  38. The current default is 'true'.
  39.  
  40.  
  41. > Configure project :Firebase
  42. WARNING: The option setting 'android.bundle.enableUncompressedNativeLibs=false' is experimental and unsupported.
  43. The current default is 'true'.
  44.  
  45.  
  46. > Configure project :IronSource
  47. WARNING: The option setting 'android.bundle.enableUncompressedNativeLibs=false' is experimental and unsupported.
  48. The current default is 'true'.
  49.  
  50.  
  51. > Task :preBuild UP-TO-DATE
  52. > Task :Firebase:preBuild UP-TO-DATE
  53. > Task :Firebase:preReleaseBuild UP-TO-DATE
  54. > Task :Firebase:checkReleaseManifest
  55. > Task :Firebase:processReleaseManifest
  56. > Task :IronSource:preBuild UP-TO-DATE
  57. > Task :IronSource:preReleaseBuild UP-TO-DATE
  58. > Task :IronSource:checkReleaseManifest
  59. > Task :IronSource:processReleaseManifest
  60. > Task :preReleaseBuild
  61. > Task :Firebase:packageReleaseRenderscript NO-SOURCE
  62. > Task :IronSource:packageReleaseRenderscript NO-SOURCE
  63. > Task :compileReleaseRenderscript NO-SOURCE
  64. > Task :generateReleaseResValues
  65. > Task :generateReleaseResources
  66. > Task :Firebase:compileReleaseRenderscript NO-SOURCE
  67. > Task :Firebase:generateReleaseResValues
  68. > Task :Firebase:generateReleaseResources
  69. > Task :Firebase:packageReleaseResources
  70. > Task :IronSource:compileReleaseRenderscript NO-SOURCE
  71. > Task :IronSource:generateReleaseResValues
  72. > Task :IronSource:generateReleaseResources
  73. > Task :IronSource:packageReleaseResources
  74. > Task :mergeReleaseResources
  75. > Task :checkReleaseManifest
  76. > Task :createReleaseCompatibleScreenManifests
  77. > Task :mainApkListPersistenceRelease
  78. > Task :processReleaseManifest
  79. > Task :bundleReleaseResources
  80. > Task :mergeReleaseShaders
  81. > Task :compileReleaseShaders
  82. > Task :generateReleaseAssets
  83. > Task :Firebase:mergeReleaseShaders
  84. > Task :Firebase:compileReleaseShaders
  85. > Task :Firebase:generateReleaseAssets
  86. > Task :Firebase:packageReleaseAssets
  87. > Task :IronSource:mergeReleaseShaders
  88. > Task :IronSource:compileReleaseShaders
  89. > Task :IronSource:generateReleaseAssets
  90. > Task :IronSource:packageReleaseAssets
  91. > Task :mergeReleaseAssets
  92. > Task :checkReleaseDuplicateClasses FAILED
  93. 26 actionable tasks: 26 executed
  94. ]
  95. exit code: 1
  96.   at UnityEditor.Android.Command.WaitForProgramToRun (UnityEditor.Utils.Program p, UnityEditor.Android.Command+WaitingForProcessToExit waitingForProcessToExit, System.String errorMsg) [0x00031] in <13e769c2760a442eaf6dff80696716f1>:0
  97.   at UnityEditor.Android.Command.Run (System.Diagnostics.ProcessStartInfo psi, UnityEditor.Android.Command+WaitingForProcessToExit waitingForProcessToExit, System.String errorMsg) [0x00015] in <13e769c2760a442eaf6dff80696716f1>:0
  98.   at UnityEditor.Android.Command.Run (System.String command, System.String args, System.String workingdir, UnityEditor.Android.Command+WaitingForProcessToExit waitingForProcessToExit, System.String errorMsg) [0x0000a] in <13e769c2760a442eaf6dff80696716f1>:0
  99.   at UnityEditor.Android.AndroidJavaTools.RunJava (System.String args, System.String workingdir, System.Action`1[T] progress, System.String error) [0x0001f] in <13e769c2760a442eaf6dff80696716f1>:0
  100.   at UnityEditor.Android.GradleWrapper.Run (UnityEditor.Android.AndroidJavaTools javaTools, System.String workingdir, System.String task, System.Action`1[T] progress) [0x00029] in <13e769c2760a442eaf6dff80696716f1>:0
  101. Rethrow as GradleInvokationException: Gradle build failed
  102.   at UnityEditor.Android.GradleWrapper.Run (UnityEditor.Android.AndroidJavaTools javaTools, System.String workingdir, System.String task, System.Action`1[T] progress) [0x0004d] in <13e769c2760a442eaf6dff80696716f1>:0
  103.   at UnityEditor.Android.PostProcessor.Tasks.BuildGradleProject.Execute (UnityEditor.Android.PostProcessor.PostProcessorContext context) [0x000a8] in <13e769c2760a442eaf6dff80696716f1>:0
  104.   at UnityEditor.Android.PostProcessor.PostProcessRunner.RunAllTasks (UnityEditor.Android.PostProcessor.PostProcessorContext context) [0x00074] in <13e769c2760a442eaf6dff80696716f1>:0
  105. Rethrow as BuildFailedException: Exception of type 'UnityEditor.Build.BuildFailedException' was thrown.
  106.   at UnityEditor.Android.PostProcessor.CancelPostProcess.AbortBuild (System.String title, System.String message, System.Exception ex) [0x0001e] in <13e769c2760a442eaf6dff80696716f1>:0
  107.   at UnityEditor.Android.PostProcessor.PostProcessRunner.RunAllTasks (UnityEditor.Android.PostProcessor.PostProcessorContext context) [0x00110] in <13e769c2760a442eaf6dff80696716f1>:0
  108.   at UnityEditor.Android.PostProcessAndroidPlayer.PostProcess (UnityEditor.BuildTarget target, System.String stagingAreaData, System.String stagingArea, System.String playerPackage, System.String installPath, System.String companyName, System.String productName, UnityEditor.BuildOptions options, UnityEditor.RuntimeClassRegistry usedClassRegistry, UnityEditor.Build.Reporting.BuildReport report) [0x002c8] in <13e769c2760a442eaf6dff80696716f1>:0
  109.   at UnityEditor.Android.AndroidBuildPostprocessor.PostProcess (UnityEditor.Modules.BuildPostProcessArgs args, UnityEditor.BuildProperties& outProperties) [0x00001] in <13e769c2760a442eaf6dff80696716f1>:0
  110.   at UnityEditor.PostprocessBuildPlayer.Postprocess (UnityEditor.BuildTargetGroup targetGroup, UnityEditor.BuildTarget target, System.String installPath, System.String companyName, System.String productName, System.Int32 width, System.Int32 height, UnityEditor.BuildOptions options, UnityEditor.RuntimeClassRegistry usedClassRegistry, UnityEditor.Build.Reporting.BuildReport report) [0x000da] in /Users/builduser/buildslave/unity/build/Editor/Mono/BuildPipeline/PostprocessBuildPlayer.cs:281
  111. UnityEditor.BuildPipeline:BuildPlayerInternalNoCheck(String[], String, String, BuildTargetGroup, BuildTarget, BuildOptions, Boolean)
  112. UnityEditor.BuildPipeline:BuildPlayerInternal(String[], String, String, BuildTargetGroup, BuildTarget, BuildOptions) (at /Users/builduser/buildslave/unity/build/Editor/Mono/BuildPipeline.bindings.cs:368)
  113. UnityEditor.BuildPipeline:BuildPlayer(String[], String, String, BuildTargetGroup, BuildTarget, BuildOptions) (at /Users/builduser/buildslave/unity/build/Editor/Mono/BuildPipeline.bindings.cs:267)
  114. UnityEditor.BuildPipeline:BuildPlayer(BuildPlayerOptions) (at /Users/builduser/buildslave/unity/build/Editor/Mono/BuildPipeline.bindings.cs:250)
  115. Building.ProjectBuilder:BuildAndroid() (at Assets/Editor/Building/ProjectBuilder.cs:83)
  116.  
  117. (Filename: <13e769c2760a442eaf6dff80696716f1> Line: 0)
  118.  
  119. Unloading 153 Unused Serialized files (Serialized files now loaded: 0)
  120. System memory in use before: 1.52 GB.
  121. System memory in use after: 1.53 GB.
  122.  
  123. Unloading 171 unused Assets to reduce memory usage. Loaded Objects now: 113063.
  124. Total: 504.319183 ms (FindLiveObjects: 12.633134 ms CreateObjectMapping: 10.688278 ms MarkObjects: 479.168678 ms  DeleteObjects: 1.828515 ms)
  125.  
  126. Unloading 0 Unused Serialized files (Serialized files now loaded: 0)
  127. Loaded scene 'Temp/__Backupscenes/0.backup'
  128.     Deserialize:            6.011 ms
  129.     Integration:            131.655 ms
  130.     Integration of assets:  0.005 ms
  131.     Thread Wait Time:       18.024 ms
  132.     Total Operation Time:   155.695 ms
  133. System memory in use before: 1.52 GB.
  134. System memory in use after: 1.53 GB.
  135.  
  136. Unloading 0 unused Assets to reduce memory usage. Loaded Objects now: 113057.
  137. Total: 383.451360 ms (FindLiveObjects: 9.722768 ms CreateObjectMapping: 8.895265 ms MarkObjects: 364.710868 ms  DeleteObjects: 0.121285 ms)
  138.  
  139. Build failed
  140. UnityEngine.DebugLogHandler:Internal_Log(LogType, LogOption, String, Object)
  141. UnityEngine.DebugLogHandler:LogFormat(LogType, Object, String, Object[])
  142. UnityEngine.Logger:Log(LogType, Object)
  143. UnityEngine.Debug:LogError(Object)
  144. Building.ProjectBuilder:BuildAndroid() (at Assets/Editor/Building/ProjectBuilder.cs:88)
  145.  
  146. (Filename: Assets/Editor/Building/ProjectBuilder.cs Line: 88)
  147.  
  148. Batchmode quit successfully invoked - shutting down!
  149. [Performance] Application.InitializeProject                                         :        1 samples, Peak.   413 s (1.0x), Avg.   413 s, Total. 412.8 s (58.7%)
  150. [Performance] Application.PackageManager.StartServer                                :        1 samples, Peak.  3.70 ms (1.0x), Avg.  3.70 ms, Total. 3.701 ms (0.0%)
  151. [Performance] Application.AcquireProjectLock                                        :        1 samples, Peak.   166 ms (1.0x), Avg.   166 ms, Total. 166.5 ms (0.0%)
  152. [Performance] Application.InitializeEngineNoGraphics                                :        1 samples, Peak.  70.6 ms (1.0x), Avg.  70.6 ms, Total. 70.64 ms (0.0%)
  153. [Performance] Application.PackageManager.Initialize                                 :        1 samples, Peak.   591 ms (1.0x), Avg.   591 ms, Total. 591.1 ms (0.1%)
  154. [Performance] CurlRequestCheck                                                      :        7 samples, Peak.  76.3 us (2.7x), Avg.  27.8 us, Total. 194.4 us (0.0%)
  155. [Performance] PackageManager::RunRequestSynchronously                               :       15 samples, Peak.  2.86 ms (14.0x), Avg.   204 us, Total. 3.055 ms (0.0%)
  156. [Performance] Application.EngineGraphics.Initialize                                 :        1 samples, Peak.  52.4 ms (1.0x), Avg.  52.4 ms, Total. 52.36 ms (0.0%)
  157. [Performance] Application.GI.Initialize                                             :        1 samples, Peak.   313 ms (1.0x), Avg.   313 ms, Total. 313.0 ms (0.0%)
  158. [Performance] Application.LoadAllDefaultResourcesFromEditor                         :        1 samples, Peak.  1.87 ms (1.0x), Avg.  1.87 ms, Total. 1.867 ms (0.0%)
  159. [Performance] Application.LoadMonoAssembliesAndRecompileIfNecessary                 :        1 samples, Peak.  5.40 s (1.0x), Avg.  5.40 s, Total. 5.396 s (0.8%)
  160. [Performance] Application.ReadLicenseInfo                                           :        1 samples, Peak.  1.27 ms (1.0x), Avg.  1.27 ms, Total. 1.269 ms (0.0%)
  161. [Performance] Application.AssetDatabase.Refresh                                     :        1 samples, Peak.   366 s (1.0x), Avg.   366 s, Total. 366.3 s (52.1%)
  162. [Performance] SceneVisibilityState::GameObjectChangedScene_Impl                     :     5862 samples, Peak.   477 ns (10.1x), Avg.  47.3 ns, Total. 277.4 us (0.0%)
  163. [Performance] SceneVisibilityState::TransformHierarchyChangedSetParentCallbac       :     2955 samples, Peak.  12.9 us (28.2x), Avg.   455 ns, Total. 1.345 ms (0.0%)
  164. [Performance] SceneVisibilityState.IsHiddenByHierarchyRecursive                     :     6694 samples, Peak.  11.7 us (51.2x), Avg.   229 ns, Total. 1.530 ms (0.0%)
  165. [Performance] Application.OnUsbDevicesChanged                                       :        1 samples, Peak.   458 us (1.0x), Avg.   458 us, Total. 457.5 us (0.0%)
  166. [Performance] Application.AssetDatabase.SaveAssets                                  :        1 samples, Peak.  9.43 ms (1.0x), Avg.  9.43 ms, Total. 9.425 ms (0.0%)
  167. [Performance] Application.AssetInstanceCacheUpdate                                  :        1 samples, Peak.  2.65 ms (1.0x), Avg.  2.65 ms, Total. 2.654 ms (0.0%)
  168. [Performance] Application.UnityExtensions.Initialize                                :        1 samples, Peak.  1.69 ms (1.0x), Avg.  1.69 ms, Total. 1.688 ms (0.0%)
  169. [Performance] Application.InitializeManagedCompilationPipeline                      :        1 samples, Peak.  35.3 ms (1.0x), Avg.  35.3 ms, Total. 35.27 ms (0.0%)
  170. [Performance] Application.ExecuteStartups                                           :        1 samples, Peak.   232 ms (1.0x), Avg.   232 ms, Total. 231.7 ms (0.0%)
  171. [Performance] Application.editorInitializingProject                                 :        1 samples, Peak.  61.0 us (1.0x), Avg.  61.0 us, Total. 61.03 us (0.0%)
  172. [Performance] Application.WriteEditorInstanceJsonFile                               :        1 samples, Peak.   265 us (1.0x), Avg.   265 us, Total. 264.8 us (0.0%)
  173. [Performance] Application.CheckForAvailableDiskSpaceInProjectLocationAndEmitW       :        1 samples, Peak.   828 us (1.0x), Avg.   828 us, Total. 827.7 us (0.0%)
  174. [Performance] GUIView.RepaintAll.PlayerLoopController                               :        4 samples, Peak.   350 ns (1.2x), Avg.   284 ns, Total. 1.136 us (0.0%)
  175. [Performance] SceneVisibilityState.ClearScene                                       :        3 samples, Peak.   354 ns (1.4x), Avg.   261 ns, Total. 782.0 ns (0.0%)
  176. [Performance] Application.InvokeFinishedLoadingProject                              :        1 samples, Peak.  2.80 ms (1.0x), Avg.  2.80 ms, Total. 2.797 ms (0.0%)
  177. Refresh: detecting if any assets need to be imported or removed ...
  178. Refreshing native plugins compatible for Editor in 68.61 ms, found 2 plugins.
  179. Preloading 0 native plugins for Editor in 0.00 ms.
  180. Refreshing native plugins compatible for Editor in 2.15 ms, found 2 plugins.
  181. Preloading 0 native plugins for Editor in 0.00 ms.
  182.  
  183. Refresh Completed time: 0.693052s
  184.     Asset Scan time: 0.111579s
  185.     Asset Hashing: 0.000000s [0 B, 0.000000 mb/s]
  186.     Asset Import (Scripting) time: 0.000000s (count: 0)
  187.     Post Processs Assets (Scripting) time: 0.000000s
  188.     Asset Rehashing: 0.000000s [0 B, 0.000000 mb/s]
  189.     Asset Import (Non Scripting) time: 0.000000s (count: 0)
  190.     Post Process Assets (Non Scripting) time: 0.000000s
  191.     Dependent Assets to Import Queue time: 0.000000s
  192.  
  193. Refresh: detecting if any assets need to be imported or removed ...
  194. Refreshing native plugins compatible for Editor in 2.22 ms, found 2 plugins.
  195. Preloading 0 native plugins for Editor in 0.00 ms.
  196. Refreshing native plugins compatible for Editor in 2.14 ms, found 2 plugins.
  197. Preloading 0 native plugins for Editor in 0.00 ms.
  198.  
  199. Refresh Completed time: 0.603528s
  200.     Asset Scan time: 0.107413s
  201.     Asset Hashing: 0.000000s [0 B, 0.000000 mb/s]
  202.     Asset Import (Scripting) time: 0.000000s (count: 0)
  203.     Post Processs Assets (Scripting) time: 0.000000s
  204.     Asset Rehashing: 0.000000s [0 B, 0.000000 mb/s]
  205.     Asset Import (Non Scripting) time: 0.000000s (count: 0)
  206.     Post Process Assets (Non Scripting) time: 0.000000s
  207.     Dependent Assets to Import Queue time: 0.000000s
  208.  
  209. [Package Manager] Server::Kill -- Server was shutdown
  210. Cleanup mono
  211. debugger-agent: Unable to listen on 20
  212. [usbmuxd] Stop listen thread
  213. [usbmuxd] Error:
  214. [usbmuxd] Listen thread exiting
  215. Exiting batchmode successfully now!
  216. NOT FOUND RESULT FILE
  217. Build step 'Execute shell' marked build as failure
  218. Finished: FAILURE
Advertisement
RAW Paste Data Copied
Advertisement