Not a member of Pastebin yet?
Sign Up,
it unlocks many cool features!
- Executing Gradle task: eclipse
- Build info: MCreator 2022.1.20510, forge-1.18.2, 64-bit, 40909 MB, Windows 10, JVM 17.0.1, JAVA_HOME: C:\Program Files\Pylo\MCreator\jdk, started on: 2022-05-18-07:13:10
- > Configure project :
- The code of this workspace uses official obfuscation mappings provided by Mojang. These mappings fall under their associated license you should be fully aware of.
- (c) 2020 Microsoft Corporation. These mappings are provided "as-is" and you bear the risk of using them. You may copy and use the mappings for development purposes,
- but you may not redistribute the mappings complete and unmodified. Microsoft makes no warranties, express or implied, with respect to the mappings provided here.
- Use and modification of this document or the source code (in any form) of Minecraft: Java Edition is governed by the Minecraft End User License Agreement available
- at https://account.mojang.com/documents/minecraft_eula.
- > Task :downloadMcpConfig
- > Task :extractSrg UP-TO-DATE
- > Task :createSrgToMcp UP-TO-DATE
- > Task :downloadMCMeta UP-TO-DATE
- Copying local object: 8a/8a1c9994a6f35371b8e776b262f363692f222513 Asset: minecraft/sounds/item/armor/equip_diamond5.ogg
- Copying local object: 8b/8b84ab7d590fbffbdb6daae5864628e4a3faa4c6 Asset: minecraft/sounds/mob/fox/idle2.ogg
- minecraft/sounds/mob/fox/idle2.ogg Failed.
- java.nio.file.FileSystemException: C:\Users\sigme\AppData\Roaming\.minecraft\assets\objects\8b\8b84ab7d590fbffbdb6daae5864628e4a3faa4c6 -> C:\Users\sigme\.mcreator\gradle\caches\forge_gradle\assets\objects\8b\8b84ab7d590fbffbdb6daae5864628e4a3faa4c6: Data error (cyclic redundancy check)
- at java.base/sun.nio.fs.WindowsException.translateToIOException(WindowsException.java:92 at java.base/sun.nio.fs.WindowsException.translateToIOException(WindowsException.java:92)
- at java.base/sun.nio.fs.WindowsException.rethrowAsIOException(WindowsException.java:103 at java.base/sun.nio.fs.WindowsException.rethrowAsIOException(WindowsException.java:103)
- at java.base/sun.nio.fs.WindowsFileCopy.copy(WindowsFileCopy.java:209 at java.base/sun.nio.fs.WindowsFileCopy.copy(WindowsFileCopy.java:209)
- at java.base/sun.nio.fs.WindowsFileSystemProvider.copy(WindowsFileSystemProvider.java:284 at java.base/sun.nio.fs.WindowsFileSystemProvider.copy(WindowsFileSystemProvider.java:284)
- at java.base/java.nio.file.Files.copy(Files.java:1305 at java.base/java.nio.file.Files.copy(Files.java:1305)
- at org.apache.commons.io.FileUtils.doCopyFile(FileUtils.java:1392 at org.apache.commons.io.FileUtils.doCopyFile(FileUtils.java:1392)
- at org.apache.commons.io.FileUtils.copyFile(FileUtils.java:885 at org.apache.commons.io.FileUtils.copyFile(FileUtils.java:885)
- at org.apache.commons.io.FileUtils.copyFile(FileUtils.java:835 at org.apache.commons.io.FileUtils.copyFile(FileUtils.java:835)
- at org.apache.commons.io.FileUtils.copyFile(FileUtils.java:802 at org.apache.commons.io.FileUtils.copyFile(FileUtils.java:802)
- at net.minecraftforge.gradle.common.tasks.DownloadAssets.lambda$run$0(DownloadAssets.java:77 at net.minecraftforge.gradle.common.tasks.DownloadAssets.lambda$run$0(DownloadAssets.java:77)
- at java.base/java.util.concurrent.ThreadPoolExecutor.runWorker(ThreadPoolExecutor.java:1136 at java.base/java.util.concurrent.ThreadPoolExecutor.runWorker(ThreadPoolExecutor.java:1136)
- at java.base/java.util.concurrent.ThreadPoolExecutor$Worker.run(ThreadPoolExecutor.java:635 at java.base/java.util.concurrent.ThreadPoolExecutor$Worker.run(ThreadPoolExecutor.java:635)
- at java.base/java.lang.Thread.run(Thread.java:833 at java.base/java.lang.Thread.run(Thread.java:833)
- minecraft/sounds/item/armor/equip_diamond5.ogg Failed.
- java.nio.file.FileSystemException: C:\Users\sigme\AppData\Roaming\.minecraft\assets\objects\8a\8a1c9994a6f35371b8e776b262f363692f222513 -> C:\Users\sigme\.mcreator\gradle\caches\forge_gradle\assets\objects\8a\8a1c9994a6f35371b8e776b262f363692f222513: Data error (cyclic redundancy check)
- at java.base/sun.nio.fs.WindowsException.translateToIOException(WindowsException.java:92 at java.base/sun.nio.fs.WindowsException.translateToIOException(WindowsException.java:92)
- at java.base/sun.nio.fs.WindowsException.rethrowAsIOException(WindowsException.java:103 at java.base/sun.nio.fs.WindowsException.rethrowAsIOException(WindowsException.java:103)
- at java.base/sun.nio.fs.WindowsFileCopy.copy(WindowsFileCopy.java:209 at java.base/sun.nio.fs.WindowsFileCopy.copy(WindowsFileCopy.java:209)
- at java.base/sun.nio.fs.WindowsFileSystemProvider.copy(WindowsFileSystemProvider.java:284 at java.base/sun.nio.fs.WindowsFileSystemProvider.copy(WindowsFileSystemProvider.java:284)
- at java.base/java.nio.file.Files.copy(Files.java:1305 at java.base/java.nio.file.Files.copy(Files.java:1305)
- at org.apache.commons.io.FileUtils.doCopyFile(FileUtils.java:1392 at org.apache.commons.io.FileUtils.doCopyFile(FileUtils.java:1392)
- at org.apache.commons.io.FileUtils.copyFile(FileUtils.java:885 at org.apache.commons.io.FileUtils.copyFile(FileUtils.java:885)
- at org.apache.commons.io.FileUtils.copyFile(FileUtils.java:835 at org.apache.commons.io.FileUtils.copyFile(FileUtils.java:835)
- at org.apache.commons.io.FileUtils.copyFile(FileUtils.java:802 at org.apache.commons.io.FileUtils.copyFile(FileUtils.java:802)
- at net.minecraftforge.gradle.common.tasks.DownloadAssets.lambda$run$0(DownloadAssets.java:77 at net.minecraftforge.gradle.common.tasks.DownloadAssets.lambda$run$0(DownloadAssets.java:77)
- at java.base/java.util.concurrent.ThreadPoolExecutor.runWorker(ThreadPoolExecutor.java:1136 at java.base/java.util.concurrent.ThreadPoolExecutor.runWorker(ThreadPoolExecutor.java:1136)
- at java.base/java.util.concurrent.ThreadPoolExecutor$Worker.run(ThreadPoolExecutor.java:635 at java.base/java.util.concurrent.ThreadPoolExecutor$Worker.run(ThreadPoolExecutor.java:635)
- at java.base/java.lang.Thread.run(Thread.java:833 at java.base/java.lang.Thread.run(Thread.java:833)
- > Task :downloadAssets FAILED
- FAILURE: Build failed with an exception.
- * What went wrong:
- Execution failed for task ':downloadAssets'.
- > Failed to get asset: minecraft/sounds/mob/fox/idle2.ogg
- Failed to get asset: minecraft/sounds/item/armor/equip_diamond5.ogg
- Some assets failed to download or validate, try running the task again.
- * Try:
- > Run with --stacktrace option to get the stack trace.
- > Run with --info or --debug option to get more log output.
- > Run with --scan to get full insights.
- * Get more help at https://help.gradle.org
- BUILD FAILED in 2s
- 5 actionable tasks: 2 executed, 3 up-to-date
- BUILD FAILED
- Task completed in 2 seconds
Advertisement
Add Comment
Please, Sign In to add comment