Guest User

Untitled

a guest
Jul 16th, 2022
78
0
Never
Not a member of Pastebin yet? Sign Up, it unlocks many cool features!
text 52.38 KB | None | 0 0
  1. Error: Failed to configure doxygen: consult
  2. /opt/local/var/macports/build/_opt_local_var_macports_sources_rsync.macports.org_macports_release_tarballs_ports_textproc_doxygen/doxygen/work/doxygen-1.9.3/CMakeFiles/CMakeError.log
  3. Error: Failed to configure doxygen: configure failure: command
  4. execution failed
  5. Error: See
  6. /opt/local/var/macports/logs/_opt_local_var_macports_sources_rsync.macports.org_macports_release_tarballs_ports_textproc_doxygen/doxygen/main.log for details.
  7. Error: Follow https://guide.macports.org/#project.tickets if
  8. you believe there
  9. is a bug.
  10.  
  11.  
  12.  
  13.  
  14. Compiling the C compiler identification source file "CMakeCCompilerId.c" failed.
  15. Compiler: /opt/local/bin/clang-mp-13
  16. Build flags: -pipe;-Os;-DNDEBUG;-isystem/opt/local/include/LegacySupport;-I/opt/local/include
  17. Id flags:
  18.  
  19. The output was:
  20. 69
  21. 2022-07-16 03:36:48.027 xcodebuild[14745:1207] [MT] DVTAssertions: ASSERTION FAILURE in /SourceCache/DVTFoundation/DVTFoundation-1828/Framework/Classes/FilePaths/DVTFilePath.m:379
  22. Details: fsrep is absolute (starts with /) ('/opt/local/libexec/llvm-13/bin/clang') parentPath must be nil but it is not ('<DVTFilePath:0x400129ac0:'/Applications/Xcode.app/Contents/Developer/Toolchains/XcodeDefault.xctoolchain/usr/bin'>')
  23. Object: <DVTFilePath>
  24. Method: +_filePathForParent:fileSystemRepresentation:length:allowCreation:
  25. Thread: <NSThread: 0x40030a1e0>{name = (null), num = 1}
  26. Hints: None
  27. Backtrace:
  28. 0 0x0000000107afb44c -[DVTAssertionHandler handleFailureInMethod:object:fileName:lineNumber:messageFormat:arguments:] (in DVTFoundation)
  29. 1 0x0000000107afb2a5 _DVTAssertionFailureHandler (in DVTFoundation)
  30. 2 0x0000000107a7e694 +[DVTFilePath _filePathForParent:fileSystemRepresentation:length:allowCreation:] (in DVTFoundation)
  31. 3 0x0000000107a7e372 +[DVTFilePath _filePathForParent:pathString:] (in DVTFoundation)
  32. 4 0x0000000107ab216b -[DVTSearchPath pathForFileWithRelativePathString:] (in DVTFoundation)
  33. 5 0x00000001082dea5b -[Xcode3CommandLineBuildTool _printPathToExecutableAndExit] (in Xcode3Core)
  34. 6 0x00000001082e0bd4 -[Xcode3CommandLineBuildTool run] (in Xcode3Core)
  35. 7 0x0000000107a70b46 (in xcodebuild)
  36. 8 0x0000000107a7091c (in xcodebuild)
  37. 9 0x0000000000000005
  38. xcrun: error: /Applications/Xcode.app/Contents/Developer/usr/bin/xcodebuild failed with exit code 6
  39.  
  40.  
  41. Compiling the C compiler identification source file "CMakeCCompilerId.c" failed.
  42. Compiler: /opt/local/bin/clang-mp-13
  43. Build flags: -pipe;-Os;-DNDEBUG;-isystem/opt/local/include/LegacySupport;-I/opt/local/include
  44. Id flags: -c
  45.  
  46. The output was:
  47. 69
  48. 2022-07-16 03:36:53.002 xcodebuild[14752:1207] [MT] DVTAssertions: ASSERTION FAILURE in /SourceCache/DVTFoundation/DVTFoundation-1828/Framework/Classes/FilePaths/DVTFilePath.m:379
  49. Details: fsrep is absolute (starts with /) ('/opt/local/libexec/llvm-13/bin/clang') parentPath must be nil but it is not ('<DVTFilePath:0x400129ac0:'/Applications/Xcode.app/Contents/Developer/Toolchains/XcodeDefault.xctoolchain/usr/bin'>')
  50. Object: <DVTFilePath>
  51. Method: +_filePathForParent:fileSystemRepresentation:length:allowCreation:
  52. Thread: <NSThread: 0x40030a1e0>{name = (null), num = 1}
  53. Hints: None
  54. Backtrace:
  55. 0 0x0000000101ec744c -[DVTAssertionHandler handleFailureInMethod:object:fileName:lineNumber:messageFormat:arguments:] (in DVTFoundation)
  56. 1 0x0000000101ec72a5 _DVTAssertionFailureHandler (in DVTFoundation)
  57. 2 0x0000000101e4a694 +[DVTFilePath _filePathForParent:fileSystemRepresentation:length:allowCreation:] (in DVTFoundation)
  58. 3 0x0000000101e4a372 +[DVTFilePath _filePathForParent:pathString:] (in DVTFoundation)
  59. 4 0x0000000101e7e16b -[DVTSearchPath pathForFileWithRelativePathString:] (in DVTFoundation)
  60. 5 0x00000001026a5a5b -[Xcode3CommandLineBuildTool _printPathToExecutableAndExit] (in Xcode3Core)
  61. 6 0x00000001026a7bd4 -[Xcode3CommandLineBuildTool run] (in Xcode3Core)
  62. 7 0x0000000101e3fb46 (in xcodebuild)
  63. 8 0x0000000101e3f91c (in xcodebuild)
  64. 9 0x0000000000000005
  65. xcrun: error: /Applications/Xcode.app/Contents/Developer/usr/bin/xcodebuild failed with exit code 6
  66.  
  67.  
  68. Compiling the C compiler identification source file "CMakeCCompilerId.c" failed.
  69. Compiler: /opt/local/bin/clang-mp-13
  70. Build flags: -pipe;-Os;-DNDEBUG;-isystem/opt/local/include/LegacySupport;-I/opt/local/include
  71. Id flags: -Aa
  72.  
  73. The output was:
  74. 69
  75. 2022-07-16 03:36:58.320 xcodebuild[14754:1207] [MT] DVTAssertions: ASSERTION FAILURE in /SourceCache/DVTFoundation/DVTFoundation-1828/Framework/Classes/FilePaths/DVTFilePath.m:379
  76. Details: fsrep is absolute (starts with /) ('/opt/local/libexec/llvm-13/bin/clang') parentPath must be nil but it is not ('<DVTFilePath:0x400129ac0:'/Applications/Xcode.app/Contents/Developer/Toolchains/XcodeDefault.xctoolchain/usr/bin'>')
  77. Object: <DVTFilePath>
  78. Method: +_filePathForParent:fileSystemRepresentation:length:allowCreation:
  79. Thread: <NSThread: 0x40030a1e0>{name = (null), num = 1}
  80. Hints: None
  81. Backtrace:
  82. 0 0x000000010682044c -[DVTAssertionHandler handleFailureInMethod:object:fileName:lineNumber:messageFormat:arguments:] (in DVTFoundation)
  83. 1 0x00000001068202a5 _DVTAssertionFailureHandler (in DVTFoundation)
  84. 2 0x00000001067a3694 +[DVTFilePath _filePathForParent:fileSystemRepresentation:length:allowCreation:] (in DVTFoundation)
  85. 3 0x00000001067a3372 +[DVTFilePath _filePathForParent:pathString:] (in DVTFoundation)
  86. 4 0x00000001067d716b -[DVTSearchPath pathForFileWithRelativePathString:] (in DVTFoundation)
  87. 5 0x0000000106ffca5b -[Xcode3CommandLineBuildTool _printPathToExecutableAndExit] (in Xcode3Core)
  88. 6 0x0000000106ffebd4 -[Xcode3CommandLineBuildTool run] (in Xcode3Core)
  89. 7 0x0000000106794b46 (in xcodebuild)
  90. 8 0x000000010679491c (in xcodebuild)
  91. 9 0x0000000000000005
  92. xcrun: error: /Applications/Xcode.app/Contents/Developer/usr/bin/xcodebuild failed with exit code 6
  93.  
  94.  
  95. Compiling the C compiler identification source file "CMakeCCompilerId.c" failed.
  96. Compiler: /opt/local/bin/clang-mp-13
  97. Build flags: -pipe;-Os;-DNDEBUG;-isystem/opt/local/include/LegacySupport;-I/opt/local/include
  98. Id flags: -D__CLASSIC_C__
  99.  
  100. The output was:
  101. 69
  102. 2022-07-16 03:37:04.003 xcodebuild[14757:1207] [MT] DVTAssertions: ASSERTION FAILURE in /SourceCache/DVTFoundation/DVTFoundation-1828/Framework/Classes/FilePaths/DVTFilePath.m:379
  103. Details: fsrep is absolute (starts with /) ('/opt/local/libexec/llvm-13/bin/clang') parentPath must be nil but it is not ('<DVTFilePath:0x400129c00:'/Applications/Xcode.app/Contents/Developer/Toolchains/XcodeDefault.xctoolchain/usr/bin'>')
  104. Object: <DVTFilePath>
  105. Method: +_filePathForParent:fileSystemRepresentation:length:allowCreation:
  106. Thread: <NSThread: 0x40030a1e0>{name = (null), num = 1}
  107. Hints: None
  108. Backtrace:
  109. 0 0x000000010fcb044c -[DVTAssertionHandler handleFailureInMethod:object:fileName:lineNumber:messageFormat:arguments:] (in DVTFoundation)
  110. 1 0x000000010fcb02a5 _DVTAssertionFailureHandler (in DVTFoundation)
  111. 2 0x000000010fc33694 +[DVTFilePath _filePathForParent:fileSystemRepresentation:length:allowCreation:] (in DVTFoundation)
  112. 3 0x000000010fc33372 +[DVTFilePath _filePathForParent:pathString:] (in DVTFoundation)
  113. 4 0x000000010fc6716b -[DVTSearchPath pathForFileWithRelativePathString:] (in DVTFoundation)
  114. 5 0x000000011048ca5b -[Xcode3CommandLineBuildTool _printPathToExecutableAndExit] (in Xcode3Core)
  115. 6 0x000000011048ebd4 -[Xcode3CommandLineBuildTool run] (in Xcode3Core)
  116. 7 0x000000010fc28b46 (in xcodebuild)
  117. 8 0x000000010fc2891c (in xcodebuild)
  118. 9 0x0000000000000005
  119. xcrun: error: /Applications/Xcode.app/Contents/Developer/usr/bin/xcodebuild failed with exit code 6
  120.  
  121.  
  122. Compiling the C compiler identification source file "CMakeCCompilerId.c" failed.
  123. Compiler: /opt/local/bin/clang-mp-13
  124. Build flags: -pipe;-Os;-DNDEBUG;-isystem/opt/local/include/LegacySupport;-I/opt/local/include
  125. Id flags: --target=arm-arm-none-eabi;-mcpu=cortex-m3
  126.  
  127. The output was:
  128. 69
  129. 2022-07-16 03:37:08.600 xcodebuild[14759:1207] [MT] DVTAssertions: ASSERTION FAILURE in /SourceCache/DVTFoundation/DVTFoundation-1828/Framework/Classes/FilePaths/DVTFilePath.m:379
  130. Details: fsrep is absolute (starts with /) ('/opt/local/libexec/llvm-13/bin/clang') parentPath must be nil but it is not ('<DVTFilePath:0x400129ac0:'/Applications/Xcode.app/Contents/Developer/Toolchains/XcodeDefault.xctoolchain/usr/bin'>')
  131. Object: <DVTFilePath>
  132. Method: +_filePathForParent:fileSystemRepresentation:length:allowCreation:
  133. Thread: <NSThread: 0x40030a1e0>{name = (null), num = 1}
  134. Hints: None
  135. Backtrace:
  136. 0 0x0000000100f1244c -[DVTAssertionHandler handleFailureInMethod:object:fileName:lineNumber:messageFormat:arguments:] (in DVTFoundation)
  137. 1 0x0000000100f122a5 _DVTAssertionFailureHandler (in DVTFoundation)
  138. 2 0x0000000100e95694 +[DVTFilePath _filePathForParent:fileSystemRepresentation:length:allowCreation:] (in DVTFoundation)
  139. 3 0x0000000100e95372 +[DVTFilePath _filePathForParent:pathString:] (in DVTFoundation)
  140. 4 0x0000000100ec916b -[DVTSearchPath pathForFileWithRelativePathString:] (in DVTFoundation)
  141. 5 0x00000001016f3a5b -[Xcode3CommandLineBuildTool _printPathToExecutableAndExit] (in Xcode3Core)
  142. 6 0x00000001016f5bd4 -[Xcode3CommandLineBuildTool run] (in Xcode3Core)
  143. 7 0x0000000100e88b46 (in xcodebuild)
  144. 8 0x0000000100e8891c (in xcodebuild)
  145. 9 0x0000000000000005
  146. xcrun: error: /Applications/Xcode.app/Contents/Developer/usr/bin/xcodebuild failed with exit code 6
  147.  
  148.  
  149. Compiling the C compiler identification source file "CMakeCCompilerId.c" failed.
  150. Compiler: /opt/local/bin/clang-mp-13
  151. Build flags: -pipe;-Os;-DNDEBUG;-isystem/opt/local/include/LegacySupport;-I/opt/local/include
  152. Id flags: -c;-I__does_not_exist__
  153.  
  154. The output was:
  155. 69
  156. 2022-07-16 03:37:14.003 xcodebuild[14762:1207] [MT] DVTAssertions: ASSERTION FAILURE in /SourceCache/DVTFoundation/DVTFoundation-1828/Framework/Classes/FilePaths/DVTFilePath.m:379
  157. Details: fsrep is absolute (starts with /) ('/opt/local/libexec/llvm-13/bin/clang') parentPath must be nil but it is not ('<DVTFilePath:0x400129ac0:'/Applications/Xcode.app/Contents/Developer/Toolchains/XcodeDefault.xctoolchain/usr/bin'>')
  158. Object: <DVTFilePath>
  159. Method: +_filePathForParent:fileSystemRepresentation:length:allowCreation:
  160. Thread: <NSThread: 0x40030a1e0>{name = (null), num = 1}
  161. Hints: None
  162. Backtrace:
  163. 0 0x000000010975d44c -[DVTAssertionHandler handleFailureInMethod:object:fileName:lineNumber:messageFormat:arguments:] (in DVTFoundation)
  164. 1 0x000000010975d2a5 _DVTAssertionFailureHandler (in DVTFoundation)
  165. 2 0x00000001096e0694 +[DVTFilePath _filePathForParent:fileSystemRepresentation:length:allowCreation:] (in DVTFoundation)
  166. 3 0x00000001096e0372 +[DVTFilePath _filePathForParent:pathString:] (in DVTFoundation)
  167. 4 0x000000010971416b -[DVTSearchPath pathForFileWithRelativePathString:] (in DVTFoundation)
  168. 5 0x0000000109f42a5b -[Xcode3CommandLineBuildTool _printPathToExecutableAndExit] (in Xcode3Core)
  169. 6 0x0000000109f44bd4 -[Xcode3CommandLineBuildTool run] (in Xcode3Core)
  170. 7 0x00000001096d1b46 (in xcodebuild)
  171. 8 0x00000001096d191c (in xcodebuild)
  172. 9 0x0000000000000005
  173. xcrun: error: /Applications/Xcode.app/Contents/Developer/usr/bin/xcodebuild failed with exit code 6
  174.  
  175.  
  176. Compiling the C compiler identification source file "CMakeCCompilerId.c" failed.
  177. Compiler: /opt/local/bin/clang-mp-13
  178. Build flags:
  179. Id flags:
  180.  
  181. The output was:
  182. 69
  183. 2022-07-16 03:37:19.085 xcodebuild[14765:1207] [MT] DVTAssertions: ASSERTION FAILURE in /SourceCache/DVTFoundation/DVTFoundation-1828/Framework/Classes/FilePaths/DVTFilePath.m:379
  184. Details: fsrep is absolute (starts with /) ('/opt/local/libexec/llvm-13/bin/clang') parentPath must be nil but it is not ('<DVTFilePath:0x400129840:'/Applications/Xcode.app/Contents/Developer/Toolchains/XcodeDefault.xctoolchain/usr/bin'>')
  185. Object: <DVTFilePath>
  186. Method: +_filePathForParent:fileSystemRepresentation:length:allowCreation:
  187. Thread: <NSThread: 0x40030a1e0>{name = (null), num = 1}
  188. Hints: None
  189. Backtrace:
  190. 0 0x000000010e03544c -[DVTAssertionHandler handleFailureInMethod:object:fileName:lineNumber:messageFormat:arguments:] (in DVTFoundation)
  191. 1 0x000000010e0352a5 _DVTAssertionFailureHandler (in DVTFoundation)
  192. 2 0x000000010dfb8694 +[DVTFilePath _filePathForParent:fileSystemRepresentation:length:allowCreation:] (in DVTFoundation)
  193. 3 0x000000010dfb8372 +[DVTFilePath _filePathForParent:pathString:] (in DVTFoundation)
  194. 4 0x000000010dfec16b -[DVTSearchPath pathForFileWithRelativePathString:] (in DVTFoundation)
  195. 5 0x000000010e819a5b -[Xcode3CommandLineBuildTool _printPathToExecutableAndExit] (in Xcode3Core)
  196. 6 0x000000010e81bbd4 -[Xcode3CommandLineBuildTool run] (in Xcode3Core)
  197. 7 0x000000010dfacb46 (in xcodebuild)
  198. 8 0x000000010dfac91c (in xcodebuild)
  199. 9 0x0000000000000005
  200. xcrun: error: /Applications/Xcode.app/Contents/Developer/usr/bin/xcodebuild failed with exit code 6
  201.  
  202.  
  203. Compiling the C compiler identification source file "CMakeCCompilerId.c" failed.
  204. Compiler: /opt/local/bin/clang-mp-13
  205. Build flags:
  206. Id flags: -c
  207.  
  208. The output was:
  209. 69
  210. 2022-07-16 03:37:25.003 xcodebuild[14768:1207] [MT] DVTAssertions: ASSERTION FAILURE in /SourceCache/DVTFoundation/DVTFoundation-1828/Framework/Classes/FilePaths/DVTFilePath.m:379
  211. Details: fsrep is absolute (starts with /) ('/opt/local/libexec/llvm-13/bin/clang') parentPath must be nil but it is not ('<DVTFilePath:0x400129ac0:'/Applications/Xcode.app/Contents/Developer/Toolchains/XcodeDefault.xctoolchain/usr/bin'>')
  212. Object: <DVTFilePath>
  213. Method: +_filePathForParent:fileSystemRepresentation:length:allowCreation:
  214. Thread: <NSThread: 0x40030a1e0>{name = (null), num = 1}
  215. Hints: None
  216. Backtrace:
  217. 0 0x000000010492444c -[DVTAssertionHandler handleFailureInMethod:object:fileName:lineNumber:messageFormat:arguments:] (in DVTFoundation)
  218. 1 0x00000001049242a5 _DVTAssertionFailureHandler (in DVTFoundation)
  219. 2 0x00000001048a7694 +[DVTFilePath _filePathForParent:fileSystemRepresentation:length:allowCreation:] (in DVTFoundation)
  220. 3 0x00000001048a7372 +[DVTFilePath _filePathForParent:pathString:] (in DVTFoundation)
  221. 4 0x00000001048db16b -[DVTSearchPath pathForFileWithRelativePathString:] (in DVTFoundation)
  222. 5 0x0000000105109a5b -[Xcode3CommandLineBuildTool _printPathToExecutableAndExit] (in Xcode3Core)
  223. 6 0x000000010510bbd4 -[Xcode3CommandLineBuildTool run] (in Xcode3Core)
  224. 7 0x0000000104897b46 (in xcodebuild)
  225. 8 0x000000010489791c (in xcodebuild)
  226. 9 0x0000000000000005
  227. xcrun: error: /Applications/Xcode.app/Contents/Developer/usr/bin/xcodebuild failed with exit code 6
  228.  
  229.  
  230. Compiling the C compiler identification source file "CMakeCCompilerId.c" failed.
  231. Compiler: /opt/local/bin/clang-mp-13
  232. Build flags:
  233. Id flags: -Aa
  234.  
  235. The output was:
  236. 69
  237. 2022-07-16 03:37:29.701 xcodebuild[14770:1207] [MT] DVTAssertions: ASSERTION FAILURE in /SourceCache/DVTFoundation/DVTFoundation-1828/Framework/Classes/FilePaths/DVTFilePath.m:379
  238. Details: fsrep is absolute (starts with /) ('/opt/local/libexec/llvm-13/bin/clang') parentPath must be nil but it is not ('<DVTFilePath:0x400129ac0:'/Applications/Xcode.app/Contents/Developer/Toolchains/XcodeDefault.xctoolchain/usr/bin'>')
  239. Object: <DVTFilePath>
  240. Method: +_filePathForParent:fileSystemRepresentation:length:allowCreation:
  241. Thread: <NSThread: 0x40030a1e0>{name = (null), num = 1}
  242. Hints: None
  243. Backtrace:
  244. 0 0x000000010515144c -[DVTAssertionHandler handleFailureInMethod:object:fileName:lineNumber:messageFormat:arguments:] (in DVTFoundation)
  245. 1 0x00000001051512a5 _DVTAssertionFailureHandler (in DVTFoundation)
  246. 2 0x00000001050d4694 +[DVTFilePath _filePathForParent:fileSystemRepresentation:length:allowCreation:] (in DVTFoundation)
  247. 3 0x00000001050d4372 +[DVTFilePath _filePathForParent:pathString:] (in DVTFoundation)
  248. 4 0x000000010510816b -[DVTSearchPath pathForFileWithRelativePathString:] (in DVTFoundation)
  249. 5 0x0000000105930a5b -[Xcode3CommandLineBuildTool _printPathToExecutableAndExit] (in Xcode3Core)
  250. 6 0x0000000105932bd4 -[Xcode3CommandLineBuildTool run] (in Xcode3Core)
  251. 7 0x00000001050c5b46 (in xcodebuild)
  252. 8 0x00000001050c591c (in xcodebuild)
  253. 9 0x0000000000000005
  254. xcrun: error: /Applications/Xcode.app/Contents/Developer/usr/bin/xcodebuild failed with exit code 6
  255.  
  256.  
  257. Compiling the C compiler identification source file "CMakeCCompilerId.c" failed.
  258. Compiler: /opt/local/bin/clang-mp-13
  259. Build flags:
  260. Id flags: -D__CLASSIC_C__
  261.  
  262. The output was:
  263. 69
  264. 2022-07-16 03:37:35.004 xcodebuild[14773:1207] [MT] DVTAssertions: ASSERTION FAILURE in /SourceCache/DVTFoundation/DVTFoundation-1828/Framework/Classes/FilePaths/DVTFilePath.m:379
  265. Details: fsrep is absolute (starts with /) ('/opt/local/libexec/llvm-13/bin/clang') parentPath must be nil but it is not ('<DVTFilePath:0x400129ac0:'/Applications/Xcode.app/Contents/Developer/Toolchains/XcodeDefault.xctoolchain/usr/bin'>')
  266. Object: <DVTFilePath>
  267. Method: +_filePathForParent:fileSystemRepresentation:length:allowCreation:
  268. Thread: <NSThread: 0x40030a1e0>{name = (null), num = 1}
  269. Hints: None
  270. Backtrace:
  271. 0 0x0000000103d6f44c -[DVTAssertionHandler handleFailureInMethod:object:fileName:lineNumber:messageFormat:arguments:] (in DVTFoundation)
  272. 1 0x0000000103d6f2a5 _DVTAssertionFailureHandler (in DVTFoundation)
  273. 2 0x0000000103cf2694 +[DVTFilePath _filePathForParent:fileSystemRepresentation:length:allowCreation:] (in DVTFoundation)
  274. 3 0x0000000103cf2372 +[DVTFilePath _filePathForParent:pathString:] (in DVTFoundation)
  275. 4 0x0000000103d2616b -[DVTSearchPath pathForFileWithRelativePathString:] (in DVTFoundation)
  276. 5 0x000000010454ca5b -[Xcode3CommandLineBuildTool _printPathToExecutableAndExit] (in Xcode3Core)
  277. 6 0x000000010454ebd4 -[Xcode3CommandLineBuildTool run] (in Xcode3Core)
  278. 7 0x0000000103ce7b46 (in xcodebuild)
  279. 8 0x0000000103ce791c (in xcodebuild)
  280. 9 0x0000000000000005
  281. xcrun: error: /Applications/Xcode.app/Contents/Developer/usr/bin/xcodebuild failed with exit code 6
  282.  
  283.  
  284. Compiling the C compiler identification source file "CMakeCCompilerId.c" failed.
  285. Compiler: /opt/local/bin/clang-mp-13
  286. Build flags:
  287. Id flags: --target=arm-arm-none-eabi;-mcpu=cortex-m3
  288.  
  289. The output was:
  290. 69
  291. 2022-07-16 03:37:40.303 xcodebuild[14775:1207] [MT] DVTAssertions: ASSERTION FAILURE in /SourceCache/DVTFoundation/DVTFoundation-1828/Framework/Classes/FilePaths/DVTFilePath.m:379
  292. Details: fsrep is absolute (starts with /) ('/opt/local/libexec/llvm-13/bin/clang') parentPath must be nil but it is not ('<DVTFilePath:0x400129ac0:'/Applications/Xcode.app/Contents/Developer/Toolchains/XcodeDefault.xctoolchain/usr/bin'>')
  293. Object: <DVTFilePath>
  294. Method: +_filePathForParent:fileSystemRepresentation:length:allowCreation:
  295. Thread: <NSThread: 0x40030a1e0>{name = (null), num = 1}
  296. Hints: None
  297. Backtrace:
  298. 0 0x000000010eac244c -[DVTAssertionHandler handleFailureInMethod:object:fileName:lineNumber:messageFormat:arguments:] (in DVTFoundation)
  299. 1 0x000000010eac22a5 _DVTAssertionFailureHandler (in DVTFoundation)
  300. 2 0x000000010ea45694 +[DVTFilePath _filePathForParent:fileSystemRepresentation:length:allowCreation:] (in DVTFoundation)
  301. 3 0x000000010ea45372 +[DVTFilePath _filePathForParent:pathString:] (in DVTFoundation)
  302. 4 0x000000010ea7916b -[DVTSearchPath pathForFileWithRelativePathString:] (in DVTFoundation)
  303. 5 0x000000010f2a9a5b -[Xcode3CommandLineBuildTool _printPathToExecutableAndExit] (in Xcode3Core)
  304. 6 0x000000010f2abbd4 -[Xcode3CommandLineBuildTool run] (in Xcode3Core)
  305. 7 0x000000010ea37b46 (in xcodebuild)
  306. 8 0x000000010ea3791c (in xcodebuild)
  307. 9 0x0000000000000005
  308. xcrun: error: /Applications/Xcode.app/Contents/Developer/usr/bin/xcodebuild failed with exit code 6
  309.  
  310.  
  311. Compiling the C compiler identification source file "CMakeCCompilerId.c" failed.
  312. Compiler: /opt/local/bin/clang-mp-13
  313. Build flags:
  314. Id flags: -c;-I__does_not_exist__
  315.  
  316. The output was:
  317. 69
  318. 2022-07-16 03:37:46.004 xcodebuild[14778:1207] [MT] DVTAssertions: ASSERTION FAILURE in /SourceCache/DVTFoundation/DVTFoundation-1828/Framework/Classes/FilePaths/DVTFilePath.m:379
  319. Details: fsrep is absolute (starts with /) ('/opt/local/libexec/llvm-13/bin/clang') parentPath must be nil but it is not ('<DVTFilePath:0x400129ac0:'/Applications/Xcode.app/Contents/Developer/Toolchains/XcodeDefault.xctoolchain/usr/bin'>')
  320. Object: <DVTFilePath>
  321. Method: +_filePathForParent:fileSystemRepresentation:length:allowCreation:
  322. Thread: <NSThread: 0x40030a1e0>{name = (null), num = 1}
  323. Hints: None
  324. Backtrace:
  325. 0 0x000000010ca1544c -[DVTAssertionHandler handleFailureInMethod:object:fileName:lineNumber:messageFormat:arguments:] (in DVTFoundation)
  326. 1 0x000000010ca152a5 _DVTAssertionFailureHandler (in DVTFoundation)
  327. 2 0x000000010c998694 +[DVTFilePath _filePathForParent:fileSystemRepresentation:length:allowCreation:] (in DVTFoundation)
  328. 3 0x000000010c998372 +[DVTFilePath _filePathForParent:pathString:] (in DVTFoundation)
  329. 4 0x000000010c9cc16b -[DVTSearchPath pathForFileWithRelativePathString:] (in DVTFoundation)
  330. 5 0x000000010d1f6a5b -[Xcode3CommandLineBuildTool _printPathToExecutableAndExit] (in Xcode3Core)
  331. 6 0x000000010d1f8bd4 -[Xcode3CommandLineBuildTool run] (in Xcode3Core)
  332. 7 0x000000010c98db46 (in xcodebuild)
  333. 8 0x000000010c98d91c (in xcodebuild)
  334. 9 0x0000000000000005
  335. xcrun: error: /Applications/Xcode.app/Contents/Developer/usr/bin/xcodebuild failed with exit code 6
  336.  
  337.  
  338. Checking whether the C compiler is IAR using "" did not match "IAR .+ Compiler":
  339. 2022-07-16 03:37:50.908 xcodebuild[14780:1207] [MT] DVTAssertions: ASSERTION FAILURE in /SourceCache/DVTFoundation/DVTFoundation-1828/Framework/Classes/FilePaths/DVTFilePath.m:379
  340. Details: fsrep is absolute (starts with /) ('/opt/local/libexec/llvm-13/bin/clang') parentPath must be nil but it is not ('<DVTFilePath:0x400129d40:'/Applications/Xcode.app/Contents/Developer/Toolchains/XcodeDefault.xctoolchain/usr/bin'>')
  341. Object: <DVTFilePath>
  342. Method: +_filePathForParent:fileSystemRepresentation:length:allowCreation:
  343. Thread: <NSThread: 0x40030a1e0>{name = (null), num = 1}
  344. Hints: None
  345. Backtrace:
  346. 0 0x000000010d17044c -[DVTAssertionHandler handleFailureInMethod:object:fileName:lineNumber:messageFormat:arguments:] (in DVTFoundation)
  347. 1 0x000000010d1702a5 _DVTAssertionFailureHandler (in DVTFoundation)
  348. 2 0x000000010d0f3694 +[DVTFilePath _filePathForParent:fileSystemRepresentation:length:allowCreation:] (in DVTFoundation)
  349. 3 0x000000010d0f3372 +[DVTFilePath _filePathForParent:pathString:] (in DVTFoundation)
  350. 4 0x000000010d12716b -[DVTSearchPath pathForFileWithRelativePathString:] (in DVTFoundation)
  351. 5 0x000000010d951a5b -[Xcode3CommandLineBuildTool _printPathToExecutableAndExit] (in Xcode3Core)
  352. 6 0x000000010d953bd4 -[Xcode3CommandLineBuildTool run] (in Xcode3Core)
  353. 7 0x000000010d0e8b46 (in xcodebuild)
  354. 8 0x000000010d0e891c (in xcodebuild)
  355. xcrun: error: /Applications/Xcode.app/Contents/Developer/usr/bin/xcodebuild failed with exit code 6
  356. Checking whether the C compiler is IAR using "" did not match "IAR .+ Compiler":
  357. 2022-07-16 03:37:56.004 xcodebuild[14787:1207] [MT] DVTAssertions: ASSERTION FAILURE in /SourceCache/DVTFoundation/DVTFoundation-1828/Framework/Classes/FilePaths/DVTFilePath.m:379
  358. Details: fsrep is absolute (starts with /) ('/opt/local/libexec/llvm-13/bin/clang') parentPath must be nil but it is not ('<DVTFilePath:0x400129d40:'/Applications/Xcode.app/Contents/Developer/Toolchains/XcodeDefault.xctoolchain/usr/bin'>')
  359. Object: <DVTFilePath>
  360. Method: +_filePathForParent:fileSystemRepresentation:length:allowCreation:
  361. Thread: <NSThread: 0x40030a1e0>{name = (null), num = 1}
  362. Hints: None
  363. Backtrace:
  364. 0 0x00000001095ce44c -[DVTAssertionHandler handleFailureInMethod:object:fileName:lineNumber:messageFormat:arguments:] (in DVTFoundation)
  365. 1 0x00000001095ce2a5 _DVTAssertionFailureHandler (in DVTFoundation)
  366. 2 0x0000000109551694 +[DVTFilePath _filePathForParent:fileSystemRepresentation:length:allowCreation:] (in DVTFoundation)
  367. 3 0x0000000109551372 +[DVTFilePath _filePathForParent:pathString:] (in DVTFoundation)
  368. 4 0x000000010958516b -[DVTSearchPath pathForFileWithRelativePathString:] (in DVTFoundation)
  369. 5 0x0000000109daea5b -[Xcode3CommandLineBuildTool _printPathToExecutableAndExit] (in Xcode3Core)
  370. 6 0x0000000109db0bd4 -[Xcode3CommandLineBuildTool run] (in Xcode3Core)
  371. 7 0x0000000109542b46 (in xcodebuild)
  372. 8 0x000000010954291c (in xcodebuild)
  373. xcrun: error: /Applications/Xcode.app/Contents/Developer/usr/bin/xcodebuild failed with exit code 6
  374. Compiling the CXX compiler identification source file "CMakeCXXCompilerId.cpp" failed.
  375. Compiler: /opt/local/bin/clang++-mp-13
  376. Build flags: -pipe;-Os;-DNDEBUG;-isystem/opt/local/include/LegacySupport;-I/opt/local/include;-stdlib=libc++
  377. Id flags:
  378.  
  379. The output was:
  380. 69
  381. 2022-07-16 03:38:01.235 xcodebuild[14790:1207] [MT] DVTAssertions: ASSERTION FAILURE in /SourceCache/DVTFoundation/DVTFoundation-1828/Framework/Classes/FilePaths/DVTFilePath.m:379
  382. Details: fsrep is absolute (starts with /) ('/opt/local/libexec/llvm-13/bin/clang++') parentPath must be nil but it is not ('<DVTFilePath:0x400129840:'/Applications/Xcode.app/Contents/Developer/Toolchains/XcodeDefault.xctoolchain/usr/bin'>')
  383. Object: <DVTFilePath>
  384. Method: +_filePathForParent:fileSystemRepresentation:length:allowCreation:
  385. Thread: <NSThread: 0x40030a1e0>{name = (null), num = 1}
  386. Hints: None
  387. Backtrace:
  388. 0 0x000000010527d44c -[DVTAssertionHandler handleFailureInMethod:object:fileName:lineNumber:messageFormat:arguments:] (in DVTFoundation)
  389. 1 0x000000010527d2a5 _DVTAssertionFailureHandler (in DVTFoundation)
  390. 2 0x0000000105200694 +[DVTFilePath _filePathForParent:fileSystemRepresentation:length:allowCreation:] (in DVTFoundation)
  391. 3 0x0000000105200372 +[DVTFilePath _filePathForParent:pathString:] (in DVTFoundation)
  392. 4 0x000000010523416b -[DVTSearchPath pathForFileWithRelativePathString:] (in DVTFoundation)
  393. 5 0x0000000105a5da5b -[Xcode3CommandLineBuildTool _printPathToExecutableAndExit] (in Xcode3Core)
  394. 6 0x0000000105a5fbd4 -[Xcode3CommandLineBuildTool run] (in Xcode3Core)
  395. 7 0x00000001051efb46 (in xcodebuild)
  396. 8 0x00000001051ef91c (in xcodebuild)
  397. xcrun: error: /Applications/Xcode.app/Contents/Developer/usr/bin/xcodebuild failed with exit code 6
  398.  
  399.  
  400. Compiling the CXX compiler identification source file "CMakeCXXCompilerId.cpp" failed.
  401. Compiler: /opt/local/bin/clang++-mp-13
  402. Build flags: -pipe;-Os;-DNDEBUG;-isystem/opt/local/include/LegacySupport;-I/opt/local/include;-stdlib=libc++
  403. Id flags: -c
  404.  
  405. The output was:
  406. 69
  407. 2022-07-16 03:38:07.004 xcodebuild[14793:1207] [MT] DVTAssertions: ASSERTION FAILURE in /SourceCache/DVTFoundation/DVTFoundation-1828/Framework/Classes/FilePaths/DVTFilePath.m:379
  408. Details: fsrep is absolute (starts with /) ('/opt/local/libexec/llvm-13/bin/clang++') parentPath must be nil but it is not ('<DVTFilePath:0x400129ac0:'/Applications/Xcode.app/Contents/Developer/Toolchains/XcodeDefault.xctoolchain/usr/bin'>')
  409. Object: <DVTFilePath>
  410. Method: +_filePathForParent:fileSystemRepresentation:length:allowCreation:
  411. Thread: <NSThread: 0x40030a1e0>{name = (null), num = 1}
  412. Hints: None
  413. Backtrace:
  414. 0 0x000000010aa3844c -[DVTAssertionHandler handleFailureInMethod:object:fileName:lineNumber:messageFormat:arguments:] (in DVTFoundation)
  415. 1 0x000000010aa382a5 _DVTAssertionFailureHandler (in DVTFoundation)
  416. 2 0x000000010a9bb694 +[DVTFilePath _filePathForParent:fileSystemRepresentation:length:allowCreation:] (in DVTFoundation)
  417. 3 0x000000010a9bb372 +[DVTFilePath _filePathForParent:pathString:] (in DVTFoundation)
  418. 4 0x000000010a9ef16b -[DVTSearchPath pathForFileWithRelativePathString:] (in DVTFoundation)
  419. 5 0x000000010b218a5b -[Xcode3CommandLineBuildTool _printPathToExecutableAndExit] (in Xcode3Core)
  420. 6 0x000000010b21abd4 -[Xcode3CommandLineBuildTool run] (in Xcode3Core)
  421. 7 0x000000010a9b0b46 (in xcodebuild)
  422. 8 0x000000010a9b091c (in xcodebuild)
  423. xcrun: error: /Applications/Xcode.app/Contents/Developer/usr/bin/xcodebuild failed with exit code 6
  424.  
  425.  
  426. Compiling the CXX compiler identification source file "CMakeCXXCompilerId.cpp" failed.
  427. Compiler: /opt/local/bin/clang++-mp-13
  428. Build flags: -pipe;-Os;-DNDEBUG;-isystem/opt/local/include/LegacySupport;-I/opt/local/include;-stdlib=libc++
  429. Id flags: --c++
  430.  
  431. The output was:
  432. 69
  433. 2022-07-16 03:38:11.890 xcodebuild[14795:1207] [MT] DVTAssertions: ASSERTION FAILURE in /SourceCache/DVTFoundation/DVTFoundation-1828/Framework/Classes/FilePaths/DVTFilePath.m:379
  434. Details: fsrep is absolute (starts with /) ('/opt/local/libexec/llvm-13/bin/clang++') parentPath must be nil but it is not ('<DVTFilePath:0x400129ac0:'/Applications/Xcode.app/Contents/Developer/Toolchains/XcodeDefault.xctoolchain/usr/bin'>')
  435. Object: <DVTFilePath>
  436. Method: +_filePathForParent:fileSystemRepresentation:length:allowCreation:
  437. Thread: <NSThread: 0x40030a1e0>{name = (null), num = 1}
  438. Hints: None
  439. Backtrace:
  440. 0 0x000000010443744c -[DVTAssertionHandler handleFailureInMethod:object:fileName:lineNumber:messageFormat:arguments:] (in DVTFoundation)
  441. 1 0x00000001044372a5 _DVTAssertionFailureHandler (in DVTFoundation)
  442. 2 0x00000001043ba694 +[DVTFilePath _filePathForParent:fileSystemRepresentation:length:allowCreation:] (in DVTFoundation)
  443. 3 0x00000001043ba372 +[DVTFilePath _filePathForParent:pathString:] (in DVTFoundation)
  444. 4 0x00000001043ee16b -[DVTSearchPath pathForFileWithRelativePathString:] (in DVTFoundation)
  445. 5 0x0000000104c17a5b -[Xcode3CommandLineBuildTool _printPathToExecutableAndExit] (in Xcode3Core)
  446. 6 0x0000000104c19bd4 -[Xcode3CommandLineBuildTool run] (in Xcode3Core)
  447. 7 0x00000001043aab46 (in xcodebuild)
  448. 8 0x00000001043aa91c (in xcodebuild)
  449. xcrun: error: /Applications/Xcode.app/Contents/Developer/usr/bin/xcodebuild failed with exit code 6
  450.  
  451.  
  452. Compiling the CXX compiler identification source file "CMakeCXXCompilerId.cpp" failed.
  453. Compiler: /opt/local/bin/clang++-mp-13
  454. Build flags: -pipe;-Os;-DNDEBUG;-isystem/opt/local/include/LegacySupport;-I/opt/local/include;-stdlib=libc++
  455. Id flags: --ec++
  456.  
  457. The output was:
  458. 69
  459. 2022-07-16 03:38:18.004 xcodebuild[14798:1207] [MT] DVTAssertions: ASSERTION FAILURE in /SourceCache/DVTFoundation/DVTFoundation-1828/Framework/Classes/FilePaths/DVTFilePath.m:379
  460. Details: fsrep is absolute (starts with /) ('/opt/local/libexec/llvm-13/bin/clang++') parentPath must be nil but it is not ('<DVTFilePath:0x400129ac0:'/Applications/Xcode.app/Contents/Developer/Toolchains/XcodeDefault.xctoolchain/usr/bin'>')
  461. Object: <DVTFilePath>
  462. Method: +_filePathForParent:fileSystemRepresentation:length:allowCreation:
  463. Thread: <NSThread: 0x40030a1e0>{name = (null), num = 1}
  464. Hints: None
  465. Backtrace:
  466. 0 0x00000001080c344c -[DVTAssertionHandler handleFailureInMethod:object:fileName:lineNumber:messageFormat:arguments:] (in DVTFoundation)
  467. 1 0x00000001080c32a5 _DVTAssertionFailureHandler (in DVTFoundation)
  468. 2 0x0000000108046694 +[DVTFilePath _filePathForParent:fileSystemRepresentation:length:allowCreation:] (in DVTFoundation)
  469. 3 0x0000000108046372 +[DVTFilePath _filePathForParent:pathString:] (in DVTFoundation)
  470. 4 0x000000010807a16b -[DVTSearchPath pathForFileWithRelativePathString:] (in DVTFoundation)
  471. 5 0x00000001088a1a5b -[Xcode3CommandLineBuildTool _printPathToExecutableAndExit] (in Xcode3Core)
  472. 6 0x00000001088a3bd4 -[Xcode3CommandLineBuildTool run] (in Xcode3Core)
  473. 7 0x0000000108034b46 (in xcodebuild)
  474. 8 0x000000010803491c (in xcodebuild)
  475. xcrun: error: /Applications/Xcode.app/Contents/Developer/usr/bin/xcodebuild failed with exit code 6
  476.  
  477.  
  478. Compiling the CXX compiler identification source file "CMakeCXXCompilerId.cpp" failed.
  479. Compiler: /opt/local/bin/clang++-mp-13
  480. Build flags: -pipe;-Os;-DNDEBUG;-isystem/opt/local/include/LegacySupport;-I/opt/local/include;-stdlib=libc++
  481. Id flags: --target=arm-arm-none-eabi;-mcpu=cortex-m3
  482.  
  483. The output was:
  484. 69
  485. 2022-07-16 03:38:22.571 xcodebuild[14801:1207] [MT] DVTAssertions: ASSERTION FAILURE in /SourceCache/DVTFoundation/DVTFoundation-1828/Framework/Classes/FilePaths/DVTFilePath.m:379
  486. Details: fsrep is absolute (starts with /) ('/opt/local/libexec/llvm-13/bin/clang++') parentPath must be nil but it is not ('<DVTFilePath:0x400129ac0:'/Applications/Xcode.app/Contents/Developer/Toolchains/XcodeDefault.xctoolchain/usr/bin'>')
  487. Object: <DVTFilePath>
  488. Method: +_filePathForParent:fileSystemRepresentation:length:allowCreation:
  489. Thread: <NSThread: 0x40030a1e0>{name = (null), num = 1}
  490. Hints: None
  491. Backtrace:
  492. 0 0x000000010d04344c -[DVTAssertionHandler handleFailureInMethod:object:fileName:lineNumber:messageFormat:arguments:] (in DVTFoundation)
  493. 1 0x000000010d0432a5 _DVTAssertionFailureHandler (in DVTFoundation)
  494. 2 0x000000010cfc6694 +[DVTFilePath _filePathForParent:fileSystemRepresentation:length:allowCreation:] (in DVTFoundation)
  495. 3 0x000000010cfc6372 +[DVTFilePath _filePathForParent:pathString:] (in DVTFoundation)
  496. 4 0x000000010cffa16b -[DVTSearchPath pathForFileWithRelativePathString:] (in DVTFoundation)
  497. 5 0x000000010d823a5b -[Xcode3CommandLineBuildTool _printPathToExecutableAndExit] (in Xcode3Core)
  498. 6 0x000000010d825bd4 -[Xcode3CommandLineBuildTool run] (in Xcode3Core)
  499. 7 0x000000010cfb7b46 (in xcodebuild)
  500. 8 0x000000010cfb791c (in xcodebuild)
  501. xcrun: error: /Applications/Xcode.app/Contents/Developer/usr/bin/xcodebuild failed with exit code 6
  502.  
  503.  
  504. Compiling the CXX compiler identification source file "CMakeCXXCompilerId.cpp" failed.
  505. Compiler: /opt/local/bin/clang++-mp-13
  506. Build flags: -pipe;-Os;-DNDEBUG;-isystem/opt/local/include/LegacySupport;-I/opt/local/include;-stdlib=libc++
  507. Id flags: -c;-I__does_not_exist__
  508.  
  509. The output was:
  510. 69
  511. 2022-07-16 03:38:28.003 xcodebuild[14804:1207] [MT] DVTAssertions: ASSERTION FAILURE in /SourceCache/DVTFoundation/DVTFoundation-1828/Framework/Classes/FilePaths/DVTFilePath.m:379
  512. Details: fsrep is absolute (starts with /) ('/opt/local/libexec/llvm-13/bin/clang++') parentPath must be nil but it is not ('<DVTFilePath:0x400129ac0:'/Applications/Xcode.app/Contents/Developer/Toolchains/XcodeDefault.xctoolchain/usr/bin'>')
  513. Object: <DVTFilePath>
  514. Method: +_filePathForParent:fileSystemRepresentation:length:allowCreation:
  515. Thread: <NSThread: 0x40030a1e0>{name = (null), num = 1}
  516. Hints: None
  517. Backtrace:
  518. 0 0x000000010734344c -[DVTAssertionHandler handleFailureInMethod:object:fileName:lineNumber:messageFormat:arguments:] (in DVTFoundation)
  519. 1 0x00000001073432a5 _DVTAssertionFailureHandler (in DVTFoundation)
  520. 2 0x00000001072c6694 +[DVTFilePath _filePathForParent:fileSystemRepresentation:length:allowCreation:] (in DVTFoundation)
  521. 3 0x00000001072c6372 +[DVTFilePath _filePathForParent:pathString:] (in DVTFoundation)
  522. 4 0x00000001072fa16b -[DVTSearchPath pathForFileWithRelativePathString:] (in DVTFoundation)
  523. 5 0x0000000107b24a5b -[Xcode3CommandLineBuildTool _printPathToExecutableAndExit] (in Xcode3Core)
  524. 6 0x0000000107b26bd4 -[Xcode3CommandLineBuildTool run] (in Xcode3Core)
  525. 7 0x00000001072b6b46 (in xcodebuild)
  526. 8 0x00000001072b691c (in xcodebuild)
  527. xcrun: error: /Applications/Xcode.app/Contents/Developer/usr/bin/xcodebuild failed with exit code 6
  528.  
  529.  
  530. Compiling the CXX compiler identification source file "CMakeCXXCompilerId.cpp" failed.
  531. Compiler: /opt/local/bin/clang++-mp-13
  532. Build flags:
  533. Id flags:
  534.  
  535. The output was:
  536. 69
  537. 2022-07-16 03:38:33.256 xcodebuild[14806:1207] [MT] DVTAssertions: ASSERTION FAILURE in /SourceCache/DVTFoundation/DVTFoundation-1828/Framework/Classes/FilePaths/DVTFilePath.m:379
  538. Details: fsrep is absolute (starts with /) ('/opt/local/libexec/llvm-13/bin/clang++') parentPath must be nil but it is not ('<DVTFilePath:0x400129840:'/Applications/Xcode.app/Contents/Developer/Toolchains/XcodeDefault.xctoolchain/usr/bin'>')
  539. Object: <DVTFilePath>
  540. Method: +_filePathForParent:fileSystemRepresentation:length:allowCreation:
  541. Thread: <NSThread: 0x40030a1e0>{name = (null), num = 1}
  542. Hints: None
  543. Backtrace:
  544. 0 0x000000010caa044c -[DVTAssertionHandler handleFailureInMethod:object:fileName:lineNumber:messageFormat:arguments:] (in DVTFoundation)
  545. 1 0x000000010caa02a5 _DVTAssertionFailureHandler (in DVTFoundation)
  546. 2 0x000000010ca23694 +[DVTFilePath _filePathForParent:fileSystemRepresentation:length:allowCreation:] (in DVTFoundation)
  547. 3 0x000000010ca23372 +[DVTFilePath _filePathForParent:pathString:] (in DVTFoundation)
  548. 4 0x000000010ca5716b -[DVTSearchPath pathForFileWithRelativePathString:] (in DVTFoundation)
  549. 5 0x000000010d27ba5b -[Xcode3CommandLineBuildTool _printPathToExecutableAndExit] (in Xcode3Core)
  550. 6 0x000000010d27dbd4 -[Xcode3CommandLineBuildTool run] (in Xcode3Core)
  551. 7 0x000000010ca15b46 (in xcodebuild)
  552. 8 0x000000010ca1591c (in xcodebuild)
  553. xcrun: error: /Applications/Xcode.app/Contents/Developer/usr/bin/xcodebuild failed with exit code 6
  554.  
  555.  
  556. Compiling the CXX compiler identification source file "CMakeCXXCompilerId.cpp" failed.
  557. Compiler: /opt/local/bin/clang++-mp-13
  558. Build flags:
  559. Id flags: -c
  560.  
  561. The output was:
  562. 69
  563. 2022-07-16 03:38:39.004 xcodebuild[14809:1207] [MT] DVTAssertions: ASSERTION FAILURE in /SourceCache/DVTFoundation/DVTFoundation-1828/Framework/Classes/FilePaths/DVTFilePath.m:379
  564. Details: fsrep is absolute (starts with /) ('/opt/local/libexec/llvm-13/bin/clang++') parentPath must be nil but it is not ('<DVTFilePath:0x400129ac0:'/Applications/Xcode.app/Contents/Developer/Toolchains/XcodeDefault.xctoolchain/usr/bin'>')
  565. Object: <DVTFilePath>
  566. Method: +_filePathForParent:fileSystemRepresentation:length:allowCreation:
  567. Thread: <NSThread: 0x40030a1e0>{name = (null), num = 1}
  568. Hints: None
  569. Backtrace:
  570. 0 0x0000000107b9d44c -[DVTAssertionHandler handleFailureInMethod:object:fileName:lineNumber:messageFormat:arguments:] (in DVTFoundation)
  571. 1 0x0000000107b9d2a5 _DVTAssertionFailureHandler (in DVTFoundation)
  572. 2 0x0000000107b20694 +[DVTFilePath _filePathForParent:fileSystemRepresentation:length:allowCreation:] (in DVTFoundation)
  573. 3 0x0000000107b20372 +[DVTFilePath _filePathForParent:pathString:] (in DVTFoundation)
  574. 4 0x0000000107b5416b -[DVTSearchPath pathForFileWithRelativePathString:] (in DVTFoundation)
  575. 5 0x000000010837ea5b -[Xcode3CommandLineBuildTool _printPathToExecutableAndExit] (in Xcode3Core)
  576. 6 0x0000000108380bd4 -[Xcode3CommandLineBuildTool run] (in Xcode3Core)
  577. 7 0x0000000107b10b46 (in xcodebuild)
  578. 8 0x0000000107b1091c (in xcodebuild)
  579. xcrun: error: /Applications/Xcode.app/Contents/Developer/usr/bin/xcodebuild failed with exit code 6
  580.  
  581.  
  582. Compiling the CXX compiler identification source file "CMakeCXXCompilerId.cpp" failed.
  583. Compiler: /opt/local/bin/clang++-mp-13
  584. Build flags:
  585. Id flags: --c++
  586.  
  587. The output was:
  588. 69
  589. 2022-07-16 03:38:43.830 xcodebuild[14811:1207] [MT] DVTAssertions: ASSERTION FAILURE in /SourceCache/DVTFoundation/DVTFoundation-1828/Framework/Classes/FilePaths/DVTFilePath.m:379
  590. Details: fsrep is absolute (starts with /) ('/opt/local/libexec/llvm-13/bin/clang++') parentPath must be nil but it is not ('<DVTFilePath:0x400129ac0:'/Applications/Xcode.app/Contents/Developer/Toolchains/XcodeDefault.xctoolchain/usr/bin'>')
  591. Object: <DVTFilePath>
  592. Method: +_filePathForParent:fileSystemRepresentation:length:allowCreation:
  593. Thread: <NSThread: 0x40030a1e0>{name = (null), num = 1}
  594. Hints: None
  595. Backtrace:
  596. 0 0x000000010b06744c -[DVTAssertionHandler handleFailureInMethod:object:fileName:lineNumber:messageFormat:arguments:] (in DVTFoundation)
  597. 1 0x000000010b0672a5 _DVTAssertionFailureHandler (in DVTFoundation)
  598. 2 0x000000010afea694 +[DVTFilePath _filePathForParent:fileSystemRepresentation:length:allowCreation:] (in DVTFoundation)
  599. 3 0x000000010afea372 +[DVTFilePath _filePathForParent:pathString:] (in DVTFoundation)
  600. 4 0x000000010b01e16b -[DVTSearchPath pathForFileWithRelativePathString:] (in DVTFoundation)
  601. 5 0x000000010b844a5b -[Xcode3CommandLineBuildTool _printPathToExecutableAndExit] (in Xcode3Core)
  602. 6 0x000000010b846bd4 -[Xcode3CommandLineBuildTool run] (in Xcode3Core)
  603. 7 0x000000010afdeb46 (in xcodebuild)
  604. 8 0x000000010afde91c (in xcodebuild)
  605. xcrun: error: /Applications/Xcode.app/Contents/Developer/usr/bin/xcodebuild failed with exit code 6
  606.  
  607.  
  608. Compiling the CXX compiler identification source file "CMakeCXXCompilerId.cpp" failed.
  609. Compiler: /opt/local/bin/clang++-mp-13
  610. Build flags:
  611. Id flags: --ec++
  612.  
  613. The output was:
  614. 69
  615. 2022-07-16 03:38:49.002 xcodebuild[14814:1207] [MT] DVTAssertions: ASSERTION FAILURE in /SourceCache/DVTFoundation/DVTFoundation-1828/Framework/Classes/FilePaths/DVTFilePath.m:379
  616. Details: fsrep is absolute (starts with /) ('/opt/local/libexec/llvm-13/bin/clang++') parentPath must be nil but it is not ('<DVTFilePath:0x400129ac0:'/Applications/Xcode.app/Contents/Developer/Toolchains/XcodeDefault.xctoolchain/usr/bin'>')
  617. Object: <DVTFilePath>
  618. Method: +_filePathForParent:fileSystemRepresentation:length:allowCreation:
  619. Thread: <NSThread: 0x40030a1e0>{name = (null), num = 1}
  620. Hints: None
  621. Backtrace:
  622. 0 0x000000010e49c44c -[DVTAssertionHandler handleFailureInMethod:object:fileName:lineNumber:messageFormat:arguments:] (in DVTFoundation)
  623. 1 0x000000010e49c2a5 _DVTAssertionFailureHandler (in DVTFoundation)
  624. 2 0x000000010e41f694 +[DVTFilePath _filePathForParent:fileSystemRepresentation:length:allowCreation:] (in DVTFoundation)
  625. 3 0x000000010e41f372 +[DVTFilePath _filePathForParent:pathString:] (in DVTFoundation)
  626. 4 0x000000010e45316b -[DVTSearchPath pathForFileWithRelativePathString:] (in DVTFoundation)
  627. 5 0x000000010ec7ca5b -[Xcode3CommandLineBuildTool _printPathToExecutableAndExit] (in Xcode3Core)
  628. 6 0x000000010ec7ebd4 -[Xcode3CommandLineBuildTool run] (in Xcode3Core)
  629. 7 0x000000010e414b46 (in xcodebuild)
  630. 8 0x000000010e41491c (in xcodebuild)
  631. xcrun: error: /Applications/Xcode.app/Contents/Developer/usr/bin/xcodebuild failed with exit code 6
  632.  
  633.  
  634. Compiling the CXX compiler identification source file "CMakeCXXCompilerId.cpp" failed.
  635. Compiler: /opt/local/bin/clang++-mp-13
  636. Build flags:
  637. Id flags: --target=arm-arm-none-eabi;-mcpu=cortex-m3
  638.  
  639. The output was:
  640. 69
  641. 2022-07-16 03:38:54.012 xcodebuild[14816:1207] [MT] DVTAssertions: ASSERTION FAILURE in /SourceCache/DVTFoundation/DVTFoundation-1828/Framework/Classes/FilePaths/DVTFilePath.m:379
  642. Details: fsrep is absolute (starts with /) ('/opt/local/libexec/llvm-13/bin/clang++') parentPath must be nil but it is not ('<DVTFilePath:0x400129ac0:'/Applications/Xcode.app/Contents/Developer/Toolchains/XcodeDefault.xctoolchain/usr/bin'>')
  643. Object: <DVTFilePath>
  644. Method: +_filePathForParent:fileSystemRepresentation:length:allowCreation:
  645. Thread: <NSThread: 0x40030a1e0>{name = (null), num = 1}
  646. Hints: None
  647. Backtrace:
  648. 0 0x000000010fe8a44c -[DVTAssertionHandler handleFailureInMethod:object:fileName:lineNumber:messageFormat:arguments:] (in DVTFoundation)
  649. 1 0x000000010fe8a2a5 _DVTAssertionFailureHandler (in DVTFoundation)
  650. 2 0x000000010fe0d694 +[DVTFilePath _filePathForParent:fileSystemRepresentation:length:allowCreation:] (in DVTFoundation)
  651. 3 0x000000010fe0d372 +[DVTFilePath _filePathForParent:pathString:] (in DVTFoundation)
  652. 4 0x000000010fe4116b -[DVTSearchPath pathForFileWithRelativePathString:] (in DVTFoundation)
  653. 5 0x0000000110670a5b -[Xcode3CommandLineBuildTool _printPathToExecutableAndExit] (in Xcode3Core)
  654. 6 0x0000000110672bd4 -[Xcode3CommandLineBuildTool run] (in Xcode3Core)
  655. 7 0x000000010fe00b46 (in xcodebuild)
  656. 8 0x000000010fe0091c (in xcodebuild)
  657. xcrun: error: /Applications/Xcode.app/Contents/Developer/usr/bin/xcodebuild failed with exit code 6
  658.  
  659.  
  660. Compiling the CXX compiler identification source file "CMakeCXXCompilerId.cpp" failed.
  661. Compiler: /opt/local/bin/clang++-mp-13
  662. Build flags:
  663. Id flags: -c;-I__does_not_exist__
  664.  
  665. The output was:
  666. 69
  667. 2022-07-16 03:39:00.002 xcodebuild[14820:1207] [MT] DVTAssertions: ASSERTION FAILURE in /SourceCache/DVTFoundation/DVTFoundation-1828/Framework/Classes/FilePaths/DVTFilePath.m:379
  668. Details: fsrep is absolute (starts with /) ('/opt/local/libexec/llvm-13/bin/clang++') parentPath must be nil but it is not ('<DVTFilePath:0x400129ac0:'/Applications/Xcode.app/Contents/Developer/Toolchains/XcodeDefault.xctoolchain/usr/bin'>')
  669. Object: <DVTFilePath>
  670. Method: +_filePathForParent:fileSystemRepresentation:length:allowCreation:
  671. Thread: <NSThread: 0x40030a1e0>{name = (null), num = 1}
  672. Hints: None
  673. Backtrace:
  674. 0 0x000000010a5d244c -[DVTAssertionHandler handleFailureInMethod:object:fileName:lineNumber:messageFormat:arguments:] (in DVTFoundation)
  675. 1 0x000000010a5d22a5 _DVTAssertionFailureHandler (in DVTFoundation)
  676. 2 0x000000010a555694 +[DVTFilePath _filePathForParent:fileSystemRepresentation:length:allowCreation:] (in DVTFoundation)
  677. 3 0x000000010a555372 +[DVTFilePath _filePathForParent:pathString:] (in DVTFoundation)
  678. 4 0x000000010a58916b -[DVTSearchPath pathForFileWithRelativePathString:] (in DVTFoundation)
  679. 5 0x000000010adb0a5b -[Xcode3CommandLineBuildTool _printPathToExecutableAndExit] (in Xcode3Core)
  680. 6 0x000000010adb2bd4 -[Xcode3CommandLineBuildTool run] (in Xcode3Core)
  681. 7 0x000000010a547b46 (in xcodebuild)
  682. 8 0x000000010a54791c (in xcodebuild)
  683. xcrun: error: /Applications/Xcode.app/Contents/Developer/usr/bin/xcodebuild failed with exit code 6
  684.  
  685.  
  686. Checking whether the CXX compiler is IAR using "" did not match "IAR .+ Compiler":
  687. 2022-07-16 03:39:04.744 xcodebuild[14822:1207] [MT] DVTAssertions: ASSERTION FAILURE in /SourceCache/DVTFoundation/DVTFoundation-1828/Framework/Classes/FilePaths/DVTFilePath.m:379
  688. Details: fsrep is absolute (starts with /) ('/opt/local/libexec/llvm-13/bin/clang++') parentPath must be nil but it is not ('<DVTFilePath:0x400129d40:'/Applications/Xcode.app/Contents/Developer/Toolchains/XcodeDefault.xctoolchain/usr/bin'>')
  689. Object: <DVTFilePath>
  690. Method: +_filePathForParent:fileSystemRepresentation:length:allowCreation:
  691. Thread: <NSThread: 0x40030a1e0>{name = (null), num = 1}
  692. Hints: None
  693. Backtrace:
  694. 0 0x00000001063e244c -[DVTAssertionHandler handleFailureInMethod:object:fileName:lineNumber:messageFormat:arguments:] (in DVTFoundation)
  695. 1 0x00000001063e22a5 _DVTAssertionFailureHandler (in DVTFoundation)
  696. 2 0x0000000106365694 +[DVTFilePath _filePathForParent:fileSystemRepresentation:length:allowCreation:] (in DVTFoundation)
  697. 3 0x0000000106365372 +[DVTFilePath _filePathForParent:pathString:] (in DVTFoundation)
  698. 4 0x000000010639916b -[DVTSearchPath pathForFileWithRelativePathString:] (in DVTFoundation)
  699. 5 0x0000000106bc1a5b -[Xcode3CommandLineBuildTool _printPathToExecutableAndExit] (in Xcode3Core)
  700. 6 0x0000000106bc3bd4 -[Xcode3CommandLineBuildTool run] (in Xcode3Core)
  701. 7 0x0000000106356b46 (in xcodebuild)
  702. 8 0x000000010635691c (in xcodebuild)
  703. 9 0x0000000000000005
  704. xcrun: error: /Applications/Xcode.app/Contents/Developer/usr/bin/xcodebuild failed with exit code 6
  705. Checking whether the CXX compiler is IAR using "" did not match "IAR .+ Compiler":
  706. 2022-07-16 03:39:10.002 xcodebuild[14825:1207] [MT] DVTAssertions: ASSERTION FAILURE in /SourceCache/DVTFoundation/DVTFoundation-1828/Framework/Classes/FilePaths/DVTFilePath.m:379
  707. Details: fsrep is absolute (starts with /) ('/opt/local/libexec/llvm-13/bin/clang++') parentPath must be nil but it is not ('<DVTFilePath:0x400129d40:'/Applications/Xcode.app/Contents/Developer/Toolchains/XcodeDefault.xctoolchain/usr/bin'>')
  708. Object: <DVTFilePath>
  709. Method: +_filePathForParent:fileSystemRepresentation:length:allowCreation:
  710. Thread: <NSThread: 0x40030a1e0>{name = (null), num = 1}
  711. Hints: None
  712. Backtrace:
  713. 0 0x000000010653544c -[DVTAssertionHandler handleFailureInMethod:object:fileName:lineNumber:messageFormat:arguments:] (in DVTFoundation)
  714. 1 0x00000001065352a5 _DVTAssertionFailureHandler (in DVTFoundation)
  715. 2 0x00000001064b8694 +[DVTFilePath _filePathForParent:fileSystemRepresentation:length:allowCreation:] (in DVTFoundation)
  716. 3 0x00000001064b8372 +[DVTFilePath _filePathForParent:pathString:] (in DVTFoundation)
  717. 4 0x00000001064ec16b -[DVTSearchPath pathForFileWithRelativePathString:] (in DVTFoundation)
  718. 5 0x0000000106d14a5b -[Xcode3CommandLineBuildTool _printPathToExecutableAndExit] (in Xcode3Core)
  719. 6 0x0000000106d16bd4 -[Xcode3CommandLineBuildTool run] (in Xcode3Core)
  720. 7 0x00000001064acb46 (in xcodebuild)
  721. 8 0x00000001064ac91c (in xcodebuild)
  722. 9 0x0000000000000005
  723. xcrun: error: /Applications/Xcode.app/Contents/Developer/usr/bin/xcodebuild failed with exit code 6
  724. Detecting C compiler ABI info failed to compile with the following output:
  725. Change Dir: /opt/local/var/macports/build/_opt_local_var_macports_sources_rsync.macports.org_macports_release_tarballs_ports_textproc_doxygen/doxygen/work/doxygen-1.9.3/CMakeFiles/CMakeTmp
  726.  
  727. Run Build Command(s):/usr/bin/make -f Makefile cmTC_aa935/fast && /usr/bin/make -f CMakeFiles/cmTC_aa935.dir/build.make CMakeFiles/cmTC_aa935.dir/build
  728. Building C object CMakeFiles/cmTC_aa935.dir/CMakeCCompilerABI.c.o
  729. /opt/local/bin/clang-mp-13 -pipe -Os -DNDEBUG -isystem/opt/local/include/LegacySupport -I/opt/local/include -arch x86_64 -o CMakeFiles/cmTC_aa935.dir/CMakeCCompilerABI.c.o -c /opt/local/share/cmake-3.23/Modules/CMakeCCompilerABI.c
  730. 2022-07-16 03:39:15.121 xcodebuild[14834:1207] [MT] DVTAssertions: ASSERTION FAILURE in /SourceCache/DVTFoundation/DVTFoundation-1828/Framework/Classes/FilePaths/DVTFilePath.m:379
  731. Details: fsrep is absolute (starts with /) ('/opt/local/libexec/llvm-13/bin/clang') parentPath must be nil but it is not ('<DVTFilePath:0x400129d40:'/Applications/Xcode.app/Contents/Developer/Toolchains/XcodeDefault.xctoolchain/usr/bin'>')
  732. Object: <DVTFilePath>
  733. Method: +_filePathForParent:fileSystemRepresentation:length:allowCreation:
  734. Thread: <NSThread: 0x40030a1e0>{name = (null), num = 1}
  735. Hints: None
  736. Backtrace:
  737. 0 0x0000000105a4b44c -[DVTAssertionHandler handleFailureInMethod:object:fileName:lineNumber:messageFormat:arguments:] (in DVTFoundation)
  738. 1 0x0000000105a4b2a5 _DVTAssertionFailureHandler (in DVTFoundation)
  739. 2 0x00000001059ce694 +[DVTFilePath _filePathForParent:fileSystemRepresentation:length:allowCreation:] (in DVTFoundation)
  740. 3 0x00000001059ce372 +[DVTFilePath _filePathForParent:pathString:] (in DVTFoundation)
  741. 4 0x0000000105a0216b -[DVTSearchPath pathForFileWithRelativePathString:] (in DVTFoundation)
  742. 5 0x000000010622da5b -[Xcode3CommandLineBuildTool _printPathToExecutableAndExit] (in Xcode3Core)
  743. 6 0x000000010622fbd4 -[Xcode3CommandLineBuildTool run] (in Xcode3Core)
  744. 7 0x00000001059c0b46 (in xcodebuild)
  745. 8 0x00000001059c091c (in xcodebuild)
  746. xcrun: error: /Applications/Xcode.app/Contents/Developer/usr/bin/xcodebuild failed with exit code 6
  747. make[1]: *** [CMakeFiles/cmTC_aa935.dir/CMakeCCompilerABI.c.o] Error 69
  748. make: *** [cmTC_aa935/fast] Error 2
  749.  
  750.  
  751.  
  752.  
  753. Determining if the C compiler works failed with the following output:
  754. Change Dir: /opt/local/var/macports/build/_opt_local_var_macports_sources_rsync.macports.org_macports_release_tarballs_ports_textproc_doxygen/doxygen/work/doxygen-1.9.3/CMakeFiles/CMakeTmp
  755.  
  756. Run Build Command(s):/usr/bin/make -f Makefile cmTC_ec3b8/fast && /usr/bin/make -f CMakeFiles/cmTC_ec3b8.dir/build.make CMakeFiles/cmTC_ec3b8.dir/build
  757. Building C object CMakeFiles/cmTC_ec3b8.dir/testCCompiler.c.o
  758. /opt/local/bin/clang-mp-13 -pipe -Os -DNDEBUG -isystem/opt/local/include/LegacySupport -I/opt/local/include -arch x86_64 -o CMakeFiles/cmTC_ec3b8.dir/testCCompiler.c.o -c /opt/local/var/macports/build/_opt_local_var_macports_sources_rsync.macports.org_macports_release_tarballs_ports_textproc_doxygen/doxygen/work/doxygen-1.9.3/CMakeFiles/CMakeTmp/testCCompiler.c
  759. 2022-07-16 03:39:21.002 xcodebuild[14843:1207] [MT] DVTAssertions: ASSERTION FAILURE in /SourceCache/DVTFoundation/DVTFoundation-1828/Framework/Classes/FilePaths/DVTFilePath.m:379
  760. Details: fsrep is absolute (starts with /) ('/opt/local/libexec/llvm-13/bin/clang') parentPath must be nil but it is not ('<DVTFilePath:0x400129c00:'/Applications/Xcode.app/Contents/Developer/Toolchains/XcodeDefault.xctoolchain/usr/bin'>')
  761. Object: <DVTFilePath>
  762. Method: +_filePathForParent:fileSystemRepresentation:length:allowCreation:
  763. Thread: <NSThread: 0x40030a1e0>{name = (null), num = 1}
  764. Hints: None
  765. Backtrace:
  766. 0 0x000000010db3344c -[DVTAssertionHandler handleFailureInMethod:object:fileName:lineNumber:messageFormat:arguments:] (in DVTFoundation)
  767. 1 0x000000010db332a5 _DVTAssertionFailureHandler (in DVTFoundation)
  768. 2 0x000000010dab6694 +[DVTFilePath _filePathForParent:fileSystemRepresentation:length:allowCreation:] (in DVTFoundation)
  769. 3 0x000000010dab6372 +[DVTFilePath _filePathForParent:pathString:] (in DVTFoundation)
  770. 4 0x000000010daea16b -[DVTSearchPath pathForFileWithRelativePathString:] (in DVTFoundation)
  771. 5 0x000000010e30ea5b -[Xcode3CommandLineBuildTool _printPathToExecutableAndExit] (in Xcode3Core)
  772. 6 0x000000010e310bd4 -[Xcode3CommandLineBuildTool run] (in Xcode3Core)
  773. 7 0x000000010daa5b46 (in xcodebuild)
  774. 8 0x000000010daa591c (in xcodebuild)
  775. 9 0x0000000000000005
  776. xcrun: error: /Applications/Xcode.app/Contents/Developer/usr/bin/xcodebuild failed with exit code 6
  777. make[1]: *** [CMakeFiles/cmTC_ec3b8.dir/testCCompiler.c.o] Error 69
  778. make: *** [cmTC_ec3b8/fast] Error 2
  779.  
  780.  
  781.  
Advertisement
Add Comment
Please, Sign In to add comment