Pastebin
API
tools
faq
paste
Login
Sign up
Please fix the following errors:
New Paste
Syntax Highlighting
Error: Failed to configure doxygen: consult /opt/local/var/macports/build/_opt_local_var_macports_sources_rsync.macports.org_macports_release_tarballs_ports_textproc_doxygen/doxygen/work/doxygen-1.9.3/CMakeFiles/CMakeError.log Error: Failed to configure doxygen: configure failure: command execution failed Error: See /opt/local/var/macports/logs/_opt_local_var_macports_sources_rsync.macports.org_macports_release_tarballs_ports_textproc_doxygen/doxygen/main.log for details. Error: Follow https://guide.macports.org/#project.tickets if you believe there is a bug. Compiling the C compiler identification source file "CMakeCCompilerId.c" failed. Compiler: /opt/local/bin/clang-mp-13 Build flags: -pipe;-Os;-DNDEBUG;-isystem/opt/local/include/LegacySupport;-I/opt/local/include Id flags: The output was: 69 2022-07-16 03:36:48.027 xcodebuild[14745:1207] [MT] DVTAssertions: ASSERTION FAILURE in /SourceCache/DVTFoundation/DVTFoundation-1828/Framework/Classes/FilePaths/DVTFilePath.m:379 Details: fsrep is absolute (starts with /) ('/opt/local/libexec/llvm-13/bin/clang') parentPath must be nil but it is not ('<DVTFilePath:0x400129ac0:'/Applications/Xcode.app/Contents/Developer/Toolchains/XcodeDefault.xctoolchain/usr/bin'>') Object: <DVTFilePath> Method: +_filePathForParent:fileSystemRepresentation:length:allowCreation: Thread: <NSThread: 0x40030a1e0>{name = (null), num = 1} Hints: None Backtrace: 0 0x0000000107afb44c -[DVTAssertionHandler handleFailureInMethod:object:fileName:lineNumber:messageFormat:arguments:] (in DVTFoundation) 1 0x0000000107afb2a5 _DVTAssertionFailureHandler (in DVTFoundation) 2 0x0000000107a7e694 +[DVTFilePath _filePathForParent:fileSystemRepresentation:length:allowCreation:] (in DVTFoundation) 3 0x0000000107a7e372 +[DVTFilePath _filePathForParent:pathString:] (in DVTFoundation) 4 0x0000000107ab216b -[DVTSearchPath pathForFileWithRelativePathString:] (in DVTFoundation) 5 0x00000001082dea5b -[Xcode3CommandLineBuildTool _printPathToExecutableAndExit] (in Xcode3Core) 6 0x00000001082e0bd4 -[Xcode3CommandLineBuildTool run] (in Xcode3Core) 7 0x0000000107a70b46 (in xcodebuild) 8 0x0000000107a7091c (in xcodebuild) 9 0x0000000000000005 xcrun: error: /Applications/Xcode.app/Contents/Developer/usr/bin/xcodebuild failed with exit code 6 Compiling the C compiler identification source file "CMakeCCompilerId.c" failed. Compiler: /opt/local/bin/clang-mp-13 Build flags: -pipe;-Os;-DNDEBUG;-isystem/opt/local/include/LegacySupport;-I/opt/local/include Id flags: -c The output was: 69 2022-07-16 03:36:53.002 xcodebuild[14752:1207] [MT] DVTAssertions: ASSERTION FAILURE in /SourceCache/DVTFoundation/DVTFoundation-1828/Framework/Classes/FilePaths/DVTFilePath.m:379 Details: fsrep is absolute (starts with /) ('/opt/local/libexec/llvm-13/bin/clang') parentPath must be nil but it is not ('<DVTFilePath:0x400129ac0:'/Applications/Xcode.app/Contents/Developer/Toolchains/XcodeDefault.xctoolchain/usr/bin'>') Object: <DVTFilePath> Method: +_filePathForParent:fileSystemRepresentation:length:allowCreation: Thread: <NSThread: 0x40030a1e0>{name = (null), num = 1} Hints: None Backtrace: 0 0x0000000101ec744c -[DVTAssertionHandler handleFailureInMethod:object:fileName:lineNumber:messageFormat:arguments:] (in DVTFoundation) 1 0x0000000101ec72a5 _DVTAssertionFailureHandler (in DVTFoundation) 2 0x0000000101e4a694 +[DVTFilePath _filePathForParent:fileSystemRepresentation:length:allowCreation:] (in DVTFoundation) 3 0x0000000101e4a372 +[DVTFilePath _filePathForParent:pathString:] (in DVTFoundation) 4 0x0000000101e7e16b -[DVTSearchPath pathForFileWithRelativePathString:] (in DVTFoundation) 5 0x00000001026a5a5b -[Xcode3CommandLineBuildTool _printPathToExecutableAndExit] (in Xcode3Core) 6 0x00000001026a7bd4 -[Xcode3CommandLineBuildTool run] (in Xcode3Core) 7 0x0000000101e3fb46 (in xcodebuild) 8 0x0000000101e3f91c (in xcodebuild) 9 0x0000000000000005 xcrun: error: /Applications/Xcode.app/Contents/Developer/usr/bin/xcodebuild failed with exit code 6 Compiling the C compiler identification source file "CMakeCCompilerId.c" failed. Compiler: /opt/local/bin/clang-mp-13 Build flags: -pipe;-Os;-DNDEBUG;-isystem/opt/local/include/LegacySupport;-I/opt/local/include Id flags: -Aa The output was: 69 2022-07-16 03:36:58.320 xcodebuild[14754:1207] [MT] DVTAssertions: ASSERTION FAILURE in /SourceCache/DVTFoundation/DVTFoundation-1828/Framework/Classes/FilePaths/DVTFilePath.m:379 Details: fsrep is absolute (starts with /) ('/opt/local/libexec/llvm-13/bin/clang') parentPath must be nil but it is not ('<DVTFilePath:0x400129ac0:'/Applications/Xcode.app/Contents/Developer/Toolchains/XcodeDefault.xctoolchain/usr/bin'>') Object: <DVTFilePath> Method: +_filePathForParent:fileSystemRepresentation:length:allowCreation: Thread: <NSThread: 0x40030a1e0>{name = (null), num = 1} Hints: None Backtrace: 0 0x000000010682044c -[DVTAssertionHandler handleFailureInMethod:object:fileName:lineNumber:messageFormat:arguments:] (in DVTFoundation) 1 0x00000001068202a5 _DVTAssertionFailureHandler (in DVTFoundation) 2 0x00000001067a3694 +[DVTFilePath _filePathForParent:fileSystemRepresentation:length:allowCreation:] (in DVTFoundation) 3 0x00000001067a3372 +[DVTFilePath _filePathForParent:pathString:] (in DVTFoundation) 4 0x00000001067d716b -[DVTSearchPath pathForFileWithRelativePathString:] (in DVTFoundation) 5 0x0000000106ffca5b -[Xcode3CommandLineBuildTool _printPathToExecutableAndExit] (in Xcode3Core) 6 0x0000000106ffebd4 -[Xcode3CommandLineBuildTool run] (in Xcode3Core) 7 0x0000000106794b46 (in xcodebuild) 8 0x000000010679491c (in xcodebuild) 9 0x0000000000000005 xcrun: error: /Applications/Xcode.app/Contents/Developer/usr/bin/xcodebuild failed with exit code 6 Compiling the C compiler identification source file "CMakeCCompilerId.c" failed. Compiler: /opt/local/bin/clang-mp-13 Build flags: -pipe;-Os;-DNDEBUG;-isystem/opt/local/include/LegacySupport;-I/opt/local/include Id flags: -D__CLASSIC_C__ The output was: 69 2022-07-16 03:37:04.003 xcodebuild[14757:1207] [MT] DVTAssertions: ASSERTION FAILURE in /SourceCache/DVTFoundation/DVTFoundation-1828/Framework/Classes/FilePaths/DVTFilePath.m:379 Details: fsrep is absolute (starts with /) ('/opt/local/libexec/llvm-13/bin/clang') parentPath must be nil but it is not ('<DVTFilePath:0x400129c00:'/Applications/Xcode.app/Contents/Developer/Toolchains/XcodeDefault.xctoolchain/usr/bin'>') Object: <DVTFilePath> Method: +_filePathForParent:fileSystemRepresentation:length:allowCreation: Thread: <NSThread: 0x40030a1e0>{name = (null), num = 1} Hints: None Backtrace: 0 0x000000010fcb044c -[DVTAssertionHandler handleFailureInMethod:object:fileName:lineNumber:messageFormat:arguments:] (in DVTFoundation) 1 0x000000010fcb02a5 _DVTAssertionFailureHandler (in DVTFoundation) 2 0x000000010fc33694 +[DVTFilePath _filePathForParent:fileSystemRepresentation:length:allowCreation:] (in DVTFoundation) 3 0x000000010fc33372 +[DVTFilePath _filePathForParent:pathString:] (in DVTFoundation) 4 0x000000010fc6716b -[DVTSearchPath pathForFileWithRelativePathString:] (in DVTFoundation) 5 0x000000011048ca5b -[Xcode3CommandLineBuildTool _printPathToExecutableAndExit] (in Xcode3Core) 6 0x000000011048ebd4 -[Xcode3CommandLineBuildTool run] (in Xcode3Core) 7 0x000000010fc28b46 (in xcodebuild) 8 0x000000010fc2891c (in xcodebuild) 9 0x0000000000000005 xcrun: error: /Applications/Xcode.app/Contents/Developer/usr/bin/xcodebuild failed with exit code 6 Compiling the C compiler identification source file "CMakeCCompilerId.c" failed. Compiler: /opt/local/bin/clang-mp-13 Build flags: -pipe;-Os;-DNDEBUG;-isystem/opt/local/include/LegacySupport;-I/opt/local/include Id flags: --target=arm-arm-none-eabi;-mcpu=cortex-m3 The output was: 69 2022-07-16 03:37:08.600 xcodebuild[14759:1207] [MT] DVTAssertions: ASSERTION FAILURE in /SourceCache/DVTFoundation/DVTFoundation-1828/Framework/Classes/FilePaths/DVTFilePath.m:379 Details: fsrep is absolute (starts with /) ('/opt/local/libexec/llvm-13/bin/clang') parentPath must be nil but it is not ('<DVTFilePath:0x400129ac0:'/Applications/Xcode.app/Contents/Developer/Toolchains/XcodeDefault.xctoolchain/usr/bin'>') Object: <DVTFilePath> Method: +_filePathForParent:fileSystemRepresentation:length:allowCreation: Thread: <NSThread: 0x40030a1e0>{name = (null), num = 1} Hints: None Backtrace: 0 0x0000000100f1244c -[DVTAssertionHandler handleFailureInMethod:object:fileName:lineNumber:messageFormat:arguments:] (in DVTFoundation) 1 0x0000000100f122a5 _DVTAssertionFailureHandler (in DVTFoundation) 2 0x0000000100e95694 +[DVTFilePath _filePathForParent:fileSystemRepresentation:length:allowCreation:] (in DVTFoundation) 3 0x0000000100e95372 +[DVTFilePath _filePathForParent:pathString:] (in DVTFoundation) 4 0x0000000100ec916b -[DVTSearchPath pathForFileWithRelativePathString:] (in DVTFoundation) 5 0x00000001016f3a5b -[Xcode3CommandLineBuildTool _printPathToExecutableAndExit] (in Xcode3Core) 6 0x00000001016f5bd4 -[Xcode3CommandLineBuildTool run] (in Xcode3Core) 7 0x0000000100e88b46 (in xcodebuild) 8 0x0000000100e8891c (in xcodebuild) 9 0x0000000000000005 xcrun: error: /Applications/Xcode.app/Contents/Developer/usr/bin/xcodebuild failed with exit code 6 Compiling the C compiler identification source file "CMakeCCompilerId.c" failed. Compiler: /opt/local/bin/clang-mp-13 Build flags: -pipe;-Os;-DNDEBUG;-isystem/opt/local/include/LegacySupport;-I/opt/local/include Id flags: -c;-I__does_not_exist__ The output was: 69 2022-07-16 03:37:14.003 xcodebuild[14762:1207] [MT] DVTAssertions: ASSERTION FAILURE in /SourceCache/DVTFoundation/DVTFoundation-1828/Framework/Classes/FilePaths/DVTFilePath.m:379 Details: fsrep is absolute (starts with /) ('/opt/local/libexec/llvm-13/bin/clang') parentPath must be nil but it is not ('<DVTFilePath:0x400129ac0:'/Applications/Xcode.app/Contents/Developer/Toolchains/XcodeDefault.xctoolchain/usr/bin'>') Object: <DVTFilePath> Method: +_filePathForParent:fileSystemRepresentation:length:allowCreation: Thread: <NSThread: 0x40030a1e0>{name = (null), num = 1} Hints: None Backtrace: 0 0x000000010975d44c -[DVTAssertionHandler handleFailureInMethod:object:fileName:lineNumber:messageFormat:arguments:] (in DVTFoundation) 1 0x000000010975d2a5 _DVTAssertionFailureHandler (in DVTFoundation) 2 0x00000001096e0694 +[DVTFilePath _filePathForParent:fileSystemRepresentation:length:allowCreation:] (in DVTFoundation) 3 0x00000001096e0372 +[DVTFilePath _filePathForParent:pathString:] (in DVTFoundation) 4 0x000000010971416b -[DVTSearchPath pathForFileWithRelativePathString:] (in DVTFoundation) 5 0x0000000109f42a5b -[Xcode3CommandLineBuildTool _printPathToExecutableAndExit] (in Xcode3Core) 6 0x0000000109f44bd4 -[Xcode3CommandLineBuildTool run] (in Xcode3Core) 7 0x00000001096d1b46 (in xcodebuild) 8 0x00000001096d191c (in xcodebuild) 9 0x0000000000000005 xcrun: error: /Applications/Xcode.app/Contents/Developer/usr/bin/xcodebuild failed with exit code 6 Compiling the C compiler identification source file "CMakeCCompilerId.c" failed. Compiler: /opt/local/bin/clang-mp-13 Build flags: Id flags: The output was: 69 2022-07-16 03:37:19.085 xcodebuild[14765:1207] [MT] DVTAssertions: ASSERTION FAILURE in /SourceCache/DVTFoundation/DVTFoundation-1828/Framework/Classes/FilePaths/DVTFilePath.m:379 Details: fsrep is absolute (starts with /) ('/opt/local/libexec/llvm-13/bin/clang') parentPath must be nil but it is not ('<DVTFilePath:0x400129840:'/Applications/Xcode.app/Contents/Developer/Toolchains/XcodeDefault.xctoolchain/usr/bin'>') Object: <DVTFilePath> Method: +_filePathForParent:fileSystemRepresentation:length:allowCreation: Thread: <NSThread: 0x40030a1e0>{name = (null), num = 1} Hints: None Backtrace: 0 0x000000010e03544c -[DVTAssertionHandler handleFailureInMethod:object:fileName:lineNumber:messageFormat:arguments:] (in DVTFoundation) 1 0x000000010e0352a5 _DVTAssertionFailureHandler (in DVTFoundation) 2 0x000000010dfb8694 +[DVTFilePath _filePathForParent:fileSystemRepresentation:length:allowCreation:] (in DVTFoundation) 3 0x000000010dfb8372 +[DVTFilePath _filePathForParent:pathString:] (in DVTFoundation) 4 0x000000010dfec16b -[DVTSearchPath pathForFileWithRelativePathString:] (in DVTFoundation) 5 0x000000010e819a5b -[Xcode3CommandLineBuildTool _printPathToExecutableAndExit] (in Xcode3Core) 6 0x000000010e81bbd4 -[Xcode3CommandLineBuildTool run] (in Xcode3Core) 7 0x000000010dfacb46 (in xcodebuild) 8 0x000000010dfac91c (in xcodebuild) 9 0x0000000000000005 xcrun: error: /Applications/Xcode.app/Contents/Developer/usr/bin/xcodebuild failed with exit code 6 Compiling the C compiler identification source file "CMakeCCompilerId.c" failed. Compiler: /opt/local/bin/clang-mp-13 Build flags: Id flags: -c The output was: 69 2022-07-16 03:37:25.003 xcodebuild[14768:1207] [MT] DVTAssertions: ASSERTION FAILURE in /SourceCache/DVTFoundation/DVTFoundation-1828/Framework/Classes/FilePaths/DVTFilePath.m:379 Details: fsrep is absolute (starts with /) ('/opt/local/libexec/llvm-13/bin/clang') parentPath must be nil but it is not ('<DVTFilePath:0x400129ac0:'/Applications/Xcode.app/Contents/Developer/Toolchains/XcodeDefault.xctoolchain/usr/bin'>') Object: <DVTFilePath> Method: +_filePathForParent:fileSystemRepresentation:length:allowCreation: Thread: <NSThread: 0x40030a1e0>{name = (null), num = 1} Hints: None Backtrace: 0 0x000000010492444c -[DVTAssertionHandler handleFailureInMethod:object:fileName:lineNumber:messageFormat:arguments:] (in DVTFoundation) 1 0x00000001049242a5 _DVTAssertionFailureHandler (in DVTFoundation) 2 0x00000001048a7694 +[DVTFilePath _filePathForParent:fileSystemRepresentation:length:allowCreation:] (in DVTFoundation) 3 0x00000001048a7372 +[DVTFilePath _filePathForParent:pathString:] (in DVTFoundation) 4 0x00000001048db16b -[DVTSearchPath pathForFileWithRelativePathString:] (in DVTFoundation) 5 0x0000000105109a5b -[Xcode3CommandLineBuildTool _printPathToExecutableAndExit] (in Xcode3Core) 6 0x000000010510bbd4 -[Xcode3CommandLineBuildTool run] (in Xcode3Core) 7 0x0000000104897b46 (in xcodebuild) 8 0x000000010489791c (in xcodebuild) 9 0x0000000000000005 xcrun: error: /Applications/Xcode.app/Contents/Developer/usr/bin/xcodebuild failed with exit code 6 Compiling the C compiler identification source file "CMakeCCompilerId.c" failed. Compiler: /opt/local/bin/clang-mp-13 Build flags: Id flags: -Aa The output was: 69 2022-07-16 03:37:29.701 xcodebuild[14770:1207] [MT] DVTAssertions: ASSERTION FAILURE in /SourceCache/DVTFoundation/DVTFoundation-1828/Framework/Classes/FilePaths/DVTFilePath.m:379 Details: fsrep is absolute (starts with /) ('/opt/local/libexec/llvm-13/bin/clang') parentPath must be nil but it is not ('<DVTFilePath:0x400129ac0:'/Applications/Xcode.app/Contents/Developer/Toolchains/XcodeDefault.xctoolchain/usr/bin'>') Object: <DVTFilePath> Method: +_filePathForParent:fileSystemRepresentation:length:allowCreation: Thread: <NSThread: 0x40030a1e0>{name = (null), num = 1} Hints: None Backtrace: 0 0x000000010515144c -[DVTAssertionHandler handleFailureInMethod:object:fileName:lineNumber:messageFormat:arguments:] (in DVTFoundation) 1 0x00000001051512a5 _DVTAssertionFailureHandler (in DVTFoundation) 2 0x00000001050d4694 +[DVTFilePath _filePathForParent:fileSystemRepresentation:length:allowCreation:] (in DVTFoundation) 3 0x00000001050d4372 +[DVTFilePath _filePathForParent:pathString:] (in DVTFoundation) 4 0x000000010510816b -[DVTSearchPath pathForFileWithRelativePathString:] (in DVTFoundation) 5 0x0000000105930a5b -[Xcode3CommandLineBuildTool _printPathToExecutableAndExit] (in Xcode3Core) 6 0x0000000105932bd4 -[Xcode3CommandLineBuildTool run] (in Xcode3Core) 7 0x00000001050c5b46 (in xcodebuild) 8 0x00000001050c591c (in xcodebuild) 9 0x0000000000000005 xcrun: error: /Applications/Xcode.app/Contents/Developer/usr/bin/xcodebuild failed with exit code 6 Compiling the C compiler identification source file "CMakeCCompilerId.c" failed. Compiler: /opt/local/bin/clang-mp-13 Build flags: Id flags: -D__CLASSIC_C__ The output was: 69 2022-07-16 03:37:35.004 xcodebuild[14773:1207] [MT] DVTAssertions: ASSERTION FAILURE in /SourceCache/DVTFoundation/DVTFoundation-1828/Framework/Classes/FilePaths/DVTFilePath.m:379 Details: fsrep is absolute (starts with /) ('/opt/local/libexec/llvm-13/bin/clang') parentPath must be nil but it is not ('<DVTFilePath:0x400129ac0:'/Applications/Xcode.app/Contents/Developer/Toolchains/XcodeDefault.xctoolchain/usr/bin'>') Object: <DVTFilePath> Method: +_filePathForParent:fileSystemRepresentation:length:allowCreation: Thread: <NSThread: 0x40030a1e0>{name = (null), num = 1} Hints: None Backtrace: 0 0x0000000103d6f44c -[DVTAssertionHandler handleFailureInMethod:object:fileName:lineNumber:messageFormat:arguments:] (in DVTFoundation) 1 0x0000000103d6f2a5 _DVTAssertionFailureHandler (in DVTFoundation) 2 0x0000000103cf2694 +[DVTFilePath _filePathForParent:fileSystemRepresentation:length:allowCreation:] (in DVTFoundation) 3 0x0000000103cf2372 +[DVTFilePath _filePathForParent:pathString:] (in DVTFoundation) 4 0x0000000103d2616b -[DVTSearchPath pathForFileWithRelativePathString:] (in DVTFoundation) 5 0x000000010454ca5b -[Xcode3CommandLineBuildTool _printPathToExecutableAndExit] (in Xcode3Core) 6 0x000000010454ebd4 -[Xcode3CommandLineBuildTool run] (in Xcode3Core) 7 0x0000000103ce7b46 (in xcodebuild) 8 0x0000000103ce791c (in xcodebuild) 9 0x0000000000000005 xcrun: error: /Applications/Xcode.app/Contents/Developer/usr/bin/xcodebuild failed with exit code 6 Compiling the C compiler identification source file "CMakeCCompilerId.c" failed. Compiler: /opt/local/bin/clang-mp-13 Build flags: Id flags: --target=arm-arm-none-eabi;-mcpu=cortex-m3 The output was: 69 2022-07-16 03:37:40.303 xcodebuild[14775:1207] [MT] DVTAssertions: ASSERTION FAILURE in /SourceCache/DVTFoundation/DVTFoundation-1828/Framework/Classes/FilePaths/DVTFilePath.m:379 Details: fsrep is absolute (starts with /) ('/opt/local/libexec/llvm-13/bin/clang') parentPath must be nil but it is not ('<DVTFilePath:0x400129ac0:'/Applications/Xcode.app/Contents/Developer/Toolchains/XcodeDefault.xctoolchain/usr/bin'>') Object: <DVTFilePath> Method: +_filePathForParent:fileSystemRepresentation:length:allowCreation: Thread: <NSThread: 0x40030a1e0>{name = (null), num = 1} Hints: None Backtrace: 0 0x000000010eac244c -[DVTAssertionHandler handleFailureInMethod:object:fileName:lineNumber:messageFormat:arguments:] (in DVTFoundation) 1 0x000000010eac22a5 _DVTAssertionFailureHandler (in DVTFoundation) 2 0x000000010ea45694 +[DVTFilePath _filePathForParent:fileSystemRepresentation:length:allowCreation:] (in DVTFoundation) 3 0x000000010ea45372 +[DVTFilePath _filePathForParent:pathString:] (in DVTFoundation) 4 0x000000010ea7916b -[DVTSearchPath pathForFileWithRelativePathString:] (in DVTFoundation) 5 0x000000010f2a9a5b -[Xcode3CommandLineBuildTool _printPathToExecutableAndExit] (in Xcode3Core) 6 0x000000010f2abbd4 -[Xcode3CommandLineBuildTool run] (in Xcode3Core) 7 0x000000010ea37b46 (in xcodebuild) 8 0x000000010ea3791c (in xcodebuild) 9 0x0000000000000005 xcrun: error: /Applications/Xcode.app/Contents/Developer/usr/bin/xcodebuild failed with exit code 6 Compiling the C compiler identification source file "CMakeCCompilerId.c" failed. Compiler: /opt/local/bin/clang-mp-13 Build flags: Id flags: -c;-I__does_not_exist__ The output was: 69 2022-07-16 03:37:46.004 xcodebuild[14778:1207] [MT] DVTAssertions: ASSERTION FAILURE in /SourceCache/DVTFoundation/DVTFoundation-1828/Framework/Classes/FilePaths/DVTFilePath.m:379 Details: fsrep is absolute (starts with /) ('/opt/local/libexec/llvm-13/bin/clang') parentPath must be nil but it is not ('<DVTFilePath:0x400129ac0:'/Applications/Xcode.app/Contents/Developer/Toolchains/XcodeDefault.xctoolchain/usr/bin'>') Object: <DVTFilePath> Method: +_filePathForParent:fileSystemRepresentation:length:allowCreation: Thread: <NSThread: 0x40030a1e0>{name = (null), num = 1} Hints: None Backtrace: 0 0x000000010ca1544c -[DVTAssertionHandler handleFailureInMethod:object:fileName:lineNumber:messageFormat:arguments:] (in DVTFoundation) 1 0x000000010ca152a5 _DVTAssertionFailureHandler (in DVTFoundation) 2 0x000000010c998694 +[DVTFilePath _filePathForParent:fileSystemRepresentation:length:allowCreation:] (in DVTFoundation) 3 0x000000010c998372 +[DVTFilePath _filePathForParent:pathString:] (in DVTFoundation) 4 0x000000010c9cc16b -[DVTSearchPath pathForFileWithRelativePathString:] (in DVTFoundation) 5 0x000000010d1f6a5b -[Xcode3CommandLineBuildTool _printPathToExecutableAndExit] (in Xcode3Core) 6 0x000000010d1f8bd4 -[Xcode3CommandLineBuildTool run] (in Xcode3Core) 7 0x000000010c98db46 (in xcodebuild) 8 0x000000010c98d91c (in xcodebuild) 9 0x0000000000000005 xcrun: error: /Applications/Xcode.app/Contents/Developer/usr/bin/xcodebuild failed with exit code 6 Checking whether the C compiler is IAR using "" did not match "IAR .+ Compiler": 2022-07-16 03:37:50.908 xcodebuild[14780:1207] [MT] DVTAssertions: ASSERTION FAILURE in /SourceCache/DVTFoundation/DVTFoundation-1828/Framework/Classes/FilePaths/DVTFilePath.m:379 Details: fsrep is absolute (starts with /) ('/opt/local/libexec/llvm-13/bin/clang') parentPath must be nil but it is not ('<DVTFilePath:0x400129d40:'/Applications/Xcode.app/Contents/Developer/Toolchains/XcodeDefault.xctoolchain/usr/bin'>') Object: <DVTFilePath> Method: +_filePathForParent:fileSystemRepresentation:length:allowCreation: Thread: <NSThread: 0x40030a1e0>{name = (null), num = 1} Hints: None Backtrace: 0 0x000000010d17044c -[DVTAssertionHandler handleFailureInMethod:object:fileName:lineNumber:messageFormat:arguments:] (in DVTFoundation) 1 0x000000010d1702a5 _DVTAssertionFailureHandler (in DVTFoundation) 2 0x000000010d0f3694 +[DVTFilePath _filePathForParent:fileSystemRepresentation:length:allowCreation:] (in DVTFoundation) 3 0x000000010d0f3372 +[DVTFilePath _filePathForParent:pathString:] (in DVTFoundation) 4 0x000000010d12716b -[DVTSearchPath pathForFileWithRelativePathString:] (in DVTFoundation) 5 0x000000010d951a5b -[Xcode3CommandLineBuildTool _printPathToExecutableAndExit] (in Xcode3Core) 6 0x000000010d953bd4 -[Xcode3CommandLineBuildTool run] (in Xcode3Core) 7 0x000000010d0e8b46 (in xcodebuild) 8 0x000000010d0e891c (in xcodebuild) xcrun: error: /Applications/Xcode.app/Contents/Developer/usr/bin/xcodebuild failed with exit code 6 Checking whether the C compiler is IAR using "" did not match "IAR .+ Compiler": 2022-07-16 03:37:56.004 xcodebuild[14787:1207] [MT] DVTAssertions: ASSERTION FAILURE in /SourceCache/DVTFoundation/DVTFoundation-1828/Framework/Classes/FilePaths/DVTFilePath.m:379 Details: fsrep is absolute (starts with /) ('/opt/local/libexec/llvm-13/bin/clang') parentPath must be nil but it is not ('<DVTFilePath:0x400129d40:'/Applications/Xcode.app/Contents/Developer/Toolchains/XcodeDefault.xctoolchain/usr/bin'>') Object: <DVTFilePath> Method: +_filePathForParent:fileSystemRepresentation:length:allowCreation: Thread: <NSThread: 0x40030a1e0>{name = (null), num = 1} Hints: None Backtrace: 0 0x00000001095ce44c -[DVTAssertionHandler handleFailureInMethod:object:fileName:lineNumber:messageFormat:arguments:] (in DVTFoundation) 1 0x00000001095ce2a5 _DVTAssertionFailureHandler (in DVTFoundation) 2 0x0000000109551694 +[DVTFilePath _filePathForParent:fileSystemRepresentation:length:allowCreation:] (in DVTFoundation) 3 0x0000000109551372 +[DVTFilePath _filePathForParent:pathString:] (in DVTFoundation) 4 0x000000010958516b -[DVTSearchPath pathForFileWithRelativePathString:] (in DVTFoundation) 5 0x0000000109daea5b -[Xcode3CommandLineBuildTool _printPathToExecutableAndExit] (in Xcode3Core) 6 0x0000000109db0bd4 -[Xcode3CommandLineBuildTool run] (in Xcode3Core) 7 0x0000000109542b46 (in xcodebuild) 8 0x000000010954291c (in xcodebuild) xcrun: error: /Applications/Xcode.app/Contents/Developer/usr/bin/xcodebuild failed with exit code 6 Compiling the CXX compiler identification source file "CMakeCXXCompilerId.cpp" failed. Compiler: /opt/local/bin/clang++-mp-13 Build flags: -pipe;-Os;-DNDEBUG;-isystem/opt/local/include/LegacySupport;-I/opt/local/include;-stdlib=libc++ Id flags: The output was: 69 2022-07-16 03:38:01.235 xcodebuild[14790:1207] [MT] DVTAssertions: ASSERTION FAILURE in /SourceCache/DVTFoundation/DVTFoundation-1828/Framework/Classes/FilePaths/DVTFilePath.m:379 Details: fsrep is absolute (starts with /) ('/opt/local/libexec/llvm-13/bin/clang++') parentPath must be nil but it is not ('<DVTFilePath:0x400129840:'/Applications/Xcode.app/Contents/Developer/Toolchains/XcodeDefault.xctoolchain/usr/bin'>') Object: <DVTFilePath> Method: +_filePathForParent:fileSystemRepresentation:length:allowCreation: Thread: <NSThread: 0x40030a1e0>{name = (null), num = 1} Hints: None Backtrace: 0 0x000000010527d44c -[DVTAssertionHandler handleFailureInMethod:object:fileName:lineNumber:messageFormat:arguments:] (in DVTFoundation) 1 0x000000010527d2a5 _DVTAssertionFailureHandler (in DVTFoundation) 2 0x0000000105200694 +[DVTFilePath _filePathForParent:fileSystemRepresentation:length:allowCreation:] (in DVTFoundation) 3 0x0000000105200372 +[DVTFilePath _filePathForParent:pathString:] (in DVTFoundation) 4 0x000000010523416b -[DVTSearchPath pathForFileWithRelativePathString:] (in DVTFoundation) 5 0x0000000105a5da5b -[Xcode3CommandLineBuildTool _printPathToExecutableAndExit] (in Xcode3Core) 6 0x0000000105a5fbd4 -[Xcode3CommandLineBuildTool run] (in Xcode3Core) 7 0x00000001051efb46 (in xcodebuild) 8 0x00000001051ef91c (in xcodebuild) xcrun: error: /Applications/Xcode.app/Contents/Developer/usr/bin/xcodebuild failed with exit code 6 Compiling the CXX compiler identification source file "CMakeCXXCompilerId.cpp" failed. Compiler: /opt/local/bin/clang++-mp-13 Build flags: -pipe;-Os;-DNDEBUG;-isystem/opt/local/include/LegacySupport;-I/opt/local/include;-stdlib=libc++ Id flags: -c The output was: 69 2022-07-16 03:38:07.004 xcodebuild[14793:1207] [MT] DVTAssertions: ASSERTION FAILURE in /SourceCache/DVTFoundation/DVTFoundation-1828/Framework/Classes/FilePaths/DVTFilePath.m:379 Details: fsrep is absolute (starts with /) ('/opt/local/libexec/llvm-13/bin/clang++') parentPath must be nil but it is not ('<DVTFilePath:0x400129ac0:'/Applications/Xcode.app/Contents/Developer/Toolchains/XcodeDefault.xctoolchain/usr/bin'>') Object: <DVTFilePath> Method: +_filePathForParent:fileSystemRepresentation:length:allowCreation: Thread: <NSThread: 0x40030a1e0>{name = (null), num = 1} Hints: None Backtrace: 0 0x000000010aa3844c -[DVTAssertionHandler handleFailureInMethod:object:fileName:lineNumber:messageFormat:arguments:] (in DVTFoundation) 1 0x000000010aa382a5 _DVTAssertionFailureHandler (in DVTFoundation) 2 0x000000010a9bb694 +[DVTFilePath _filePathForParent:fileSystemRepresentation:length:allowCreation:] (in DVTFoundation) 3 0x000000010a9bb372 +[DVTFilePath _filePathForParent:pathString:] (in DVTFoundation) 4 0x000000010a9ef16b -[DVTSearchPath pathForFileWithRelativePathString:] (in DVTFoundation) 5 0x000000010b218a5b -[Xcode3CommandLineBuildTool _printPathToExecutableAndExit] (in Xcode3Core) 6 0x000000010b21abd4 -[Xcode3CommandLineBuildTool run] (in Xcode3Core) 7 0x000000010a9b0b46 (in xcodebuild) 8 0x000000010a9b091c (in xcodebuild) xcrun: error: /Applications/Xcode.app/Contents/Developer/usr/bin/xcodebuild failed with exit code 6 Compiling the CXX compiler identification source file "CMakeCXXCompilerId.cpp" failed. Compiler: /opt/local/bin/clang++-mp-13 Build flags: -pipe;-Os;-DNDEBUG;-isystem/opt/local/include/LegacySupport;-I/opt/local/include;-stdlib=libc++ Id flags: --c++ The output was: 69 2022-07-16 03:38:11.890 xcodebuild[14795:1207] [MT] DVTAssertions: ASSERTION FAILURE in /SourceCache/DVTFoundation/DVTFoundation-1828/Framework/Classes/FilePaths/DVTFilePath.m:379 Details: fsrep is absolute (starts with /) ('/opt/local/libexec/llvm-13/bin/clang++') parentPath must be nil but it is not ('<DVTFilePath:0x400129ac0:'/Applications/Xcode.app/Contents/Developer/Toolchains/XcodeDefault.xctoolchain/usr/bin'>') Object: <DVTFilePath> Method: +_filePathForParent:fileSystemRepresentation:length:allowCreation: Thread: <NSThread: 0x40030a1e0>{name = (null), num = 1} Hints: None Backtrace: 0 0x000000010443744c -[DVTAssertionHandler handleFailureInMethod:object:fileName:lineNumber:messageFormat:arguments:] (in DVTFoundation) 1 0x00000001044372a5 _DVTAssertionFailureHandler (in DVTFoundation) 2 0x00000001043ba694 +[DVTFilePath _filePathForParent:fileSystemRepresentation:length:allowCreation:] (in DVTFoundation) 3 0x00000001043ba372 +[DVTFilePath _filePathForParent:pathString:] (in DVTFoundation) 4 0x00000001043ee16b -[DVTSearchPath pathForFileWithRelativePathString:] (in DVTFoundation) 5 0x0000000104c17a5b -[Xcode3CommandLineBuildTool _printPathToExecutableAndExit] (in Xcode3Core) 6 0x0000000104c19bd4 -[Xcode3CommandLineBuildTool run] (in Xcode3Core) 7 0x00000001043aab46 (in xcodebuild) 8 0x00000001043aa91c (in xcodebuild) xcrun: error: /Applications/Xcode.app/Contents/Developer/usr/bin/xcodebuild failed with exit code 6 Compiling the CXX compiler identification source file "CMakeCXXCompilerId.cpp" failed. Compiler: /opt/local/bin/clang++-mp-13 Build flags: -pipe;-Os;-DNDEBUG;-isystem/opt/local/include/LegacySupport;-I/opt/local/include;-stdlib=libc++ Id flags: --ec++ The output was: 69 2022-07-16 03:38:18.004 xcodebuild[14798:1207] [MT] DVTAssertions: ASSERTION FAILURE in /SourceCache/DVTFoundation/DVTFoundation-1828/Framework/Classes/FilePaths/DVTFilePath.m:379 Details: fsrep is absolute (starts with /) ('/opt/local/libexec/llvm-13/bin/clang++') parentPath must be nil but it is not ('<DVTFilePath:0x400129ac0:'/Applications/Xcode.app/Contents/Developer/Toolchains/XcodeDefault.xctoolchain/usr/bin'>') Object: <DVTFilePath> Method: +_filePathForParent:fileSystemRepresentation:length:allowCreation: Thread: <NSThread: 0x40030a1e0>{name = (null), num = 1} Hints: None Backtrace: 0 0x00000001080c344c -[DVTAssertionHandler handleFailureInMethod:object:fileName:lineNumber:messageFormat:arguments:] (in DVTFoundation) 1 0x00000001080c32a5 _DVTAssertionFailureHandler (in DVTFoundation) 2 0x0000000108046694 +[DVTFilePath _filePathForParent:fileSystemRepresentation:length:allowCreation:] (in DVTFoundation) 3 0x0000000108046372 +[DVTFilePath _filePathForParent:pathString:] (in DVTFoundation) 4 0x000000010807a16b -[DVTSearchPath pathForFileWithRelativePathString:] (in DVTFoundation) 5 0x00000001088a1a5b -[Xcode3CommandLineBuildTool _printPathToExecutableAndExit] (in Xcode3Core) 6 0x00000001088a3bd4 -[Xcode3CommandLineBuildTool run] (in Xcode3Core) 7 0x0000000108034b46 (in xcodebuild) 8 0x000000010803491c (in xcodebuild) xcrun: error: /Applications/Xcode.app/Contents/Developer/usr/bin/xcodebuild failed with exit code 6 Compiling the CXX compiler identification source file "CMakeCXXCompilerId.cpp" failed. Compiler: /opt/local/bin/clang++-mp-13 Build flags: -pipe;-Os;-DNDEBUG;-isystem/opt/local/include/LegacySupport;-I/opt/local/include;-stdlib=libc++ Id flags: --target=arm-arm-none-eabi;-mcpu=cortex-m3 The output was: 69 2022-07-16 03:38:22.571 xcodebuild[14801:1207] [MT] DVTAssertions: ASSERTION FAILURE in /SourceCache/DVTFoundation/DVTFoundation-1828/Framework/Classes/FilePaths/DVTFilePath.m:379 Details: fsrep is absolute (starts with /) ('/opt/local/libexec/llvm-13/bin/clang++') parentPath must be nil but it is not ('<DVTFilePath:0x400129ac0:'/Applications/Xcode.app/Contents/Developer/Toolchains/XcodeDefault.xctoolchain/usr/bin'>') Object: <DVTFilePath> Method: +_filePathForParent:fileSystemRepresentation:length:allowCreation: Thread: <NSThread: 0x40030a1e0>{name = (null), num = 1} Hints: None Backtrace: 0 0x000000010d04344c -[DVTAssertionHandler handleFailureInMethod:object:fileName:lineNumber:messageFormat:arguments:] (in DVTFoundation) 1 0x000000010d0432a5 _DVTAssertionFailureHandler (in DVTFoundation) 2 0x000000010cfc6694 +[DVTFilePath _filePathForParent:fileSystemRepresentation:length:allowCreation:] (in DVTFoundation) 3 0x000000010cfc6372 +[DVTFilePath _filePathForParent:pathString:] (in DVTFoundation) 4 0x000000010cffa16b -[DVTSearchPath pathForFileWithRelativePathString:] (in DVTFoundation) 5 0x000000010d823a5b -[Xcode3CommandLineBuildTool _printPathToExecutableAndExit] (in Xcode3Core) 6 0x000000010d825bd4 -[Xcode3CommandLineBuildTool run] (in Xcode3Core) 7 0x000000010cfb7b46 (in xcodebuild) 8 0x000000010cfb791c (in xcodebuild) xcrun: error: /Applications/Xcode.app/Contents/Developer/usr/bin/xcodebuild failed with exit code 6 Compiling the CXX compiler identification source file "CMakeCXXCompilerId.cpp" failed. Compiler: /opt/local/bin/clang++-mp-13 Build flags: -pipe;-Os;-DNDEBUG;-isystem/opt/local/include/LegacySupport;-I/opt/local/include;-stdlib=libc++ Id flags: -c;-I__does_not_exist__ The output was: 69 2022-07-16 03:38:28.003 xcodebuild[14804:1207] [MT] DVTAssertions: ASSERTION FAILURE in /SourceCache/DVTFoundation/DVTFoundation-1828/Framework/Classes/FilePaths/DVTFilePath.m:379 Details: fsrep is absolute (starts with /) ('/opt/local/libexec/llvm-13/bin/clang++') parentPath must be nil but it is not ('<DVTFilePath:0x400129ac0:'/Applications/Xcode.app/Contents/Developer/Toolchains/XcodeDefault.xctoolchain/usr/bin'>') Object: <DVTFilePath> Method: +_filePathForParent:fileSystemRepresentation:length:allowCreation: Thread: <NSThread: 0x40030a1e0>{name = (null), num = 1} Hints: None Backtrace: 0 0x000000010734344c -[DVTAssertionHandler handleFailureInMethod:object:fileName:lineNumber:messageFormat:arguments:] (in DVTFoundation) 1 0x00000001073432a5 _DVTAssertionFailureHandler (in DVTFoundation) 2 0x00000001072c6694 +[DVTFilePath _filePathForParent:fileSystemRepresentation:length:allowCreation:] (in DVTFoundation) 3 0x00000001072c6372 +[DVTFilePath _filePathForParent:pathString:] (in DVTFoundation) 4 0x00000001072fa16b -[DVTSearchPath pathForFileWithRelativePathString:] (in DVTFoundation) 5 0x0000000107b24a5b -[Xcode3CommandLineBuildTool _printPathToExecutableAndExit] (in Xcode3Core) 6 0x0000000107b26bd4 -[Xcode3CommandLineBuildTool run] (in Xcode3Core) 7 0x00000001072b6b46 (in xcodebuild) 8 0x00000001072b691c (in xcodebuild) xcrun: error: /Applications/Xcode.app/Contents/Developer/usr/bin/xcodebuild failed with exit code 6 Compiling the CXX compiler identification source file "CMakeCXXCompilerId.cpp" failed. Compiler: /opt/local/bin/clang++-mp-13 Build flags: Id flags: The output was: 69 2022-07-16 03:38:33.256 xcodebuild[14806:1207] [MT] DVTAssertions: ASSERTION FAILURE in /SourceCache/DVTFoundation/DVTFoundation-1828/Framework/Classes/FilePaths/DVTFilePath.m:379 Details: fsrep is absolute (starts with /) ('/opt/local/libexec/llvm-13/bin/clang++') parentPath must be nil but it is not ('<DVTFilePath:0x400129840:'/Applications/Xcode.app/Contents/Developer/Toolchains/XcodeDefault.xctoolchain/usr/bin'>') Object: <DVTFilePath> Method: +_filePathForParent:fileSystemRepresentation:length:allowCreation: Thread: <NSThread: 0x40030a1e0>{name = (null), num = 1} Hints: None Backtrace: 0 0x000000010caa044c -[DVTAssertionHandler handleFailureInMethod:object:fileName:lineNumber:messageFormat:arguments:] (in DVTFoundation) 1 0x000000010caa02a5 _DVTAssertionFailureHandler (in DVTFoundation) 2 0x000000010ca23694 +[DVTFilePath _filePathForParent:fileSystemRepresentation:length:allowCreation:] (in DVTFoundation) 3 0x000000010ca23372 +[DVTFilePath _filePathForParent:pathString:] (in DVTFoundation) 4 0x000000010ca5716b -[DVTSearchPath pathForFileWithRelativePathString:] (in DVTFoundation) 5 0x000000010d27ba5b -[Xcode3CommandLineBuildTool _printPathToExecutableAndExit] (in Xcode3Core) 6 0x000000010d27dbd4 -[Xcode3CommandLineBuildTool run] (in Xcode3Core) 7 0x000000010ca15b46 (in xcodebuild) 8 0x000000010ca1591c (in xcodebuild) xcrun: error: /Applications/Xcode.app/Contents/Developer/usr/bin/xcodebuild failed with exit code 6 Compiling the CXX compiler identification source file "CMakeCXXCompilerId.cpp" failed. Compiler: /opt/local/bin/clang++-mp-13 Build flags: Id flags: -c The output was: 69 2022-07-16 03:38:39.004 xcodebuild[14809:1207] [MT] DVTAssertions: ASSERTION FAILURE in /SourceCache/DVTFoundation/DVTFoundation-1828/Framework/Classes/FilePaths/DVTFilePath.m:379 Details: fsrep is absolute (starts with /) ('/opt/local/libexec/llvm-13/bin/clang++') parentPath must be nil but it is not ('<DVTFilePath:0x400129ac0:'/Applications/Xcode.app/Contents/Developer/Toolchains/XcodeDefault.xctoolchain/usr/bin'>') Object: <DVTFilePath> Method: +_filePathForParent:fileSystemRepresentation:length:allowCreation: Thread: <NSThread: 0x40030a1e0>{name = (null), num = 1} Hints: None Backtrace: 0 0x0000000107b9d44c -[DVTAssertionHandler handleFailureInMethod:object:fileName:lineNumber:messageFormat:arguments:] (in DVTFoundation) 1 0x0000000107b9d2a5 _DVTAssertionFailureHandler (in DVTFoundation) 2 0x0000000107b20694 +[DVTFilePath _filePathForParent:fileSystemRepresentation:length:allowCreation:] (in DVTFoundation) 3 0x0000000107b20372 +[DVTFilePath _filePathForParent:pathString:] (in DVTFoundation) 4 0x0000000107b5416b -[DVTSearchPath pathForFileWithRelativePathString:] (in DVTFoundation) 5 0x000000010837ea5b -[Xcode3CommandLineBuildTool _printPathToExecutableAndExit] (in Xcode3Core) 6 0x0000000108380bd4 -[Xcode3CommandLineBuildTool run] (in Xcode3Core) 7 0x0000000107b10b46 (in xcodebuild) 8 0x0000000107b1091c (in xcodebuild) xcrun: error: /Applications/Xcode.app/Contents/Developer/usr/bin/xcodebuild failed with exit code 6 Compiling the CXX compiler identification source file "CMakeCXXCompilerId.cpp" failed. Compiler: /opt/local/bin/clang++-mp-13 Build flags: Id flags: --c++ The output was: 69 2022-07-16 03:38:43.830 xcodebuild[14811:1207] [MT] DVTAssertions: ASSERTION FAILURE in /SourceCache/DVTFoundation/DVTFoundation-1828/Framework/Classes/FilePaths/DVTFilePath.m:379 Details: fsrep is absolute (starts with /) ('/opt/local/libexec/llvm-13/bin/clang++') parentPath must be nil but it is not ('<DVTFilePath:0x400129ac0:'/Applications/Xcode.app/Contents/Developer/Toolchains/XcodeDefault.xctoolchain/usr/bin'>') Object: <DVTFilePath> Method: +_filePathForParent:fileSystemRepresentation:length:allowCreation: Thread: <NSThread: 0x40030a1e0>{name = (null), num = 1} Hints: None Backtrace: 0 0x000000010b06744c -[DVTAssertionHandler handleFailureInMethod:object:fileName:lineNumber:messageFormat:arguments:] (in DVTFoundation) 1 0x000000010b0672a5 _DVTAssertionFailureHandler (in DVTFoundation) 2 0x000000010afea694 +[DVTFilePath _filePathForParent:fileSystemRepresentation:length:allowCreation:] (in DVTFoundation) 3 0x000000010afea372 +[DVTFilePath _filePathForParent:pathString:] (in DVTFoundation) 4 0x000000010b01e16b -[DVTSearchPath pathForFileWithRelativePathString:] (in DVTFoundation) 5 0x000000010b844a5b -[Xcode3CommandLineBuildTool _printPathToExecutableAndExit] (in Xcode3Core) 6 0x000000010b846bd4 -[Xcode3CommandLineBuildTool run] (in Xcode3Core) 7 0x000000010afdeb46 (in xcodebuild) 8 0x000000010afde91c (in xcodebuild) xcrun: error: /Applications/Xcode.app/Contents/Developer/usr/bin/xcodebuild failed with exit code 6 Compiling the CXX compiler identification source file "CMakeCXXCompilerId.cpp" failed. Compiler: /opt/local/bin/clang++-mp-13 Build flags: Id flags: --ec++ The output was: 69 2022-07-16 03:38:49.002 xcodebuild[14814:1207] [MT] DVTAssertions: ASSERTION FAILURE in /SourceCache/DVTFoundation/DVTFoundation-1828/Framework/Classes/FilePaths/DVTFilePath.m:379 Details: fsrep is absolute (starts with /) ('/opt/local/libexec/llvm-13/bin/clang++') parentPath must be nil but it is not ('<DVTFilePath:0x400129ac0:'/Applications/Xcode.app/Contents/Developer/Toolchains/XcodeDefault.xctoolchain/usr/bin'>') Object: <DVTFilePath> Method: +_filePathForParent:fileSystemRepresentation:length:allowCreation: Thread: <NSThread: 0x40030a1e0>{name = (null), num = 1} Hints: None Backtrace: 0 0x000000010e49c44c -[DVTAssertionHandler handleFailureInMethod:object:fileName:lineNumber:messageFormat:arguments:] (in DVTFoundation) 1 0x000000010e49c2a5 _DVTAssertionFailureHandler (in DVTFoundation) 2 0x000000010e41f694 +[DVTFilePath _filePathForParent:fileSystemRepresentation:length:allowCreation:] (in DVTFoundation) 3 0x000000010e41f372 +[DVTFilePath _filePathForParent:pathString:] (in DVTFoundation) 4 0x000000010e45316b -[DVTSearchPath pathForFileWithRelativePathString:] (in DVTFoundation) 5 0x000000010ec7ca5b -[Xcode3CommandLineBuildTool _printPathToExecutableAndExit] (in Xcode3Core) 6 0x000000010ec7ebd4 -[Xcode3CommandLineBuildTool run] (in Xcode3Core) 7 0x000000010e414b46 (in xcodebuild) 8 0x000000010e41491c (in xcodebuild) xcrun: error: /Applications/Xcode.app/Contents/Developer/usr/bin/xcodebuild failed with exit code 6 Compiling the CXX compiler identification source file "CMakeCXXCompilerId.cpp" failed. Compiler: /opt/local/bin/clang++-mp-13 Build flags: Id flags: --target=arm-arm-none-eabi;-mcpu=cortex-m3 The output was: 69 2022-07-16 03:38:54.012 xcodebuild[14816:1207] [MT] DVTAssertions: ASSERTION FAILURE in /SourceCache/DVTFoundation/DVTFoundation-1828/Framework/Classes/FilePaths/DVTFilePath.m:379 Details: fsrep is absolute (starts with /) ('/opt/local/libexec/llvm-13/bin/clang++') parentPath must be nil but it is not ('<DVTFilePath:0x400129ac0:'/Applications/Xcode.app/Contents/Developer/Toolchains/XcodeDefault.xctoolchain/usr/bin'>') Object: <DVTFilePath> Method: +_filePathForParent:fileSystemRepresentation:length:allowCreation: Thread: <NSThread: 0x40030a1e0>{name = (null), num = 1} Hints: None Backtrace: 0 0x000000010fe8a44c -[DVTAssertionHandler handleFailureInMethod:object:fileName:lineNumber:messageFormat:arguments:] (in DVTFoundation) 1 0x000000010fe8a2a5 _DVTAssertionFailureHandler (in DVTFoundation) 2 0x000000010fe0d694 +[DVTFilePath _filePathForParent:fileSystemRepresentation:length:allowCreation:] (in DVTFoundation) 3 0x000000010fe0d372 +[DVTFilePath _filePathForParent:pathString:] (in DVTFoundation) 4 0x000000010fe4116b -[DVTSearchPath pathForFileWithRelativePathString:] (in DVTFoundation) 5 0x0000000110670a5b -[Xcode3CommandLineBuildTool _printPathToExecutableAndExit] (in Xcode3Core) 6 0x0000000110672bd4 -[Xcode3CommandLineBuildTool run] (in Xcode3Core) 7 0x000000010fe00b46 (in xcodebuild) 8 0x000000010fe0091c (in xcodebuild) xcrun: error: /Applications/Xcode.app/Contents/Developer/usr/bin/xcodebuild failed with exit code 6 Compiling the CXX compiler identification source file "CMakeCXXCompilerId.cpp" failed. Compiler: /opt/local/bin/clang++-mp-13 Build flags: Id flags: -c;-I__does_not_exist__ The output was: 69 2022-07-16 03:39:00.002 xcodebuild[14820:1207] [MT] DVTAssertions: ASSERTION FAILURE in /SourceCache/DVTFoundation/DVTFoundation-1828/Framework/Classes/FilePaths/DVTFilePath.m:379 Details: fsrep is absolute (starts with /) ('/opt/local/libexec/llvm-13/bin/clang++') parentPath must be nil but it is not ('<DVTFilePath:0x400129ac0:'/Applications/Xcode.app/Contents/Developer/Toolchains/XcodeDefault.xctoolchain/usr/bin'>') Object: <DVTFilePath> Method: +_filePathForParent:fileSystemRepresentation:length:allowCreation: Thread: <NSThread: 0x40030a1e0>{name = (null), num = 1} Hints: None Backtrace: 0 0x000000010a5d244c -[DVTAssertionHandler handleFailureInMethod:object:fileName:lineNumber:messageFormat:arguments:] (in DVTFoundation) 1 0x000000010a5d22a5 _DVTAssertionFailureHandler (in DVTFoundation) 2 0x000000010a555694 +[DVTFilePath _filePathForParent:fileSystemRepresentation:length:allowCreation:] (in DVTFoundation) 3 0x000000010a555372 +[DVTFilePath _filePathForParent:pathString:] (in DVTFoundation) 4 0x000000010a58916b -[DVTSearchPath pathForFileWithRelativePathString:] (in DVTFoundation) 5 0x000000010adb0a5b -[Xcode3CommandLineBuildTool _printPathToExecutableAndExit] (in Xcode3Core) 6 0x000000010adb2bd4 -[Xcode3CommandLineBuildTool run] (in Xcode3Core) 7 0x000000010a547b46 (in xcodebuild) 8 0x000000010a54791c (in xcodebuild) xcrun: error: /Applications/Xcode.app/Contents/Developer/usr/bin/xcodebuild failed with exit code 6 Checking whether the CXX compiler is IAR using "" did not match "IAR .+ Compiler": 2022-07-16 03:39:04.744 xcodebuild[14822:1207] [MT] DVTAssertions: ASSERTION FAILURE in /SourceCache/DVTFoundation/DVTFoundation-1828/Framework/Classes/FilePaths/DVTFilePath.m:379 Details: fsrep is absolute (starts with /) ('/opt/local/libexec/llvm-13/bin/clang++') parentPath must be nil but it is not ('<DVTFilePath:0x400129d40:'/Applications/Xcode.app/Contents/Developer/Toolchains/XcodeDefault.xctoolchain/usr/bin'>') Object: <DVTFilePath> Method: +_filePathForParent:fileSystemRepresentation:length:allowCreation: Thread: <NSThread: 0x40030a1e0>{name = (null), num = 1} Hints: None Backtrace: 0 0x00000001063e244c -[DVTAssertionHandler handleFailureInMethod:object:fileName:lineNumber:messageFormat:arguments:] (in DVTFoundation) 1 0x00000001063e22a5 _DVTAssertionFailureHandler (in DVTFoundation) 2 0x0000000106365694 +[DVTFilePath _filePathForParent:fileSystemRepresentation:length:allowCreation:] (in DVTFoundation) 3 0x0000000106365372 +[DVTFilePath _filePathForParent:pathString:] (in DVTFoundation) 4 0x000000010639916b -[DVTSearchPath pathForFileWithRelativePathString:] (in DVTFoundation) 5 0x0000000106bc1a5b -[Xcode3CommandLineBuildTool _printPathToExecutableAndExit] (in Xcode3Core) 6 0x0000000106bc3bd4 -[Xcode3CommandLineBuildTool run] (in Xcode3Core) 7 0x0000000106356b46 (in xcodebuild) 8 0x000000010635691c (in xcodebuild) 9 0x0000000000000005 xcrun: error: /Applications/Xcode.app/Contents/Developer/usr/bin/xcodebuild failed with exit code 6 Checking whether the CXX compiler is IAR using "" did not match "IAR .+ Compiler": 2022-07-16 03:39:10.002 xcodebuild[14825:1207] [MT] DVTAssertions: ASSERTION FAILURE in /SourceCache/DVTFoundation/DVTFoundation-1828/Framework/Classes/FilePaths/DVTFilePath.m:379 Details: fsrep is absolute (starts with /) ('/opt/local/libexec/llvm-13/bin/clang++') parentPath must be nil but it is not ('<DVTFilePath:0x400129d40:'/Applications/Xcode.app/Contents/Developer/Toolchains/XcodeDefault.xctoolchain/usr/bin'>') Object: <DVTFilePath> Method: +_filePathForParent:fileSystemRepresentation:length:allowCreation: Thread: <NSThread: 0x40030a1e0>{name = (null), num = 1} Hints: None Backtrace: 0 0x000000010653544c -[DVTAssertionHandler handleFailureInMethod:object:fileName:lineNumber:messageFormat:arguments:] (in DVTFoundation) 1 0x00000001065352a5 _DVTAssertionFailureHandler (in DVTFoundation) 2 0x00000001064b8694 +[DVTFilePath _filePathForParent:fileSystemRepresentation:length:allowCreation:] (in DVTFoundation) 3 0x00000001064b8372 +[DVTFilePath _filePathForParent:pathString:] (in DVTFoundation) 4 0x00000001064ec16b -[DVTSearchPath pathForFileWithRelativePathString:] (in DVTFoundation) 5 0x0000000106d14a5b -[Xcode3CommandLineBuildTool _printPathToExecutableAndExit] (in Xcode3Core) 6 0x0000000106d16bd4 -[Xcode3CommandLineBuildTool run] (in Xcode3Core) 7 0x00000001064acb46 (in xcodebuild) 8 0x00000001064ac91c (in xcodebuild) 9 0x0000000000000005 xcrun: error: /Applications/Xcode.app/Contents/Developer/usr/bin/xcodebuild failed with exit code 6 Detecting C compiler ABI info failed to compile with the following output: Change Dir: /opt/local/var/macports/build/_opt_local_var_macports_sources_rsync.macports.org_macports_release_tarballs_ports_textproc_doxygen/doxygen/work/doxygen-1.9.3/CMakeFiles/CMakeTmp Run Build Command(s):/usr/bin/make -f Makefile cmTC_aa935/fast && /usr/bin/make -f CMakeFiles/cmTC_aa935.dir/build.make CMakeFiles/cmTC_aa935.dir/build Building C object CMakeFiles/cmTC_aa935.dir/CMakeCCompilerABI.c.o /opt/local/bin/clang-mp-13 -pipe -Os -DNDEBUG -isystem/opt/local/include/LegacySupport -I/opt/local/include -arch x86_64 -o CMakeFiles/cmTC_aa935.dir/CMakeCCompilerABI.c.o -c /opt/local/share/cmake-3.23/Modules/CMakeCCompilerABI.c 2022-07-16 03:39:15.121 xcodebuild[14834:1207] [MT] DVTAssertions: ASSERTION FAILURE in /SourceCache/DVTFoundation/DVTFoundation-1828/Framework/Classes/FilePaths/DVTFilePath.m:379 Details: fsrep is absolute (starts with /) ('/opt/local/libexec/llvm-13/bin/clang') parentPath must be nil but it is not ('<DVTFilePath:0x400129d40:'/Applications/Xcode.app/Contents/Developer/Toolchains/XcodeDefault.xctoolchain/usr/bin'>') Object: <DVTFilePath> Method: +_filePathForParent:fileSystemRepresentation:length:allowCreation: Thread: <NSThread: 0x40030a1e0>{name = (null), num = 1} Hints: None Backtrace: 0 0x0000000105a4b44c -[DVTAssertionHandler handleFailureInMethod:object:fileName:lineNumber:messageFormat:arguments:] (in DVTFoundation) 1 0x0000000105a4b2a5 _DVTAssertionFailureHandler (in DVTFoundation) 2 0x00000001059ce694 +[DVTFilePath _filePathForParent:fileSystemRepresentation:length:allowCreation:] (in DVTFoundation) 3 0x00000001059ce372 +[DVTFilePath _filePathForParent:pathString:] (in DVTFoundation) 4 0x0000000105a0216b -[DVTSearchPath pathForFileWithRelativePathString:] (in DVTFoundation) 5 0x000000010622da5b -[Xcode3CommandLineBuildTool _printPathToExecutableAndExit] (in Xcode3Core) 6 0x000000010622fbd4 -[Xcode3CommandLineBuildTool run] (in Xcode3Core) 7 0x00000001059c0b46 (in xcodebuild) 8 0x00000001059c091c (in xcodebuild) xcrun: error: /Applications/Xcode.app/Contents/Developer/usr/bin/xcodebuild failed with exit code 6 make[1]: *** [CMakeFiles/cmTC_aa935.dir/CMakeCCompilerABI.c.o] Error 69 make: *** [cmTC_aa935/fast] Error 2 Determining if the C compiler works failed with the following output: Change Dir: /opt/local/var/macports/build/_opt_local_var_macports_sources_rsync.macports.org_macports_release_tarballs_ports_textproc_doxygen/doxygen/work/doxygen-1.9.3/CMakeFiles/CMakeTmp Run Build Command(s):/usr/bin/make -f Makefile cmTC_ec3b8/fast && /usr/bin/make -f CMakeFiles/cmTC_ec3b8.dir/build.make CMakeFiles/cmTC_ec3b8.dir/build Building C object CMakeFiles/cmTC_ec3b8.dir/testCCompiler.c.o /opt/local/bin/clang-mp-13 -pipe -Os -DNDEBUG -isystem/opt/local/include/LegacySupport -I/opt/local/include -arch x86_64 -o CMakeFiles/cmTC_ec3b8.dir/testCCompiler.c.o -c /opt/local/var/macports/build/_opt_local_var_macports_sources_rsync.macports.org_macports_release_tarballs_ports_textproc_doxygen/doxygen/work/doxygen-1.9.3/CMakeFiles/CMakeTmp/testCCompiler.c 2022-07-16 03:39:21.002 xcodebuild[14843:1207] [MT] DVTAssertions: ASSERTION FAILURE in /SourceCache/DVTFoundation/DVTFoundation-1828/Framework/Classes/FilePaths/DVTFilePath.m:379 Details: fsrep is absolute (starts with /) ('/opt/local/libexec/llvm-13/bin/clang') parentPath must be nil but it is not ('<DVTFilePath:0x400129c00:'/Applications/Xcode.app/Contents/Developer/Toolchains/XcodeDefault.xctoolchain/usr/bin'>') Object: <DVTFilePath> Method: +_filePathForParent:fileSystemRepresentation:length:allowCreation: Thread: <NSThread: 0x40030a1e0>{name = (null), num = 1} Hints: None Backtrace: 0 0x000000010db3344c -[DVTAssertionHandler handleFailureInMethod:object:fileName:lineNumber:messageFormat:arguments:] (in DVTFoundation) 1 0x000000010db332a5 _DVTAssertionFailureHandler (in DVTFoundation) 2 0x000000010dab6694 +[DVTFilePath _filePathForParent:fileSystemRepresentation:length:allowCreation:] (in DVTFoundation) 3 0x000000010dab6372 +[DVTFilePath _filePathForParent:pathString:] (in DVTFoundation) 4 0x000000010daea16b -[DVTSearchPath pathForFileWithRelativePathString:] (in DVTFoundation) 5 0x000000010e30ea5b -[Xcode3CommandLineBuildTool _printPathToExecutableAndExit] (in Xcode3Core) 6 0x000000010e310bd4 -[Xcode3CommandLineBuildTool run] (in Xcode3Core) 7 0x000000010daa5b46 (in xcodebuild) 8 0x000000010daa591c (in xcodebuild) 9 0x0000000000000005 xcrun: error: /Applications/Xcode.app/Contents/Developer/usr/bin/xcodebuild failed with exit code 6 make[1]: *** [CMakeFiles/cmTC_ec3b8.dir/testCCompiler.c.o] Error 69 make: *** [cmTC_ec3b8/fast] Error 2
Optional Paste Settings
Category:
None
Cryptocurrency
Cybersecurity
Fixit
Food
Gaming
Haiku
Help
History
Housing
Jokes
Legal
Money
Movies
Music
Pets
Photo
Science
Software
Source Code
Spirit
Sports
Travel
TV
Writing
Tags:
Syntax Highlighting:
None
Bash
C
C#
C++
CSS
HTML
JSON
Java
JavaScript
Lua
Markdown (PRO members only)
Objective C
PHP
Perl
Python
Ruby
Swift
4CS
6502 ACME Cross Assembler
6502 Kick Assembler
6502 TASM/64TASS
ABAP
AIMMS
ALGOL 68
APT Sources
ARM
ASM (NASM)
ASP
ActionScript
ActionScript 3
Ada
Apache Log
AppleScript
Arduino
Asymptote
AutoIt
Autohotkey
Avisynth
Awk
BASCOM AVR
BNF
BOO
Bash
Basic4GL
Batch
BibTeX
Blitz Basic
Blitz3D
BlitzMax
BrainFuck
C
C (WinAPI)
C Intermediate Language
C for Macs
C#
C++
C++ (WinAPI)
C++ (with Qt extensions)
C: Loadrunner
CAD DCL
CAD Lisp
CFDG
CMake
COBOL
CSS
Ceylon
ChaiScript
Chapel
Clojure
Clone C
Clone C++
CoffeeScript
ColdFusion
Cuesheet
D
DCL
DCPU-16
DCS
DIV
DOT
Dart
Delphi
Delphi Prism (Oxygene)
Diff
E
ECMAScript
EPC
Easytrieve
Eiffel
Email
Erlang
Euphoria
F#
FO Language
Falcon
Filemaker
Formula One
Fortran
FreeBasic
FreeSWITCH
GAMBAS
GDB
GDScript
Game Maker
Genero
Genie
GetText
Go
Godot GLSL
Groovy
GwBasic
HQ9 Plus
HTML
HTML 5
Haskell
Haxe
HicEst
IDL
INI file
INTERCAL
IO
ISPF Panel Definition
Icon
Inno Script
J
JCL
JSON
Java
Java 5
JavaScript
Julia
KSP (Kontakt Script)
KiXtart
Kotlin
LDIF
LLVM
LOL Code
LScript
Latex
Liberty BASIC
Linden Scripting
Lisp
Loco Basic
Logtalk
Lotus Formulas
Lotus Script
Lua
M68000 Assembler
MIX Assembler
MK-61/52
MPASM
MXML
MagikSF
Make
MapBasic
Markdown (PRO members only)
MatLab
Mercury
MetaPost
Modula 2
Modula 3
Motorola 68000 HiSoft Dev
MySQL
Nagios
NetRexx
Nginx
Nim
NullSoft Installer
OCaml
OCaml Brief
Oberon 2
Objeck Programming Langua
Objective C
Octave
Open Object Rexx
OpenBSD PACKET FILTER
OpenGL Shading
Openoffice BASIC
Oracle 11
Oracle 8
Oz
PARI/GP
PCRE
PHP
PHP Brief
PL/I
PL/SQL
POV-Ray
ParaSail
Pascal
Pawn
Per
Perl
Perl 6
Phix
Pic 16
Pike
Pixel Bender
PostScript
PostgreSQL
PowerBuilder
PowerShell
ProFTPd
Progress
Prolog
Properties
ProvideX
Puppet
PureBasic
PyCon
Python
Python for S60
QBasic
QML
R
RBScript
REBOL
REG
RPM Spec
Racket
Rails
Rexx
Robots
Roff Manpage
Ruby
Ruby Gnuplot
Rust
SAS
SCL
SPARK
SPARQL
SQF
SQL
SSH Config
Scala
Scheme
Scilab
SdlBasic
Smalltalk
Smarty
StandardML
StoneScript
SuperCollider
Swift
SystemVerilog
T-SQL
TCL
TeXgraph
Tera Term
TypeScript
TypoScript
UPC
Unicon
UnrealScript
Urbi
VB.NET
VBScript
VHDL
VIM
Vala
Vedit
VeriLog
Visual Pro Log
VisualBasic
VisualFoxPro
WHOIS
WhiteSpace
Winbatch
XBasic
XML
XPP
Xojo
Xorg Config
YAML
YARA
Z80 Assembler
ZXBasic
autoconf
jQuery
mIRC
newLISP
q/kdb+
thinBasic
Paste Expiration:
Never
Burn after read
10 Minutes
1 Hour
1 Day
1 Week
2 Weeks
1 Month
6 Months
1 Year
Paste Exposure:
Public
Unlisted
Private
Folder:
(members only)
Password
NEW
Enabled
Disabled
Burn after read
NEW
Paste Name / Title:
Create New Paste
Hello
Guest
Sign Up
or
Login
Sign in with Facebook
Sign in with Twitter
Sign in with Google
You are currently not logged in, this means you can not edit or delete anything you paste.
Sign Up
or
Login
Public Pastes
Free Crypto Method
CSS | 27 min ago | 0.72 KB
+12,000$ in 2 days
CSS | 27 min ago | 0.72 KB
Documents
27 min ago | 0.43 KB
Crypto admin access
28 min ago | 0.43 KB
Silk
2 hours ago | 3.74 KB
fleet_agent
11 hours ago | 5.04 KB
Altur Song Lyrics
22 hours ago | 13.27 KB
CC:T GPS Beacon
1 day ago | 0.49 KB
We use cookies for various purposes including analytics. By continuing to use Pastebin, you agree to our use of cookies as described in the
Cookies Policy
.
OK, I Understand
Not a member of Pastebin yet?
Sign Up
, it unlocks many cool features!