SHARE
TWEET

OrmLite test results 2017-09-22 08:42 PDT

a guest Sep 22nd, 2017 9 Never
Not a member of Pastebin yet? Sign Up, it unlocks many cool features!
  1. Build started, please wait...
  2. Build completed.
  3.  
  4. Test run for /mnt/f/Temp/ss/ServiceStack.OrmLite/tests/ServiceStack.OrmLite.Tests/bin/Debug/netcoreapp2.0/ServiceStack.OrmLite.Tests.dll(.NETCoreApp,Version=v2.0)
  5. Microsoft (R) Test Execution Command Line Tool Version 15.3.0-preview-20170628-02
  6. Copyright (c) Microsoft Corporation.  All rights reserved.
  7.  
  8. Starting test execution, please wait...
  9. NUnit Adapter 3.8.0.0: Test execution started
  10. Running all tests in /mnt/f/Temp/ss/ServiceStack.OrmLite/tests/ServiceStack.OrmLite.Tests/bin/Debug/netcoreapp2.0/ServiceStack.OrmLite.Tests.dll
  11. NUnit3TestExecutor converted 856 of 856 NUnit test cases
  12. Skipped  Clean_Database
  13. Error Message:
  14.  OneTimeSetUp: OneOff Tasks
  15.  
  16. Not Run  Can_read_from_existing_database
  17. Error Message:
  18.  OneTimeSetUp:
  19.  
  20. Before Delay: 14
  21. After Delay: 14
  22. Before SQL: 14
  23. Before Inner: 14
  24. Await t: 14
  25. SELECT "Id", "FirstName", "LastName", "Age", "DateOfBirth", "DateDied", "LivingStatus"
  26. FROM "Rockstar"
  27. WHERE Id < @0 AND Age = @1
  28. SELECT "Id", "FirstName", "LastName", "Age", "DateOfBirth", "DateDied", "LivingStatus"
  29. FROM "Rockstar"
  30. WHERE "FirstName" IN (@0,@1,@2)
  31. SELECT "Id", "FirstName", "LastName", "Age", "DateOfBirth", "DateDied", "LivingStatus"
  32. FROM "Rockstar"
  33. WHERE "FirstName" LIKE @0
  34. After Inner: 3
  35. Skipped  Can_execute_stored_proceduce_returning_scalars
  36. Error Message:
  37.  Requires out-of-band SP
  38.  
  39. [
  40.    
  41. ]
  42. {
  43.     Id: 2,
  44.     Name: Customer 1,
  45.     PrimaryAddress:
  46.     {
  47.         Id: 2,
  48.         CustomerId: 2,
  49.         AddressLine1: 1 Humpty Street,
  50.         City: Humpty Doo,
  51.         State: Northern Territory,
  52.         Country: Australia
  53.     },
  54.     Orders:
  55.     [
  56.         {
  57.             Id: 3,
  58.             CustomerId: 2,
  59.             LineItem: Line 1,
  60.             Qty: 1,
  61.             Cost: 1.99
  62.         },
  63.         {
  64.             Id: 4,
  65.             CustomerId: 2,
  66.             LineItem: Line 2,
  67.             Qty: 2,
  68.             Cost: 2.99
  69.         }
  70.     ]
  71. }
  72. Skipped  Can_filter_update_method1_to_insert_date
  73. Error Message:
  74.  OneTimeSetUp: TODO: Fix weird connection hanging issue with these tests
  75.  
  76. Skipped  Can_filter_update_method2_to_insert_date
  77. Error Message:
  78.  OneTimeSetUp: TODO: Fix weird connection hanging issue with these tests
  79.  
  80. Skipped  Can_filter_update_method3_to_insert_date
  81. Error Message:
  82.  OneTimeSetUp: TODO: Fix weird connection hanging issue with these tests
  83.  
  84. Skipped  Can_filter_update_method4_to_insert_date
  85. Error Message:
  86.  OneTimeSetUp: TODO: Fix weird connection hanging issue with these tests
  87.  
  88. Skipped  Can_filter_updateAdd_expression_to_insert_date
  89. Error Message:
  90.  OneTimeSetUp: TODO: Fix weird connection hanging issue with these tests
  91.  
  92. Skipped  Can_filter_updateAdd_sqlexpression_to_insert_date
  93. Error Message:
  94.  OneTimeSetUp: TODO: Fix weird connection hanging issue with these tests
  95.  
  96. Skipped  Can_filter_updateAll_to_insert_date
  97. Error Message:
  98.  OneTimeSetUp: TODO: Fix weird connection hanging issue with these tests
  99.  
  100. Skipped  Can_filter_updateOnly_method1_to_insert_date
  101. Error Message:
  102.  OneTimeSetUp: TODO: Fix weird connection hanging issue with these tests
  103.  
  104. Skipped  Can_filter_updateOnly_method2_to_insert_date
  105. Error Message:
  106.  OneTimeSetUp: TODO: Fix weird connection hanging issue with these tests
  107.  
  108. Skipped  Can_filter_updateOnly_method3_to_insert_date
  109. Error Message:
  110.  OneTimeSetUp: TODO: Fix weird connection hanging issue with these tests
  111.  
  112. Skipped  Can_filter_updateOnly_method4_to_insert_date
  113. Error Message:
  114.  OneTimeSetUp: TODO: Fix weird connection hanging issue with these tests
  115.  
  116. Skipped  Can_filter_updateOnly_method5_to_insert_date
  117. Error Message:
  118.  OneTimeSetUp: TODO: Fix weird connection hanging issue with these tests
  119.  
  120. Skipped  Supports_different_ways_to_UpdateOnly
  121. Error Message:
  122.  OneTimeSetUp: TODO: Fix weird connection hanging issue with these tests
  123.  
  124. [
  125.     [
  126.         10,
  127.         10,
  128.         1,
  129.         55
  130.     ]
  131. ]
  132. SELECT "Id", "CustomerId", "LineItem", "Qty", "Cost" FROM "Order" WHERE "CustomerId" IN (SELECT "Customer"."Id"
  133. FROM "Customer" INNER JOIN "CustomerAddress" ON
  134. ("Customer"."Id" = "CustomerAddress"."CustomerId")
  135. ORDER BY "Customer"."Id"
  136. LIMIT 1 OFFSET 1)
  137. Failed   Can_SqlColumn_StoredProc_returning_Column_Async
  138. Error Message:
  139.  Microsoft.Data.Sqlite.SqliteException : SQLite Error 1: 'near "IF": syntax error'.
  140. Stack Trace:
  141.    at Microsoft.Data.Sqlite.Interop.MarshalEx.ThrowExceptionForRC(Int32 rc, Sqlite3Handle db)
  142.    at Microsoft.Data.Sqlite.SqliteCommand.ExecuteReader(CommandBehavior behavior)
  143.    at Microsoft.Data.Sqlite.SqliteCommand.ExecuteNonQuery()
  144.    at ServiceStack.OrmLite.OrmLiteCommand.ExecuteNonQuery() in /mnt/f/Temp/ss/ServiceStack.OrmLite/src/ServiceStack.OrmLite/OrmLiteCommand.cs:line 43
  145.    at ServiceStack.OrmLite.OrmLiteDialectProviderBase`1.ExecuteNonQueryAsync(IDbCommand cmd, CancellationToken token) in /mnt/f/Temp/ss/ServiceStack.OrmLite/src/ServiceStack.OrmLite/OrmLiteDialectProviderBase.cs:line 1608
  146.    at ServiceStack.OrmLite.OrmLiteWriteCommandExtensionsAsync.ExecuteSqlAsync(IDbCommand dbCmd, String sql, CancellationToken token) in /mnt/f/Temp/ss/ServiceStack.OrmLite/src/ServiceStack.OrmLite/Async/OrmLiteWriteCommandExtensionsAsync.cs:line 36
  147.    at ServiceStack.OrmLite.OrmLiteWriteApiAsync.<>c__DisplayClass0_0.<ExecuteSqlAsync>b__0(IDbCommand dbCmd) in /mnt/f/Temp/ss/ServiceStack.OrmLite/src/ServiceStack.OrmLite/OrmLiteWriteApiAsync.cs:line 24
  148.    at ServiceStack.OrmLite.OrmLiteExecFilter.Exec[T](IDbConnection dbConn, Func`2 filter) in /mnt/f/Temp/ss/ServiceStack.OrmLite/src/ServiceStack.OrmLite/OrmLiteExecFilter.cs:line 124
  149.    at ServiceStack.OrmLite.OrmLiteReadExpressionsApi.Exec[T](IDbConnection dbConn, Func`2 filter) in /mnt/f/Temp/ss/ServiceStack.OrmLite/src/ServiceStack.OrmLite/OrmLiteReadExpressionsApi.cs:line 24
  150.    at ServiceStack.OrmLite.OrmLiteWriteApiAsync.ExecuteSqlAsync(IDbConnection dbConn, String sql, CancellationToken token) in /mnt/f/Temp/ss/ServiceStack.OrmLite/src/ServiceStack.OrmLite/OrmLiteWriteApiAsync.cs:line 24
  151.    at ServiceStack.OrmLite.Tests.Async.SqlServerProviderTestsAsync.<Can_SqlColumn_StoredProc_returning_Column_Async>d__4.MoveNext() in /mnt/f/Temp/ss/ServiceStack.OrmLite/tests/ServiceStack.OrmLite.Tests/Async/SqlServerProviderTestsAsync.cs:line 97
  152. --- End of stack trace from previous location where exception was thrown ---
  153.    at System.Runtime.ExceptionServices.ExceptionDispatchInfo.Throw()
  154.    at NUnit.Framework.Internal.AsyncInvocationRegion.AsyncTaskInvocationRegion.WaitForPendingOperationsToComplete(Object invocationResult)
  155.    at NUnit.Framework.Internal.Commands.TestMethodCommand.RunAsyncTestMethod(TestExecutionContext context)
  156. Failed   Can_SqlColumn_StoredProc_returning_StringColumn_Async
  157. Error Message:
  158.  Microsoft.Data.Sqlite.SqliteException : SQLite Error 1: 'near "IF": syntax error'.
  159. Stack Trace:
  160.    at Microsoft.Data.Sqlite.Interop.MarshalEx.ThrowExceptionForRC(Int32 rc, Sqlite3Handle db)
  161.    at Microsoft.Data.Sqlite.SqliteCommand.ExecuteReader(CommandBehavior behavior)
  162.    at Microsoft.Data.Sqlite.SqliteCommand.ExecuteNonQuery()
  163.    at ServiceStack.OrmLite.OrmLiteCommand.ExecuteNonQuery() in /mnt/f/Temp/ss/ServiceStack.OrmLite/src/ServiceStack.OrmLite/OrmLiteCommand.cs:line 43
  164.    at ServiceStack.OrmLite.OrmLiteDialectProviderBase`1.ExecuteNonQueryAsync(IDbCommand cmd, CancellationToken token) in /mnt/f/Temp/ss/ServiceStack.OrmLite/src/ServiceStack.OrmLite/OrmLiteDialectProviderBase.cs:line 1608
  165.    at ServiceStack.OrmLite.OrmLiteWriteCommandExtensionsAsync.ExecuteSqlAsync(IDbCommand dbCmd, String sql, CancellationToken token) in /mnt/f/Temp/ss/ServiceStack.OrmLite/src/ServiceStack.OrmLite/Async/OrmLiteWriteCommandExtensionsAsync.cs:line 36
  166.    at ServiceStack.OrmLite.OrmLiteWriteApiAsync.<>c__DisplayClass0_0.<ExecuteSqlAsync>b__0(IDbCommand dbCmd) in /mnt/f/Temp/ss/ServiceStack.OrmLite/src/ServiceStack.OrmLite/OrmLiteWriteApiAsync.cs:line 24
  167.    at ServiceStack.OrmLite.OrmLiteExecFilter.Exec[T](IDbConnection dbConn, Func`2 filter) in /mnt/f/Temp/ss/ServiceStack.OrmLite/src/ServiceStack.OrmLite/OrmLiteExecFilter.cs:line 124
  168.    at ServiceStack.OrmLite.OrmLiteReadExpressionsApi.Exec[T](IDbConnection dbConn, Func`2 filter) in /mnt/f/Temp/ss/ServiceStack.OrmLite/src/ServiceStack.OrmLite/OrmLiteReadExpressionsApi.cs:line 24
  169.    at ServiceStack.OrmLite.OrmLiteWriteApiAsync.ExecuteSqlAsync(IDbConnection dbConn, String sql, CancellationToken token) in /mnt/f/Temp/ss/ServiceStack.OrmLite/src/ServiceStack.OrmLite/OrmLiteWriteApiAsync.cs:line 24
  170.    at ServiceStack.OrmLite.Tests.Async.SqlServerProviderTestsAsync.<Can_SqlColumn_StoredProc_returning_StringColumn_Async>d__5.MoveNext() in /mnt/f/Temp/ss/ServiceStack.OrmLite/tests/ServiceStack.OrmLite.Tests/Async/SqlServerProviderTestsAsync.cs:line 140
  171. --- End of stack trace from previous location where exception was thrown ---
  172.    at System.Runtime.ExceptionServices.ExceptionDispatchInfo.Throw()
  173.    at NUnit.Framework.Internal.AsyncInvocationRegion.AsyncTaskInvocationRegion.WaitForPendingOperationsToComplete(Object invocationResult)
  174.    at NUnit.Framework.Internal.Commands.TestMethodCommand.RunAsyncTestMethod(TestExecutionContext context)
  175. Failed   Can_SqlList_StoredProc_passing_null_parameter_Async
  176. Error Message:
  177.  Microsoft.Data.Sqlite.SqliteException : SQLite Error 1: 'near "IF": syntax error'.
  178. Stack Trace:
  179.    at Microsoft.Data.Sqlite.Interop.MarshalEx.ThrowExceptionForRC(Int32 rc, Sqlite3Handle db)
  180.    at Microsoft.Data.Sqlite.SqliteCommand.ExecuteReader(CommandBehavior behavior)
  181.    at Microsoft.Data.Sqlite.SqliteCommand.ExecuteNonQuery()
  182.    at ServiceStack.OrmLite.OrmLiteCommand.ExecuteNonQuery() in /mnt/f/Temp/ss/ServiceStack.OrmLite/src/ServiceStack.OrmLite/OrmLiteCommand.cs:line 43
  183.    at ServiceStack.OrmLite.OrmLiteDialectProviderBase`1.ExecuteNonQueryAsync(IDbCommand cmd, CancellationToken token) in /mnt/f/Temp/ss/ServiceStack.OrmLite/src/ServiceStack.OrmLite/OrmLiteDialectProviderBase.cs:line 1608
  184.    at ServiceStack.OrmLite.OrmLiteWriteCommandExtensionsAsync.ExecuteSqlAsync(IDbCommand dbCmd, String sql, CancellationToken token) in /mnt/f/Temp/ss/ServiceStack.OrmLite/src/ServiceStack.OrmLite/Async/OrmLiteWriteCommandExtensionsAsync.cs:line 36
  185.    at ServiceStack.OrmLite.OrmLiteWriteApiAsync.<>c__DisplayClass0_0.<ExecuteSqlAsync>b__0(IDbCommand dbCmd) in /mnt/f/Temp/ss/ServiceStack.OrmLite/src/ServiceStack.OrmLite/OrmLiteWriteApiAsync.cs:line 24
  186.    at ServiceStack.OrmLite.OrmLiteExecFilter.Exec[T](IDbConnection dbConn, Func`2 filter) in /mnt/f/Temp/ss/ServiceStack.OrmLite/src/ServiceStack.OrmLite/OrmLiteExecFilter.cs:line 124
  187.    at ServiceStack.OrmLite.OrmLiteReadExpressionsApi.Exec[T](IDbConnection dbConn, Func`2 filter) in /mnt/f/Temp/ss/ServiceStack.OrmLite/src/ServiceStack.OrmLite/OrmLiteReadExpressionsApi.cs:line 24
  188.    at ServiceStack.OrmLite.OrmLiteWriteApiAsync.ExecuteSqlAsync(IDbConnection dbConn, String sql, CancellationToken token) in /mnt/f/Temp/ss/ServiceStack.OrmLite/src/ServiceStack.OrmLite/OrmLiteWriteApiAsync.cs:line 24
  189.    at ServiceStack.OrmLite.Tests.Async.SqlServerProviderTestsAsync.<Can_SqlList_StoredProc_passing_null_parameter_Async>d__8.MoveNext() in /mnt/f/Temp/ss/ServiceStack.OrmLite/tests/ServiceStack.OrmLite.Tests/Async/SqlServerProviderTestsAsync.cs:line 222
  190. --- End of stack trace from previous location where exception was thrown ---
  191.    at System.Runtime.ExceptionServices.ExceptionDispatchInfo.Throw()
  192.    at NUnit.Framework.Internal.AsyncInvocationRegion.AsyncTaskInvocationRegion.WaitForPendingOperationsToComplete(Object invocationResult)
  193.    at NUnit.Framework.Internal.Commands.TestMethodCommand.RunAsyncTestMethod(TestExecutionContext context)
  194. Failed   Can_SqlList_StoredProc_receiving_only_first_column_and_null_Async
  195. Error Message:
  196.  Microsoft.Data.Sqlite.SqliteException : SQLite Error 1: 'near "IF": syntax error'.
  197. Stack Trace:
  198.    at Microsoft.Data.Sqlite.Interop.MarshalEx.ThrowExceptionForRC(Int32 rc, Sqlite3Handle db)
  199.    at Microsoft.Data.Sqlite.SqliteCommand.ExecuteReader(CommandBehavior behavior)
  200.    at Microsoft.Data.Sqlite.SqliteCommand.ExecuteNonQuery()
  201.    at ServiceStack.OrmLite.OrmLiteCommand.ExecuteNonQuery() in /mnt/f/Temp/ss/ServiceStack.OrmLite/src/ServiceStack.OrmLite/OrmLiteCommand.cs:line 43
  202.    at ServiceStack.OrmLite.OrmLiteDialectProviderBase`1.ExecuteNonQueryAsync(IDbCommand cmd, CancellationToken token) in /mnt/f/Temp/ss/ServiceStack.OrmLite/src/ServiceStack.OrmLite/OrmLiteDialectProviderBase.cs:line 1608
  203.    at ServiceStack.OrmLite.OrmLiteWriteCommandExtensionsAsync.ExecuteSqlAsync(IDbCommand dbCmd, String sql, CancellationToken token) in /mnt/f/Temp/ss/ServiceStack.OrmLite/src/ServiceStack.OrmLite/Async/OrmLiteWriteCommandExtensionsAsync.cs:line 36
  204.    at ServiceStack.OrmLite.OrmLiteWriteApiAsync.<>c__DisplayClass0_0.<ExecuteSqlAsync>b__0(IDbCommand dbCmd) in /mnt/f/Temp/ss/ServiceStack.OrmLite/src/ServiceStack.OrmLite/OrmLiteWriteApiAsync.cs:line 24
  205.    at ServiceStack.OrmLite.OrmLiteExecFilter.Exec[T](IDbConnection dbConn, Func`2 filter) in /mnt/f/Temp/ss/ServiceStack.OrmLite/src/ServiceStack.OrmLite/OrmLiteExecFilter.cs:line 124
  206.    at ServiceStack.OrmLite.OrmLiteReadExpressionsApi.Exec[T](IDbConnection dbConn, Func`2 filter) in /mnt/f/Temp/ss/ServiceStack.OrmLite/src/ServiceStack.OrmLite/OrmLiteReadExpressionsApi.cs:line 24
  207.    at ServiceStack.OrmLite.OrmLiteWriteApiAsync.ExecuteSqlAsync(IDbConnection dbConn, String sql, CancellationToken token) in /mnt/f/Temp/ss/ServiceStack.OrmLite/src/ServiceStack.OrmLite/OrmLiteWriteApiAsync.cs:line 24
  208.    at ServiceStack.OrmLite.Tests.Async.SqlServerProviderTestsAsync.<Can_SqlList_StoredProc_receiving_only_first_column_and_null_Async>d__9.MoveNext() in /mnt/f/Temp/ss/ServiceStack.OrmLite/tests/ServiceStack.OrmLite.Tests/Async/SqlServerProviderTestsAsync.cs:line 243
  209. --- End of stack trace from previous location where exception was thrown ---
  210.    at System.Runtime.ExceptionServices.ExceptionDispatchInfo.Throw()
  211.    at NUnit.Framework.Internal.AsyncInvocationRegion.AsyncTaskInvocationRegion.WaitForPendingOperationsToComplete(Object invocationResult)
  212.    at NUnit.Framework.Internal.Commands.TestMethodCommand.RunAsyncTestMethod(TestExecutionContext context)
  213. Failed   Can_SqlList_StoredProc_returning_Table_Async
  214. Error Message:
  215.  Microsoft.Data.Sqlite.SqliteException : SQLite Error 1: 'near "IF": syntax error'.
  216. Stack Trace:
  217.    at Microsoft.Data.Sqlite.Interop.MarshalEx.ThrowExceptionForRC(Int32 rc, Sqlite3Handle db)
  218.    at Microsoft.Data.Sqlite.SqliteCommand.ExecuteReader(CommandBehavior behavior)
  219.    at Microsoft.Data.Sqlite.SqliteCommand.ExecuteNonQuery()
  220.    at ServiceStack.OrmLite.OrmLiteCommand.ExecuteNonQuery() in /mnt/f/Temp/ss/ServiceStack.OrmLite/src/ServiceStack.OrmLite/OrmLiteCommand.cs:line 43
  221.    at ServiceStack.OrmLite.OrmLiteDialectProviderBase`1.ExecuteNonQueryAsync(IDbCommand cmd, CancellationToken token) in /mnt/f/Temp/ss/ServiceStack.OrmLite/src/ServiceStack.OrmLite/OrmLiteDialectProviderBase.cs:line 1608
  222.    at ServiceStack.OrmLite.OrmLiteWriteCommandExtensionsAsync.ExecuteSqlAsync(IDbCommand dbCmd, String sql, CancellationToken token) in /mnt/f/Temp/ss/ServiceStack.OrmLite/src/ServiceStack.OrmLite/Async/OrmLiteWriteCommandExtensionsAsync.cs:line 36
  223.    at ServiceStack.OrmLite.OrmLiteWriteApiAsync.<>c__DisplayClass0_0.<ExecuteSqlAsync>b__0(IDbCommand dbCmd) in /mnt/f/Temp/ss/ServiceStack.OrmLite/src/ServiceStack.OrmLite/OrmLiteWriteApiAsync.cs:line 24
  224.    at ServiceStack.OrmLite.OrmLiteExecFilter.Exec[T](IDbConnection dbConn, Func`2 filter) in /mnt/f/Temp/ss/ServiceStack.OrmLite/src/ServiceStack.OrmLite/OrmLiteExecFilter.cs:line 124
  225.    at ServiceStack.OrmLite.OrmLiteReadExpressionsApi.Exec[T](IDbConnection dbConn, Func`2 filter) in /mnt/f/Temp/ss/ServiceStack.OrmLite/src/ServiceStack.OrmLite/OrmLiteReadExpressionsApi.cs:line 24
  226.    at ServiceStack.OrmLite.OrmLiteWriteApiAsync.ExecuteSqlAsync(IDbConnection dbConn, String sql, CancellationToken token) in /mnt/f/Temp/ss/ServiceStack.OrmLite/src/ServiceStack.OrmLite/OrmLiteWriteApiAsync.cs:line 24
  227.    at ServiceStack.OrmLite.Tests.Async.SqlServerProviderTestsAsync.<Can_SqlList_StoredProc_returning_Table_Async>d__3.MoveNext() in /mnt/f/Temp/ss/ServiceStack.OrmLite/tests/ServiceStack.OrmLite.Tests/Async/SqlServerProviderTestsAsync.cs:line 54
  228. --- End of stack trace from previous location where exception was thrown ---
  229.    at System.Runtime.ExceptionServices.ExceptionDispatchInfo.Throw()
  230.    at NUnit.Framework.Internal.AsyncInvocationRegion.AsyncTaskInvocationRegion.WaitForPendingOperationsToComplete(Object invocationResult)
  231.    at NUnit.Framework.Internal.Commands.TestMethodCommand.RunAsyncTestMethod(TestExecutionContext context)
  232. Failed   Can_SqlScalar_StoredProc_passing_null_parameter_Async
  233. Error Message:
  234.  Microsoft.Data.Sqlite.SqliteException : SQLite Error 1: 'near "IF": syntax error'.
  235. Stack Trace:
  236.    at Microsoft.Data.Sqlite.Interop.MarshalEx.ThrowExceptionForRC(Int32 rc, Sqlite3Handle db)
  237.    at Microsoft.Data.Sqlite.SqliteCommand.ExecuteReader(CommandBehavior behavior)
  238.    at Microsoft.Data.Sqlite.SqliteCommand.ExecuteNonQuery()
  239.    at ServiceStack.OrmLite.OrmLiteCommand.ExecuteNonQuery() in /mnt/f/Temp/ss/ServiceStack.OrmLite/src/ServiceStack.OrmLite/OrmLiteCommand.cs:line 43
  240.    at ServiceStack.OrmLite.OrmLiteDialectProviderBase`1.ExecuteNonQueryAsync(IDbCommand cmd, CancellationToken token) in /mnt/f/Temp/ss/ServiceStack.OrmLite/src/ServiceStack.OrmLite/OrmLiteDialectProviderBase.cs:line 1608
  241.    at ServiceStack.OrmLite.OrmLiteWriteCommandExtensionsAsync.ExecuteSqlAsync(IDbCommand dbCmd, String sql, CancellationToken token) in /mnt/f/Temp/ss/ServiceStack.OrmLite/src/ServiceStack.OrmLite/Async/OrmLiteWriteCommandExtensionsAsync.cs:line 36
  242.    at ServiceStack.OrmLite.OrmLiteWriteApiAsync.<>c__DisplayClass0_0.<ExecuteSqlAsync>b__0(IDbCommand dbCmd) in /mnt/f/Temp/ss/ServiceStack.OrmLite/src/ServiceStack.OrmLite/OrmLiteWriteApiAsync.cs:line 24
  243.    at ServiceStack.OrmLite.OrmLiteExecFilter.Exec[T](IDbConnection dbConn, Func`2 filter) in /mnt/f/Temp/ss/ServiceStack.OrmLite/src/ServiceStack.OrmLite/OrmLiteExecFilter.cs:line 124
  244.    at ServiceStack.OrmLite.OrmLiteReadExpressionsApi.Exec[T](IDbConnection dbConn, Func`2 filter) in /mnt/f/Temp/ss/ServiceStack.OrmLite/src/ServiceStack.OrmLite/OrmLiteReadExpressionsApi.cs:line 24
  245.    at ServiceStack.OrmLite.OrmLiteWriteApiAsync.ExecuteSqlAsync(IDbConnection dbConn, String sql, CancellationToken token) in /mnt/f/Temp/ss/ServiceStack.OrmLite/src/ServiceStack.OrmLite/OrmLiteWriteApiAsync.cs:line 24
  246.    at ServiceStack.OrmLite.Tests.Async.SqlServerProviderTestsAsync.<Can_SqlScalar_StoredProc_passing_null_parameter_Async>d__7.MoveNext() in /mnt/f/Temp/ss/ServiceStack.OrmLite/tests/ServiceStack.OrmLite.Tests/Async/SqlServerProviderTestsAsync.cs:line 190
  247. --- End of stack trace from previous location where exception was thrown ---
  248.    at System.Runtime.ExceptionServices.ExceptionDispatchInfo.Throw()
  249.    at NUnit.Framework.Internal.AsyncInvocationRegion.AsyncTaskInvocationRegion.WaitForPendingOperationsToComplete(Object invocationResult)
  250.    at NUnit.Framework.Internal.Commands.TestMethodCommand.RunAsyncTestMethod(TestExecutionContext context)
  251. Failed   Can_SqlScalar_StoredProc_returning_Scalar_Async
  252. Error Message:
  253.  Microsoft.Data.Sqlite.SqliteException : SQLite Error 1: 'near "IF": syntax error'.
  254. Stack Trace:
  255.    at Microsoft.Data.Sqlite.Interop.MarshalEx.ThrowExceptionForRC(Int32 rc, Sqlite3Handle db)
  256.    at Microsoft.Data.Sqlite.SqliteCommand.ExecuteReader(CommandBehavior behavior)
  257.    at Microsoft.Data.Sqlite.SqliteCommand.ExecuteNonQuery()
  258.    at ServiceStack.OrmLite.OrmLiteCommand.ExecuteNonQuery() in /mnt/f/Temp/ss/ServiceStack.OrmLite/src/ServiceStack.OrmLite/OrmLiteCommand.cs:line 43
  259.    at ServiceStack.OrmLite.OrmLiteDialectProviderBase`1.ExecuteNonQueryAsync(IDbCommand cmd, CancellationToken token) in /mnt/f/Temp/ss/ServiceStack.OrmLite/src/ServiceStack.OrmLite/OrmLiteDialectProviderBase.cs:line 1608
  260.    at ServiceStack.OrmLite.OrmLiteWriteCommandExtensionsAsync.ExecuteSqlAsync(IDbCommand dbCmd, String sql, CancellationToken token) in /mnt/f/Temp/ss/ServiceStack.OrmLite/src/ServiceStack.OrmLite/Async/OrmLiteWriteCommandExtensionsAsync.cs:line 36
  261.    at ServiceStack.OrmLite.OrmLiteWriteApiAsync.<>c__DisplayClass0_0.<ExecuteSqlAsync>b__0(IDbCommand dbCmd) in /mnt/f/Temp/ss/ServiceStack.OrmLite/src/ServiceStack.OrmLite/OrmLiteWriteApiAsync.cs:line 24
  262.    at ServiceStack.OrmLite.OrmLiteExecFilter.Exec[T](IDbConnection dbConn, Func`2 filter) in /mnt/f/Temp/ss/ServiceStack.OrmLite/src/ServiceStack.OrmLite/OrmLiteExecFilter.cs:line 124
  263.    at ServiceStack.OrmLite.OrmLiteReadExpressionsApi.Exec[T](IDbConnection dbConn, Func`2 filter) in /mnt/f/Temp/ss/ServiceStack.OrmLite/src/ServiceStack.OrmLite/OrmLiteReadExpressionsApi.cs:line 24
  264.    at ServiceStack.OrmLite.OrmLiteWriteApiAsync.ExecuteSqlAsync(IDbConnection dbConn, String sql, CancellationToken token) in /mnt/f/Temp/ss/ServiceStack.OrmLite/src/ServiceStack.OrmLite/OrmLiteWriteApiAsync.cs:line 24
  265.    at ServiceStack.OrmLite.Tests.Async.SqlServerProviderTestsAsync.<Can_SqlScalar_StoredProc_returning_Scalar_Async>d__6.MoveNext() in /mnt/f/Temp/ss/ServiceStack.OrmLite/tests/ServiceStack.OrmLite.Tests/Async/SqlServerProviderTestsAsync.cs:line 160
  266. --- End of stack trace from previous location where exception was thrown ---
  267.    at System.Runtime.ExceptionServices.ExceptionDispatchInfo.Throw()
  268.    at NUnit.Framework.Internal.AsyncInvocationRegion.AsyncTaskInvocationRegion.WaitForPendingOperationsToComplete(Object invocationResult)
  269.    at NUnit.Framework.Internal.Commands.TestMethodCommand.RunAsyncTestMethod(TestExecutionContext context)
  270. Failed   Does_return_UTC_Dates_with_UTC_DateStyle
  271. Error Message:
  272.    Expected: 2012-01-01 17:01:01
  273.   But was:  2012-01-01 09:01:01
  274.  
  275. Stack Trace:
  276. at ServiceStack.OrmLite.Tests.DateTimeTests.Does_return_UTC_Dates_with_UTC_DateStyle() in /mnt/f/Temp/ss/ServiceStack.OrmLite/tests/ServiceStack.OrmLite.Tests/DateTimeTests.cs:line 112
  277.  
  278. Skipped  CanCreateForeignWithOnDeleteNoAction
  279. Error Message:
  280.  Not supported in sqlite?
  281.  
  282. Failed   Allows_creation_of_10_tables
  283. Error Message:
  284.  TearDown : ServiceStack.LicenseException : This license is invalid. Please see servicestack.net or contact team@servicestack.net for more details.
  285.   ----> System.ArgumentNullException : Value cannot be null.
  286. Parameter name: input
  287. Stack Trace:
  288. --TearDown
  289.    at ServiceStack.LicenseUtils.RegisterLicense(String licenseKeyText) in C:\src\ServiceStack.Text\src\ServiceStack.Text\LicenseUtils.cs:line 210
  290.    at ServiceStack.OrmLite.Tests.FreeLicenseUsageTests.TearDown() in /mnt/f/Temp/ss/ServiceStack.OrmLite/tests/ServiceStack.OrmLite.Tests/LicenseUsageTests.cs:line 27
  291. --ArgumentNullException
  292.    at System.Text.RegularExpressions.Regex.Replace(String input, String replacement)
  293.    at System.Text.RegularExpressions.Regex.Replace(String input, String pattern, String replacement)
  294.    at ServiceStack.LicenseUtils.ToLicenseKeyFallback(String licenseKeyText) in C:\src\ServiceStack.Text\src\ServiceStack.Text\LicenseUtils.cs:line 402
  295.    at ServiceStack.LicenseUtils.RegisterLicense(String licenseKeyText) in C:\src\ServiceStack.Text\src\ServiceStack.Text\LicenseUtils.cs:line 205
  296. Failed   Throws_on_creation_of_11_tables
  297. Error Message:
  298.  TearDown : ServiceStack.LicenseException : This license is invalid. Please see servicestack.net or contact team@servicestack.net for more details.
  299.   ----> System.ArgumentNullException : Value cannot be null.
  300. Parameter name: input
  301. Stack Trace:
  302. --TearDown
  303.    at ServiceStack.LicenseUtils.RegisterLicense(String licenseKeyText) in C:\src\ServiceStack.Text\src\ServiceStack.Text\LicenseUtils.cs:line 210
  304.    at ServiceStack.OrmLite.Tests.FreeLicenseUsageTests.TearDown() in /mnt/f/Temp/ss/ServiceStack.OrmLite/tests/ServiceStack.OrmLite.Tests/LicenseUsageTests.cs:line 27
  305. --ArgumentNullException
  306.    at System.Text.RegularExpressions.Regex.Replace(String input, String replacement)
  307.    at System.Text.RegularExpressions.Regex.Replace(String input, String pattern, String replacement)
  308.    at ServiceStack.LicenseUtils.ToLicenseKeyFallback(String licenseKeyText) in C:\src\ServiceStack.Text\src\ServiceStack.Text\LicenseUtils.cs:line 402
  309.    at ServiceStack.LicenseUtils.RegisterLicense(String licenseKeyText) in C:\src\ServiceStack.Text\src\ServiceStack.Text\LicenseUtils.cs:line 205
  310. Not Run  Can_Insert_Update_record_across_multiple_threads
  311. Error Message:
  312.  OneTimeSetUp:
  313.  
  314. Not Run  Can_SaveAll_in_multiple_threads
  315. Error Message:
  316.  OneTimeSetUp:
  317.  
  318. Skipped  Simple_Perf_test_using_File_Sqlite
  319. Error Message:
  320.  OneTimeSetUp: Benchmark
  321.  
  322. Skipped  Simple_Perf_test_using_InMemory_Sqlite
  323. Error Message:
  324.  OneTimeSetUp: Benchmark
  325.  
  326. Skipped  Can_select_from_Custom_stored_procedure
  327. Error Message:
  328.  OneTimeSetUp: Requires existing tables / SP at https://gist.github.com/mythz/6f336094f8dd07c22d91
  329.  
  330. Skipped  Can_handle_sql_exceptions
  331. Error Message:
  332.  OneTimeSetUp: Initializing LogFactory needs to run stand-alone
  333.  
  334. Skipped  Does_log_all_statements
  335. Error Message:
  336.  OneTimeSetUp: Initializing LogFactory needs to run stand-alone
  337.  
  338. Failed   Can_GetById_from_basic_persistence_provider
  339. Error Message:
  340.    Expected: 2017-09-23 08:40:11.2059723 +/- 00:00:01
  341.   But was:  2017-09-23 22:40:11.2059723
  342.  
  343. Stack Trace:
  344. at ServiceStack.Common.Tests.Models.ModelWithFieldsOfDifferentTypes.AssertIsEqual(ModelWithFieldsOfDifferentTypes actual, ModelWithFieldsOfDifferentTypes expected) in /mnt/f/Temp/ss/ServiceStack.OrmLite/tests/ServiceStack.OrmLite.Tests/Shared/ModelWithFieldsOfDifferentTypes.cs:line 184
  345. at ServiceStack.OrmLite.Tests.OrmLiteBasicPersistenceProviderTests.Can_GetById_from_basic_persistence_provider() in /mnt/f/Temp/ss/ServiceStack.OrmLite/tests/ServiceStack.OrmLite.Tests/OrmLiteBasicPersistenceProviderTests.cs:line 27
  346.  
  347. Standard Output Messages:
  348.  ERROR: Trouble with DateTime precisions, trying Assert again with rounding to seconds, Exception:   Expected: 2017-09-23 08:40:11.2059723
  349.    But was:  2017-09-23 22:40:11.2059723
  350.  
  351.  
  352. inner :14
  353. inner :17
  354. [
  355.    
  356. ]
  357. Failed   Can_change_schema_definitions
  358. Error Message:
  359.    Expected: 2014-01-01 00:00:00
  360.   But was:  2014-01-01 08:00:00
  361.  
  362. Stack Trace:
  363. at ServiceStack.OrmLite.Tests.OrmLiteCreateTableTests.Can_change_schema_definitions() in /mnt/f/Temp/ss/ServiceStack.OrmLite/tests/ServiceStack.OrmLite.Tests/OrmLiteCreateTableTests.cs:line 159
  364.  
  365. Failed   Can_Delete_from_ModelWithFieldsOfDifferentTypes_table
  366. Error Message:
  367.    Expected: equivalent to < 1, 3 >
  368.   But was:  < 1, 2, 3 >
  369.  
  370. Stack Trace:
  371. at ServiceStack.OrmLite.Tests.OrmLiteDeleteTests.Can_Delete_from_ModelWithFieldsOfDifferentTypes_table() in /mnt/f/Temp/ss/ServiceStack.OrmLite/tests/ServiceStack.OrmLite.Tests/OrmLiteDeleteTests.cs:line 67
  372.  
  373. Failed   Does_call_Filters_on_insert_and_update
  374. Error Message:
  375.    Expected: 2014-01-01 00:00:00
  376.   But was:  2014-01-01 08:00:00
  377.  
  378. Stack Trace:
  379. at ServiceStack.OrmLite.Tests.OrmLiteFiltersTests.Does_call_Filters_on_insert_and_update() in /mnt/f/Temp/ss/ServiceStack.OrmLite/tests/ServiceStack.OrmLite.Tests/OrmLiteFiltersTests.cs:line 76
  380.  
  381. Failed   Does_call_Filters_on_Save
  382. Error Message:
  383.    Expected: 2014-01-01 00:00:00
  384.   But was:  2014-01-01 08:00:00
  385.  
  386. Stack Trace:
  387. at ServiceStack.OrmLite.Tests.OrmLiteFiltersTests.Does_call_Filters_on_Save() in /mnt/f/Temp/ss/ServiceStack.OrmLite/tests/ServiceStack.OrmLite.Tests/OrmLiteFiltersTests.cs:line 129
  388.  
  389. Failed   Can_get_scalar_value
  390. Error Message:
  391.    Expected: 1997-09-22 16:00:00
  392.   But was:  1997-09-22 00:00:00
  393.  
  394. Stack Trace:
  395. at ServiceStack.OrmLite.Tests.OrmLiteGetScalarTests.Can_get_scalar_value() in /mnt/f/Temp/ss/ServiceStack.OrmLite/tests/ServiceStack.OrmLite.Tests/OrmLiteGetScalarTests.cs:line 56
  396.  
  397. Failed   Can_insert_and_select_from_ModelWithFieldsOfDifferentAndNullableTypes_table
  398. Error Message:
  399.    Expected: 2017-09-23 08:40:12.1137081 +/- 00:00:01
  400.   But was:  2017-09-23 22:40:12.1137081
  401.  
  402. Stack Trace:
  403. at ServiceStack.Common.Tests.Models.ModelWithFieldsOfDifferentAndNullableTypes.AssertIsEqual(ModelWithFieldsOfDifferentAndNullableTypes actual, ModelWithFieldsOfDifferentAndNullableTypes expected) in /mnt/f/Temp/ss/ServiceStack.OrmLite/tests/ServiceStack.OrmLite.Tests/Shared/ModelWithFieldsOfDifferentAndNullableTypes.cs:line 84
  404. at ServiceStack.OrmLite.Tests.OrmLiteInsertTests.Can_insert_and_select_from_ModelWithFieldsOfDifferentAndNullableTypes_table() in /mnt/f/Temp/ss/ServiceStack.OrmLite/tests/ServiceStack.OrmLite.Tests/OrmLiteInsertTests.cs:line 110
  405.  
  406. Standard Output Messages:
  407.  [
  408.     {
  409.         Id: 1,
  410.         LongId: 1000,
  411.         Guid: 1dbfd4ceb2c04c14bff6b9623ef889e5,
  412.         Bool: False,
  413.         DateTime: 2017-09-23T22:40:12.1137081Z,
  414.         Float: 2.11000013,
  415.         Double: 2.11,
  416.         Decimal: 1.5,
  417.         TimeSpan: PT1S
  418.     }
  419.  ]
  420.  
  421. Failed   Can_insert_and_select_from_ModelWithFieldsOfDifferentTypes_table
  422. Error Message:
  423.    Expected: 2017-09-23 08:40:12.1520007 +/- 00:00:01
  424.   But was:  2017-09-23 22:40:12.1520007
  425.  
  426. Stack Trace:
  427. at ServiceStack.Common.Tests.Models.ModelWithFieldsOfDifferentTypes.AssertIsEqual(ModelWithFieldsOfDifferentTypes actual, ModelWithFieldsOfDifferentTypes expected) in /mnt/f/Temp/ss/ServiceStack.OrmLite/tests/ServiceStack.OrmLite.Tests/Shared/ModelWithFieldsOfDifferentTypes.cs:line 184
  428. at ServiceStack.OrmLite.Tests.OrmLiteInsertTests.Can_insert_and_select_from_ModelWithFieldsOfDifferentTypes_table() in /mnt/f/Temp/ss/ServiceStack.OrmLite/tests/ServiceStack.OrmLite.Tests/OrmLiteInsertTests.cs:line 70
  429.  
  430. Standard Output Messages:
  431.  ERROR: Trouble with DateTime precisions, trying Assert again with rounding to seconds, Exception:   Expected: 2017-09-23 08:40:12.1520007
  432.    But was:  2017-09-23 22:40:12.1520007
  433.  
  434.  
  435. Failed   Can_insert_and_select_from_ModelWithFieldsOfNullableTypes_table
  436. Error Message:
  437.    Expected: 2017-09-23 08:40:12.1592864 +/- 00:00:01
  438.   But was:  2017-09-23 22:40:12.1592864
  439.  
  440. Stack Trace:
  441. at ServiceStack.Common.Tests.Models.ModelWithFieldsOfNullableTypes.AssertIsEqual(ModelWithFieldsOfNullableTypes actual, ModelWithFieldsOfNullableTypes expected) in /mnt/f/Temp/ss/ServiceStack.OrmLite/tests/ServiceStack.OrmLite.Tests/Shared/ModelWithFieldsOfNullableTypes.cs:line 79
  442. at ServiceStack.OrmLite.Tests.OrmLiteInsertTests.Can_insert_and_select_from_ModelWithFieldsOfNullableTypes_table() in /mnt/f/Temp/ss/ServiceStack.OrmLite/tests/ServiceStack.OrmLite.Tests/OrmLiteInsertTests.cs:line 89
  443.  
  444. Failed   Can_insert_TaskQueue_table
  445. Error Message:
  446.    Expected: 2017-09-22 08:40:12.1854856 +/- 00:00:01
  447.   But was:  2017-09-22 22:40:12.1854856
  448.  
  449. Stack Trace:
  450. at ServiceStack.Common.Tests.Models.TaskQueue.AssertIsEqual(TaskQueue actual, TaskQueue expected) in /mnt/f/Temp/ss/ServiceStack.OrmLite/tests/ServiceStack.OrmLite.Tests/Shared/TaskQueue.cs:line 60
  451. at ServiceStack.OrmLite.Tests.OrmLiteInsertTests.Can_insert_TaskQueue_table() in /mnt/f/Temp/ss/ServiceStack.OrmLite/tests/ServiceStack.OrmLite.Tests/OrmLiteInsertTests.cs:line 223
  452.  
  453. Failed   Can_query_CustomerDto_and_map_db_fields_not_identical_by_guessing_the_mapping("customer_id","customer_name","customer_birth_date")
  454. Error Message:
  455.    Expected: 1970-01-01 00:00:00
  456.   But was:  1970-01-01 08:00:00
  457.  
  458. Stack Trace:
  459. at ServiceStack.OrmLite.Tests.OrmLiteQueryTests.Can_query_CustomerDto_and_map_db_fields_not_identical_by_guessing_the_mapping(String field1Name, String field2Name, String field3Name) in /mnt/f/Temp/ss/ServiceStack.OrmLite/tests/ServiceStack.OrmLite.Tests/OrmLiteQueryTests.cs:line 263
  460.  
  461. Failed   Can_query_CustomerDto_and_map_db_fields_not_identical_by_guessing_the_mapping("customerid%","@customername","customer_b^irth_date")
  462. Error Message:
  463.    Expected: 1970-01-01 00:00:00
  464.   But was:  1970-01-01 08:00:00
  465.  
  466. Stack Trace:
  467. at ServiceStack.OrmLite.Tests.OrmLiteQueryTests.Can_query_CustomerDto_and_map_db_fields_not_identical_by_guessing_the_mapping(String field1Name, String field2Name, String field3Name) in /mnt/f/Temp/ss/ServiceStack.OrmLite/tests/ServiceStack.OrmLite.Tests/OrmLiteQueryTests.cs:line 263
  468.  
  469. Failed   Can_query_CustomerDto_and_map_db_fields_not_identical_by_guessing_the_mapping("customerid_%","@customer_name","customer$_birth_#date")
  470. Error Message:
  471.    Expected: 1970-01-01 00:00:00
  472.   But was:  1970-01-01 08:00:00
  473.  
  474. Stack Trace:
  475. at ServiceStack.OrmLite.Tests.OrmLiteQueryTests.Can_query_CustomerDto_and_map_db_fields_not_identical_by_guessing_the_mapping(String field1Name, String field2Name, String field3Name) in /mnt/f/Temp/ss/ServiceStack.OrmLite/tests/ServiceStack.OrmLite.Tests/OrmLiteQueryTests.cs:line 263
  476.  
  477. Failed   Can_query_CustomerDto_and_map_db_fields_not_identical_by_guessing_the_mapping("c!u@s#t$o%m^e&r*i(d_%","__cus_tomer__nam_e__","~cus^tomer$_birth_#date")
  478. Error Message:
  479.    Expected: 1970-01-01 00:00:00
  480.   But was:  1970-01-01 08:00:00
  481.  
  482. Stack Trace:
  483. at ServiceStack.OrmLite.Tests.OrmLiteQueryTests.Can_query_CustomerDto_and_map_db_fields_not_identical_by_guessing_the_mapping(String field1Name, String field2Name, String field3Name) in /mnt/f/Temp/ss/ServiceStack.OrmLite/tests/ServiceStack.OrmLite.Tests/OrmLiteQueryTests.cs:line 263
  484.  
  485. Failed   Can_query_CustomerDto_and_map_db_fields_not_identical_by_guessing_the_mapping("t030CustomerId","t030CustomerName","t030Customer_birth_date")
  486. Error Message:
  487.    Expected: 1970-01-01 00:00:00
  488.   But was:  1970-01-01 08:00:00
  489.  
  490. Stack Trace:
  491. at ServiceStack.OrmLite.Tests.OrmLiteQueryTests.Can_query_CustomerDto_and_map_db_fields_not_identical_by_guessing_the_mapping(String field1Name, String field2Name, String field3Name) in /mnt/f/Temp/ss/ServiceStack.OrmLite/tests/ServiceStack.OrmLite.Tests/OrmLiteQueryTests.cs:line 263
  492.  
  493. Failed   Can_query_CustomerDto_and_map_db_fields_not_identical_by_guessing_the_mapping("t030_customer_id","t030_customer_name","t130_customer_birth_date")
  494. Error Message:
  495.    Expected: 1970-01-01 00:00:00
  496.   But was:  1970-01-01 08:00:00
  497.  
  498. Stack Trace:
  499. at ServiceStack.OrmLite.Tests.OrmLiteQueryTests.Can_query_CustomerDto_and_map_db_fields_not_identical_by_guessing_the_mapping(String field1Name, String field2Name, String field3Name) in /mnt/f/Temp/ss/ServiceStack.OrmLite/tests/ServiceStack.OrmLite.Tests/OrmLiteQueryTests.cs:line 263
  500.  
  501. Failed   Can_query_CustomerDto_and_map_db_fields_not_identical_by_guessing_the_mapping("t030#Customer_I#d","t030CustomerNa$^me","t030Cust^omer_birth_date")
  502. Error Message:
  503.    Expected: 1970-01-01 00:00:00
  504.   But was:  1970-01-01 08:00:00
  505.  
  506. Stack Trace:
  507. at ServiceStack.OrmLite.Tests.OrmLiteQueryTests.Can_query_CustomerDto_and_map_db_fields_not_identical_by_guessing_the_mapping(String field1Name, String field2Name, String field3Name) in /mnt/f/Temp/ss/ServiceStack.OrmLite/tests/ServiceStack.OrmLite.Tests/OrmLiteQueryTests.cs:line 263
  508.  
  509. Failed   Can_Save_and_select_from_ModelWithFieldsOfDifferentTypes_table
  510. Error Message:
  511.    Expected: 2017-09-23 08:40:12.400388 +/- 00:00:01
  512.   But was:  2017-09-23 22:40:12.400388
  513.  
  514. Stack Trace:
  515. at ServiceStack.Common.Tests.Models.ModelWithFieldsOfDifferentTypes.AssertIsEqual(ModelWithFieldsOfDifferentTypes actual, ModelWithFieldsOfDifferentTypes expected) in /mnt/f/Temp/ss/ServiceStack.OrmLite/tests/ServiceStack.OrmLite.Tests/Shared/ModelWithFieldsOfDifferentTypes.cs:line 184
  516. at ServiceStack.OrmLite.Tests.OrmLiteSaveTests.Can_Save_and_select_from_ModelWithFieldsOfDifferentTypes_table() in /mnt/f/Temp/ss/ServiceStack.OrmLite/tests/ServiceStack.OrmLite.Tests/OrmLiteSaveTests.cs:line 256
  517.  
  518. Standard Output Messages:
  519.  ERROR: Trouble with DateTime precisions, trying Assert again with rounding to seconds, Exception:   Expected: 2017-09-23 08:40:12.400388
  520.    But was:  2017-09-23 22:40:12.400388
  521.  
  522.  
  523. Failed   Can_Save_TaskQueue_table
  524. Error Message:
  525.    Expected: 2017-09-22 08:40:12.4090923 +/- 00:00:01
  526.   But was:  2017-09-22 22:40:12.4090923
  527.  
  528. Stack Trace:
  529. at ServiceStack.Common.Tests.Models.TaskQueue.AssertIsEqual(TaskQueue actual, TaskQueue expected) in /mnt/f/Temp/ss/ServiceStack.OrmLite/tests/ServiceStack.OrmLite.Tests/Shared/TaskQueue.cs:line 60
  530. at ServiceStack.OrmLite.Tests.OrmLiteSaveTests.Can_Save_TaskQueue_table() in /mnt/f/Temp/ss/ServiceStack.OrmLite/tests/ServiceStack.OrmLite.Tests/OrmLiteSaveTests.cs:line 334
  531.  
  532. Failed   Can_update_ModelWithFieldsOfDifferentTypes_table
  533. Error Message:
  534.    Expected: 2017-09-23 08:40:12.5413266 +/- 00:00:01
  535.   But was:  2017-09-23 22:40:12.5413266
  536.  
  537. Stack Trace:
  538. at ServiceStack.Common.Tests.Models.ModelWithFieldsOfDifferentTypes.AssertIsEqual(ModelWithFieldsOfDifferentTypes actual, ModelWithFieldsOfDifferentTypes expected) in /mnt/f/Temp/ss/ServiceStack.OrmLite/tests/ServiceStack.OrmLite.Tests/Shared/ModelWithFieldsOfDifferentTypes.cs:line 184
  539. at ServiceStack.OrmLite.Tests.OrmLiteUpdateTests.Can_update_ModelWithFieldsOfDifferentTypes_table() in /mnt/f/Temp/ss/ServiceStack.OrmLite/tests/ServiceStack.OrmLite.Tests/OrmLiteUpdateTests.cs:line 40
  540.  
  541. Standard Output Messages:
  542.  ERROR: Trouble with DateTime precisions, trying Assert again with rounding to seconds, Exception:   Expected: 2017-09-23 08:40:12.5413266
  543.    But was:  2017-09-23 22:40:12.5413266
  544.  
  545.  
  546. Failed   Can_update_ModelWithFieldsOfDifferentTypes_table_with_commandFilter
  547. Error Message:
  548.    Expected: 2017-09-23 08:40:12.5481028 +/- 00:00:01
  549.   But was:  2017-09-23 22:40:12.5481028
  550.  
  551. Stack Trace:
  552. at ServiceStack.Common.Tests.Models.ModelWithFieldsOfDifferentTypes.AssertIsEqual(ModelWithFieldsOfDifferentTypes actual, ModelWithFieldsOfDifferentTypes expected) in /mnt/f/Temp/ss/ServiceStack.OrmLite/tests/ServiceStack.OrmLite.Tests/Shared/ModelWithFieldsOfDifferentTypes.cs:line 184
  553. at ServiceStack.OrmLite.Tests.OrmLiteUpdateTests.Can_update_ModelWithFieldsOfDifferentTypes_table_with_commandFilter() in /mnt/f/Temp/ss/ServiceStack.OrmLite/tests/ServiceStack.OrmLite.Tests/OrmLiteUpdateTests.cs:line 59
  554.  
  555. Standard Output Messages:
  556.  UPDATE "ModelWithFieldsOfDifferentTypes" SET "Name"=@Name, "Int"=@Int, "Long"=@Long, "Guid"=@Guid, "Bool"=@Bool, "DateTime"=@DateTime, "TimeSpan"=@TimeSpan, "Double"=@Double, "Decimal"=@Decimal WHERE "Id"=@Id
  557.  ERROR: Trouble with DateTime precisions, trying Assert again with rounding to seconds, Exception:   Expected: 2017-09-23 08:40:12.5481028
  558.    But was:  2017-09-23 22:40:12.5481028
  559.  
  560.  
  561. Failed   Can_update_ModelWithFieldsOfDifferentTypes_table_with_filter
  562. Error Message:
  563.    Expected: 2017-09-23 08:40:12.5555239 +/- 00:00:01
  564.   But was:  2017-09-23 22:40:12.5555239
  565.  
  566. Stack Trace:
  567. at ServiceStack.Common.Tests.Models.ModelWithFieldsOfDifferentTypes.AssertIsEqual(ModelWithFieldsOfDifferentTypes actual, ModelWithFieldsOfDifferentTypes expected) in /mnt/f/Temp/ss/ServiceStack.OrmLite/tests/ServiceStack.OrmLite.Tests/Shared/ModelWithFieldsOfDifferentTypes.cs:line 184
  568. at ServiceStack.OrmLite.Tests.OrmLiteUpdateTests.Can_update_ModelWithFieldsOfDifferentTypes_table_with_filter() in /mnt/f/Temp/ss/ServiceStack.OrmLite/tests/ServiceStack.OrmLite.Tests/OrmLiteUpdateTests.cs:line 78
  569.  
  570. Standard Output Messages:
  571.  ERROR: Trouble with DateTime precisions, trying Assert again with rounding to seconds, Exception:   Expected: 2017-09-23 08:40:12.5555239
  572.    But was:  2017-09-23 22:40:12.5555239
  573.  
  574.  
  575. Failed   Can_update_with_anonymousType_and_expr_filter
  576. Error Message:
  577.    Expected: 2017-09-22 08:40:12.5775142 +/- 00:00:01
  578.   But was:  2017-09-22 22:40:12.5775142
  579.  
  580. Stack Trace:
  581. at ServiceStack.Common.Tests.Models.ModelWithFieldsOfDifferentTypes.AssertIsEqual(ModelWithFieldsOfDifferentTypes actual, ModelWithFieldsOfDifferentTypes expected) in /mnt/f/Temp/ss/ServiceStack.OrmLite/tests/ServiceStack.OrmLite.Tests/Shared/ModelWithFieldsOfDifferentTypes.cs:line 184
  582. at ServiceStack.OrmLite.Tests.OrmLiteUpdateTests.Can_update_with_anonymousType_and_expr_filter() in /mnt/f/Temp/ss/ServiceStack.OrmLite/tests/ServiceStack.OrmLite.Tests/OrmLiteUpdateTests.cs:line 98
  583.  
  584. Standard Output Messages:
  585.  {
  586.     Id: 1,
  587.     Name: UpdatedName,
  588.     Int: 11,
  589.     Long: 1000,
  590.     Guid: 649665cbfc3442c5b92102ad6dc5f350,
  591.     Bool: False,
  592.     DateTime: 2017-09-22T22:40:12.5775142Z,
  593.     TimeSpan: PT0S,
  594.     Double: 2.11,
  595.     Decimal: 3.22
  596.  }
  597.  ERROR: Trouble with DateTime precisions, trying Assert again with rounding to seconds, Exception:   Expected: 2017-09-22 08:40:12.5775142
  598.    But was:  2017-09-22 22:40:12.5775142
  599.  
  600.  
  601. Not Run  Is_GetValue_Slow
  602. Error Message:
  603.  OneTimeSetUp:
  604.  
  605. Skipped  Can_create_ReadOnly_connection
  606. Error Message:
  607.  Not supported in latest sqlite
  608.  
  609. Skipped  Can_create_table_with_ReadOnly_connection
  610. Error Message:
  611.  Not supported in latest sqlite
  612.  
  613. Failed   Can_SqlColumn_StoredProc_returning_Column
  614. Error Message:
  615.  Microsoft.Data.Sqlite.SqliteException : SQLite Error 1: 'near "IF": syntax error'.
  616. Stack Trace:
  617.    at Microsoft.Data.Sqlite.Interop.MarshalEx.ThrowExceptionForRC(Int32 rc, Sqlite3Handle db)
  618.    at Microsoft.Data.Sqlite.SqliteCommand.ExecuteReader(CommandBehavior behavior)
  619.    at Microsoft.Data.Sqlite.SqliteCommand.ExecuteNonQuery()
  620.    at ServiceStack.OrmLite.OrmLiteCommand.ExecuteNonQuery() in /mnt/f/Temp/ss/ServiceStack.OrmLite/src/ServiceStack.OrmLite/OrmLiteCommand.cs:line 43
  621.    at ServiceStack.OrmLite.OrmLiteWriteCommandExtensions.ExecuteSql(IDbCommand dbCmd, String sql, IEnumerable`1 sqlParams) in /mnt/f/Temp/ss/ServiceStack.OrmLite/src/ServiceStack.OrmLite/OrmLiteWriteCommandExtensions.cs:line 231
  622.    at ServiceStack.OrmLite.OrmLiteWriteApi.<>c__DisplayClass2_0.<ExecuteSql>b__0(IDbCommand dbCmd) in /mnt/f/Temp/ss/ServiceStack.OrmLite/src/ServiceStack.OrmLite/OrmLiteWriteApi.cs:line 46
  623.    at ServiceStack.OrmLite.OrmLiteExecFilter.Exec[T](IDbConnection dbConn, Func`2 filter) in /mnt/f/Temp/ss/ServiceStack.OrmLite/src/ServiceStack.OrmLite/OrmLiteExecFilter.cs:line 67
  624.    at ServiceStack.OrmLite.OrmLiteReadExpressionsApi.Exec[T](IDbConnection dbConn, Func`2 filter) in /mnt/f/Temp/ss/ServiceStack.OrmLite/src/ServiceStack.OrmLite/OrmLiteReadExpressionsApi.cs:line 14
  625.    at ServiceStack.OrmLite.OrmLiteWriteApi.ExecuteSql(IDbConnection dbConn, String sql) in /mnt/f/Temp/ss/ServiceStack.OrmLite/src/ServiceStack.OrmLite/OrmLiteWriteApi.cs:line 46
  626.    at ServiceStack.OrmLite.Tests.SqlServerProviderTests.Can_SqlColumn_StoredProc_returning_Column() in /mnt/f/Temp/ss/ServiceStack.OrmLite/tests/ServiceStack.OrmLite.Tests/SqlServerProviderTests.cs:line 104
  627. Failed   Can_SqlColumn_StoredProc_returning_StringColumn
  628. Error Message:
  629.  Microsoft.Data.Sqlite.SqliteException : SQLite Error 1: 'near "IF": syntax error'.
  630. Stack Trace:
  631.    at Microsoft.Data.Sqlite.Interop.MarshalEx.ThrowExceptionForRC(Int32 rc, Sqlite3Handle db)
  632.    at Microsoft.Data.Sqlite.SqliteCommand.ExecuteReader(CommandBehavior behavior)
  633.    at Microsoft.Data.Sqlite.SqliteCommand.ExecuteNonQuery()
  634.    at ServiceStack.OrmLite.OrmLiteCommand.ExecuteNonQuery() in /mnt/f/Temp/ss/ServiceStack.OrmLite/src/ServiceStack.OrmLite/OrmLiteCommand.cs:line 43
  635.    at ServiceStack.OrmLite.OrmLiteWriteCommandExtensions.ExecuteSql(IDbCommand dbCmd, String sql, IEnumerable`1 sqlParams) in /mnt/f/Temp/ss/ServiceStack.OrmLite/src/ServiceStack.OrmLite/OrmLiteWriteCommandExtensions.cs:line 231
  636.    at ServiceStack.OrmLite.OrmLiteWriteApi.<>c__DisplayClass2_0.<ExecuteSql>b__0(IDbCommand dbCmd) in /mnt/f/Temp/ss/ServiceStack.OrmLite/src/ServiceStack.OrmLite/OrmLiteWriteApi.cs:line 46
  637.    at ServiceStack.OrmLite.OrmLiteExecFilter.Exec[T](IDbConnection dbConn, Func`2 filter) in /mnt/f/Temp/ss/ServiceStack.OrmLite/src/ServiceStack.OrmLite/OrmLiteExecFilter.cs:line 67
  638.    at ServiceStack.OrmLite.OrmLiteReadExpressionsApi.Exec[T](IDbConnection dbConn, Func`2 filter) in /mnt/f/Temp/ss/ServiceStack.OrmLite/src/ServiceStack.OrmLite/OrmLiteReadExpressionsApi.cs:line 14
  639.    at ServiceStack.OrmLite.OrmLiteWriteApi.ExecuteSql(IDbConnection dbConn, String sql) in /mnt/f/Temp/ss/ServiceStack.OrmLite/src/ServiceStack.OrmLite/OrmLiteWriteApi.cs:line 46
  640.    at ServiceStack.OrmLite.Tests.SqlServerProviderTests.Can_SqlColumn_StoredProc_returning_StringColumn() in /mnt/f/Temp/ss/ServiceStack.OrmLite/tests/ServiceStack.OrmLite.Tests/SqlServerProviderTests.cs:line 147
  641. Failed   Can_SqlList_StoredProc_passing_null_parameter
  642. Error Message:
  643.  Microsoft.Data.Sqlite.SqliteException : SQLite Error 1: 'near "IF": syntax error'.
  644. Stack Trace:
  645.    at Microsoft.Data.Sqlite.Interop.MarshalEx.ThrowExceptionForRC(Int32 rc, Sqlite3Handle db)
  646.    at Microsoft.Data.Sqlite.SqliteCommand.ExecuteReader(CommandBehavior behavior)
  647.    at Microsoft.Data.Sqlite.SqliteCommand.ExecuteNonQuery()
  648.    at ServiceStack.OrmLite.OrmLiteCommand.ExecuteNonQuery() in /mnt/f/Temp/ss/ServiceStack.OrmLite/src/ServiceStack.OrmLite/OrmLiteCommand.cs:line 43
  649.    at ServiceStack.OrmLite.OrmLiteWriteCommandExtensions.ExecuteSql(IDbCommand dbCmd, String sql, IEnumerable`1 sqlParams) in /mnt/f/Temp/ss/ServiceStack.OrmLite/src/ServiceStack.OrmLite/OrmLiteWriteCommandExtensions.cs:line 231
  650.    at ServiceStack.OrmLite.OrmLiteWriteApi.<>c__DisplayClass2_0.<ExecuteSql>b__0(IDbCommand dbCmd) in /mnt/f/Temp/ss/ServiceStack.OrmLite/src/ServiceStack.OrmLite/OrmLiteWriteApi.cs:line 46
  651.    at ServiceStack.OrmLite.OrmLiteExecFilter.Exec[T](IDbConnection dbConn, Func`2 filter) in /mnt/f/Temp/ss/ServiceStack.OrmLite/src/ServiceStack.OrmLite/OrmLiteExecFilter.cs:line 67
  652.    at ServiceStack.OrmLite.OrmLiteReadExpressionsApi.Exec[T](IDbConnection dbConn, Func`2 filter) in /mnt/f/Temp/ss/ServiceStack.OrmLite/src/ServiceStack.OrmLite/OrmLiteReadExpressionsApi.cs:line 14
  653.    at ServiceStack.OrmLite.OrmLiteWriteApi.ExecuteSql(IDbConnection dbConn, String sql) in /mnt/f/Temp/ss/ServiceStack.OrmLite/src/ServiceStack.OrmLite/OrmLiteWriteApi.cs:line 46
  654.    at ServiceStack.OrmLite.Tests.SqlServerProviderTests.Can_SqlList_StoredProc_passing_null_parameter() in /mnt/f/Temp/ss/ServiceStack.OrmLite/tests/ServiceStack.OrmLite.Tests/SqlServerProviderTests.cs:line 229
  655. Failed   Can_SqlList_StoredProc_receiving_only_first_column_and_null
  656. Error Message:
  657.  Microsoft.Data.Sqlite.SqliteException : SQLite Error 1: 'near "IF": syntax error'.
  658. Stack Trace:
  659.    at Microsoft.Data.Sqlite.Interop.MarshalEx.ThrowExceptionForRC(Int32 rc, Sqlite3Handle db)
  660.    at Microsoft.Data.Sqlite.SqliteCommand.ExecuteReader(CommandBehavior behavior)
  661.    at Microsoft.Data.Sqlite.SqliteCommand.ExecuteNonQuery()
  662.    at ServiceStack.OrmLite.OrmLiteCommand.ExecuteNonQuery() in /mnt/f/Temp/ss/ServiceStack.OrmLite/src/ServiceStack.OrmLite/OrmLiteCommand.cs:line 43
  663.    at ServiceStack.OrmLite.OrmLiteWriteCommandExtensions.ExecuteSql(IDbCommand dbCmd, String sql, IEnumerable`1 sqlParams) in /mnt/f/Temp/ss/ServiceStack.OrmLite/src/ServiceStack.OrmLite/OrmLiteWriteCommandExtensions.cs:line 231
  664.    at ServiceStack.OrmLite.OrmLiteWriteApi.<>c__DisplayClass2_0.<ExecuteSql>b__0(IDbCommand dbCmd) in /mnt/f/Temp/ss/ServiceStack.OrmLite/src/ServiceStack.OrmLite/OrmLiteWriteApi.cs:line 46
  665.    at ServiceStack.OrmLite.OrmLiteExecFilter.Exec[T](IDbConnection dbConn, Func`2 filter) in /mnt/f/Temp/ss/ServiceStack.OrmLite/src/ServiceStack.OrmLite/OrmLiteExecFilter.cs:line 67
  666.    at ServiceStack.OrmLite.OrmLiteReadExpressionsApi.Exec[T](IDbConnection dbConn, Func`2 filter) in /mnt/f/Temp/ss/ServiceStack.OrmLite/src/ServiceStack.OrmLite/OrmLiteReadExpressionsApi.cs:line 14
  667.    at ServiceStack.OrmLite.OrmLiteWriteApi.ExecuteSql(IDbConnection dbConn, String sql) in /mnt/f/Temp/ss/ServiceStack.OrmLite/src/ServiceStack.OrmLite/OrmLiteWriteApi.cs:line 46
  668.    at ServiceStack.OrmLite.Tests.SqlServerProviderTests.Can_SqlList_StoredProc_receiving_only_first_column_and_null() in /mnt/f/Temp/ss/ServiceStack.OrmLite/tests/ServiceStack.OrmLite.Tests/SqlServerProviderTests.cs:line 250
  669. Failed   Can_SqlList_StoredProc_returning_Table
  670. Error Message:
  671.  Microsoft.Data.Sqlite.SqliteException : SQLite Error 1: 'near "IF": syntax error'.
  672. Stack Trace:
  673.    at Microsoft.Data.Sqlite.Interop.MarshalEx.ThrowExceptionForRC(Int32 rc, Sqlite3Handle db)
  674.    at Microsoft.Data.Sqlite.SqliteCommand.ExecuteReader(CommandBehavior behavior)
  675.    at Microsoft.Data.Sqlite.SqliteCommand.ExecuteNonQuery()
  676.    at ServiceStack.OrmLite.OrmLiteCommand.ExecuteNonQuery() in /mnt/f/Temp/ss/ServiceStack.OrmLite/src/ServiceStack.OrmLite/OrmLiteCommand.cs:line 43
  677.    at ServiceStack.OrmLite.OrmLiteWriteCommandExtensions.ExecuteSql(IDbCommand dbCmd, String sql, IEnumerable`1 sqlParams) in /mnt/f/Temp/ss/ServiceStack.OrmLite/src/ServiceStack.OrmLite/OrmLiteWriteCommandExtensions.cs:line 231
  678.    at ServiceStack.OrmLite.OrmLiteWriteApi.<>c__DisplayClass2_0.<ExecuteSql>b__0(IDbCommand dbCmd) in /mnt/f/Temp/ss/ServiceStack.OrmLite/src/ServiceStack.OrmLite/OrmLiteWriteApi.cs:line 46
  679.    at ServiceStack.OrmLite.OrmLiteExecFilter.Exec[T](IDbConnection dbConn, Func`2 filter) in /mnt/f/Temp/ss/ServiceStack.OrmLite/src/ServiceStack.OrmLite/OrmLiteExecFilter.cs:line 67
  680.    at ServiceStack.OrmLite.OrmLiteReadExpressionsApi.Exec[T](IDbConnection dbConn, Func`2 filter) in /mnt/f/Temp/ss/ServiceStack.OrmLite/src/ServiceStack.OrmLite/OrmLiteReadExpressionsApi.cs:line 14
  681.    at ServiceStack.OrmLite.OrmLiteWriteApi.ExecuteSql(IDbConnection dbConn, String sql) in /mnt/f/Temp/ss/ServiceStack.OrmLite/src/ServiceStack.OrmLite/OrmLiteWriteApi.cs:line 46
  682.    at ServiceStack.OrmLite.Tests.SqlServerProviderTests.Can_SqlList_StoredProc_returning_Table() in /mnt/f/Temp/ss/ServiceStack.OrmLite/tests/ServiceStack.OrmLite.Tests/SqlServerProviderTests.cs:line 61
  683. Failed   Can_SqlScalar_StoredProc_passing_null_parameter
  684. Error Message:
  685.  Microsoft.Data.Sqlite.SqliteException : SQLite Error 1: 'near "IF": syntax error'.
  686. Stack Trace:
  687.    at Microsoft.Data.Sqlite.Interop.MarshalEx.ThrowExceptionForRC(Int32 rc, Sqlite3Handle db)
  688.    at Microsoft.Data.Sqlite.SqliteCommand.ExecuteReader(CommandBehavior behavior)
  689.    at Microsoft.Data.Sqlite.SqliteCommand.ExecuteNonQuery()
  690.    at ServiceStack.OrmLite.OrmLiteCommand.ExecuteNonQuery() in /mnt/f/Temp/ss/ServiceStack.OrmLite/src/ServiceStack.OrmLite/OrmLiteCommand.cs:line 43
  691.    at ServiceStack.OrmLite.OrmLiteWriteCommandExtensions.ExecuteSql(IDbCommand dbCmd, String sql, IEnumerable`1 sqlParams) in /mnt/f/Temp/ss/ServiceStack.OrmLite/src/ServiceStack.OrmLite/OrmLiteWriteCommandExtensions.cs:line 231
  692.    at ServiceStack.OrmLite.OrmLiteWriteApi.<>c__DisplayClass2_0.<ExecuteSql>b__0(IDbCommand dbCmd) in /mnt/f/Temp/ss/ServiceStack.OrmLite/src/ServiceStack.OrmLite/OrmLiteWriteApi.cs:line 46
  693.    at ServiceStack.OrmLite.OrmLiteExecFilter.Exec[T](IDbConnection dbConn, Func`2 filter) in /mnt/f/Temp/ss/ServiceStack.OrmLite/src/ServiceStack.OrmLite/OrmLiteExecFilter.cs:line 67
  694.    at ServiceStack.OrmLite.OrmLiteReadExpressionsApi.Exec[T](IDbConnection dbConn, Func`2 filter) in /mnt/f/Temp/ss/ServiceStack.OrmLite/src/ServiceStack.OrmLite/OrmLiteReadExpressionsApi.cs:line 14
  695.    at ServiceStack.OrmLite.OrmLiteWriteApi.ExecuteSql(IDbConnection dbConn, String sql) in /mnt/f/Temp/ss/ServiceStack.OrmLite/src/ServiceStack.OrmLite/OrmLiteWriteApi.cs:line 46
  696.    at ServiceStack.OrmLite.Tests.SqlServerProviderTests.Can_SqlScalar_StoredProc_passing_null_parameter() in /mnt/f/Temp/ss/ServiceStack.OrmLite/tests/ServiceStack.OrmLite.Tests/SqlServerProviderTests.cs:line 197
  697. Failed   Can_SqlScalar_StoredProc_returning_Scalar
  698. Error Message:
  699.  Microsoft.Data.Sqlite.SqliteException : SQLite Error 1: 'near "IF": syntax error'.
  700. Stack Trace:
  701.    at Microsoft.Data.Sqlite.Interop.MarshalEx.ThrowExceptionForRC(Int32 rc, Sqlite3Handle db)
  702.    at Microsoft.Data.Sqlite.SqliteCommand.ExecuteReader(CommandBehavior behavior)
  703.    at Microsoft.Data.Sqlite.SqliteCommand.ExecuteNonQuery()
  704.    at ServiceStack.OrmLite.OrmLiteCommand.ExecuteNonQuery() in /mnt/f/Temp/ss/ServiceStack.OrmLite/src/ServiceStack.OrmLite/OrmLiteCommand.cs:line 43
  705.    at ServiceStack.OrmLite.OrmLiteWriteCommandExtensions.ExecuteSql(IDbCommand dbCmd, String sql, IEnumerable`1 sqlParams) in /mnt/f/Temp/ss/ServiceStack.OrmLite/src/ServiceStack.OrmLite/OrmLiteWriteCommandExtensions.cs:line 231
  706.    at ServiceStack.OrmLite.OrmLiteWriteApi.<>c__DisplayClass2_0.<ExecuteSql>b__0(IDbCommand dbCmd) in /mnt/f/Temp/ss/ServiceStack.OrmLite/src/ServiceStack.OrmLite/OrmLiteWriteApi.cs:line 46
  707.    at ServiceStack.OrmLite.OrmLiteExecFilter.Exec[T](IDbConnection dbConn, Func`2 filter) in /mnt/f/Temp/ss/ServiceStack.OrmLite/src/ServiceStack.OrmLite/OrmLiteExecFilter.cs:line 67
  708.    at ServiceStack.OrmLite.OrmLiteReadExpressionsApi.Exec[T](IDbConnection dbConn, Func`2 filter) in /mnt/f/Temp/ss/ServiceStack.OrmLite/src/ServiceStack.OrmLite/OrmLiteReadExpressionsApi.cs:line 14
  709.    at ServiceStack.OrmLite.OrmLiteWriteApi.ExecuteSql(IDbConnection dbConn, String sql) in /mnt/f/Temp/ss/ServiceStack.OrmLite/src/ServiceStack.OrmLite/OrmLiteWriteApi.cs:line 46
  710.    at ServiceStack.OrmLite.Tests.SqlServerProviderTests.Can_SqlScalar_StoredProc_returning_Scalar() in /mnt/f/Temp/ss/ServiceStack.OrmLite/tests/ServiceStack.OrmLite.Tests/SqlServerProviderTests.cs:line 167
  711. Not Run  Can_add_attachment
  712. Not Run  Can_upload_attachment_via_sp
  713. Not Run  Can_upload_attachment_via_sp_with_ADONET
  714. Skipped  Select_all_SalesOrderHeader_Dapper
  715. Error Message:
  716.  OneTimeSetUp: Integration Test
  717.  
  718. Skipped  Select_all_SalesOrderHeader_OrmLite
  719. Error Message:
  720.  OneTimeSetUp: Integration Test
  721.  
  722. Failed   Run_Expressions_Author_tests
  723. Error Message:
  724.    Expected: 1997-09-22 00:00:00
  725.   But was:  1997-09-22 16:00:00
  726.  
  727. Stack Trace:
  728. at ServiceStack.OrmLite.Tests.UseCase.ExpressionsAuthorTests.Run_Expressions_Author_tests() in /mnt/f/Temp/ss/ServiceStack.OrmLite/tests/ServiceStack.OrmLite.Tests/UseCase/ExpressionsAuthorTests.cs:line 269
  729.  
  730. Standard Output Messages:
  731.  Inserting...
  732.  Inserted 14 rows in 00:00:00.0052016
  733.  Selecting.....
  734.  SELECT "AuthorID", "Name", "Birthday", "LastActivity", "Earnings", "Active", "JobCity", "Comment", "Rate"
  735.  FROM "Author"
  736.  WHERE (("Birthday" >= @0) AND ("Birthday" <= @1))
  737.  WHERE (("Birthday" >= @0) AND ("Birthday" <= @1))
  738.  WHERE "JobCity" IN (@2,@3,@4)
  739.  WHERE "JobCity" IN (@5,@6)
  740.  WHERE upper("Name") like @7
  741.  WHERE upper(upper("Name")) like @8
  742.  WHERE upper("Name") like @9
  743.  WHERE upper("Name") like @10
  744.  WHERE ("Earnings" <= @11)
  745.  Expected:3  Selected:3  OK
  746.  Expected:3  Selected:3  OK
  747.  WHERE (("Rate" = @12) AND ("JobCity" = @13))
  748.  Expected:1  Selected:1  OK
  749.  Expected:1  Selected:1  OK
  750.  Expected:1  Selected:1  OK
  751.  WHERE ("Rate" = @14)
  752.  Expected:2  Selected:2  OK
  753.  WHERE "Active"=0
  754.  Expected:4  Selected:4  OK
  755.  Expected:2  Selected:2  OK
  756.  WHERE ("JobCity" is null)
  757.  Expected:2  Selected:2  OK
  758.  
  759.  Expected:14  Selected:14  OK
  760.  
  761.  ORDER BY "Rate" DESC, "Name"
  762.  Expected:Claudia Espinel  Selected:Claudia Espinel  OK
  763.  
  764.  Expected:5  Selected:5  OK
  765.  SELECT upper("Name") AS "Name", "JobCity"
  766.  Expected:CLAUDIA ESPINEL  Selected:CLAUDIA ESPINEL  OK
  767.  SELECT upper("Name") AS "Name", "JobCity"
  768.  Expected:CLAUDIA ESPINEL  Selected:CLAUDIA ESPINEL  OK
  769.  Expected:CLAUDIA ESPINEL  Selected:CLAUDIA ESPINEL  OK
  770.  Expected:JORGE GARZON  Selected:JORGE GARZON  OK
  771.  Expected:RODGER CONTRERAS  Selected:RODGER CONTRERAS  OK
  772.  Expected:6  Selected:6  OK
  773.  
  774. Skipped  Run_multi_select_Dapper
  775. Error Message:
  776.  OneTimeSetUp: Integration Test
  777.  
  778. Skipped  Run_multi_select_OrmLite
  779. Error Message:
  780.  OneTimeSetUp: Integration Test
  781.  
  782. Skipped  Run_multi_select_OrmLite_SqlExpression
  783. Error Message:
  784.  OneTimeSetUp: Integration Test
  785.  
  786. Skipped  Run_single_select_Dapper
  787. Error Message:
  788.  OneTimeSetUp: Integration Test
  789.  
  790. Skipped  Run_single_select_OrmLite
  791. Error Message:
  792.  OneTimeSetUp: Integration Test
  793.  
  794. Skipped  Shard_1000_Robots_over_10_shards
  795. Error Message:
  796.  OneTimeSetUp: Robots Shard Use Case
  797.  
  798. Failed   Simple_CRUD_example
  799. Error Message:
  800.    Expected: property Count equal to 0
  801.   But was:  2
  802.  
  803. Stack Trace:
  804. at ServiceStack.OrmLite.Tests.UseCase.SimpleUseCase.Simple_CRUD_example() in /mnt/f/Temp/ss/ServiceStack.OrmLite/tests/ServiceStack.OrmLite.Tests/UseCase/SimpleUseCase.cs:line 42
  805.  
  806. NUnit Adapter 3.8.0.0: Test execution complete
  807.  
  808. Total tests: 856. Passed: 776. Failed: 42. Skipped: 31.
  809. Test execution time: 16.3632 Seconds
RAW Paste Data
We use cookies for various purposes including analytics. By continuing to use Pastebin, you agree to our use of cookies as described in the Cookies Policy. OK, I Understand
 
Top