Guest User

Untitled

a guest
Oct 17th, 2015
165
Never
Not a member of Pastebin yet? Sign Up, it unlocks many cool features!
  1. D:\Files\Minecraft\My Mods\FairStairs>gradlew build --info --stacktrace
  2. Starting Build
  3. Settings evaluated using empty settings script.
  4. Projects loaded. Root project using build file 'D:\Files\Minecraft\My Mods\FairS
  5. tairs\build.gradle'.
  6. Included projects: [root project 'FairStairs']
  7. Evaluating root project 'FairStairs' using build file 'D:\Files\Minecraft\My Mod
  8. s\FairStairs\build.gradle'.
  9.  
  10. FAILURE: Build failed with an exception.
  11.  
  12. * Where:
  13. Build file 'D:\Files\Minecraft\My Mods\FairStairs\build.gradle' line: 18
  14.  
  15. * What went wrong:
  16. A problem occurred evaluating root project 'FairStairs'.
  17. > java.io.EOFException: End of input at line 3796 column 17
  18.  
  19. * Try:
  20. Run with --debug option to get more log output.
  21.  
  22. * Exception is:
  23. org.gradle.api.GradleScriptException: A problem occurred evaluating root project
  24. 'FairStairs'.
  25. at org.gradle.groovy.scripts.internal.DefaultScriptRunnerFactory$ScriptR
  26. unnerImpl.run(DefaultScriptRunnerFactory.java:54)
  27. at org.gradle.configuration.DefaultScriptPluginFactory$ScriptPluginImpl.
  28. apply(DefaultScriptPluginFactory.java:187)
  29. at org.gradle.configuration.project.BuildScriptProcessor.execute(BuildSc
  30. riptProcessor.java:39)
  31. at org.gradle.configuration.project.BuildScriptProcessor.execute(BuildSc
  32. riptProcessor.java:26)
  33. at org.gradle.configuration.project.ConfigureActionsProjectEvaluator.eva
  34. luate(ConfigureActionsProjectEvaluator.java:34)
  35. at org.gradle.configuration.project.LifecycleProjectEvaluator.evaluate(L
  36. ifecycleProjectEvaluator.java:55)
  37. at org.gradle.api.internal.project.AbstractProject.evaluate(AbstractProj
  38. ect.java:470)
  39. at org.gradle.api.internal.project.AbstractProject.evaluate(AbstractProj
  40. ect.java:79)
  41. at org.gradle.configuration.DefaultBuildConfigurer.configure(DefaultBuil
  42. dConfigurer.java:31)
  43. at org.gradle.initialization.DefaultGradleLauncher.doBuildStages(Default
  44. GradleLauncher.java:128)
  45. at org.gradle.initialization.DefaultGradleLauncher.doBuild(DefaultGradle
  46. Launcher.java:105)
  47. at org.gradle.initialization.DefaultGradleLauncher.run(DefaultGradleLaun
  48. cher.java:85)
  49. at org.gradle.launcher.exec.InProcessBuildActionExecuter$DefaultBuildCon
  50. troller.run(InProcessBuildActionExecuter.java:81)
  51. at org.gradle.launcher.cli.ExecuteBuildAction.run(ExecuteBuildAction.jav
  52. a:33)
  53. at org.gradle.launcher.cli.ExecuteBuildAction.run(ExecuteBuildAction.jav
  54. a:24)
  55. at org.gradle.launcher.exec.InProcessBuildActionExecuter.execute(InProce
  56. ssBuildActionExecuter.java:39)
  57. at org.gradle.launcher.exec.InProcessBuildActionExecuter.execute(InProce
  58. ssBuildActionExecuter.java:29)
  59. at org.gradle.launcher.cli.RunBuildAction.run(RunBuildAction.java:50)
  60. at org.gradle.internal.Actions$RunnableActionAdapter.execute(Actions.jav
  61. a:171)
  62. at org.gradle.launcher.cli.CommandLineActionFactory$ParseAndBuildAction.
  63. execute(CommandLineActionFactory.java:237)
  64. at org.gradle.launcher.cli.CommandLineActionFactory$ParseAndBuildAction.
  65. execute(CommandLineActionFactory.java:210)
  66. at org.gradle.launcher.cli.JavaRuntimeValidationAction.execute(JavaRunti
  67. meValidationAction.java:35)
  68. at org.gradle.launcher.cli.JavaRuntimeValidationAction.execute(JavaRunti
  69. meValidationAction.java:24)
  70. at org.gradle.launcher.cli.CommandLineActionFactory$WithLogging.execute(
  71. CommandLineActionFactory.java:206)
  72. at org.gradle.launcher.cli.CommandLineActionFactory$WithLogging.execute(
  73. CommandLineActionFactory.java:169)
  74. at org.gradle.launcher.cli.ExceptionReportingAction.execute(ExceptionRep
  75. ortingAction.java:33)
  76. at org.gradle.launcher.cli.ExceptionReportingAction.execute(ExceptionRep
  77. ortingAction.java:22)
  78. at org.gradle.launcher.Main.doAction(Main.java:33)
  79. at org.gradle.launcher.bootstrap.EntryPoint.run(EntryPoint.java:45)
  80. at org.gradle.launcher.bootstrap.ProcessBootstrap.runNoExit(ProcessBoots
  81. trap.java:54)
  82. at org.gradle.launcher.bootstrap.ProcessBootstrap.run(ProcessBootstrap.j
  83. ava:35)
  84. at org.gradle.launcher.GradleMain.main(GradleMain.java:23)
  85. at org.gradle.wrapper.BootstrapMainStarter.start(BootstrapMainStarter.ja
  86. va:30)
  87. at org.gradle.wrapper.WrapperExecutor.execute(WrapperExecutor.java:127)
  88. at org.gradle.wrapper.GradleWrapperMain.main(GradleWrapperMain.java:56)
  89. Caused by: com.google.gson.JsonSyntaxException: java.io.EOFException: End of inp
  90. ut at line 3796 column 17
  91. at com.google.gson.Gson.fromJson(Gson.java:813)
  92. at com.google.gson.Gson.fromJson(Gson.java:768)
  93. at com.google.gson.Gson.fromJson(Gson.java:717)
  94. at com.google.gson.Gson.fromJson(Gson.java:689)
  95. at net.minecraftforge.gradle.user.patch.UserPatchBasePlugin.setVersionIn
  96. foJson(UserPatchBasePlugin.java:145)
  97. at net.minecraftforge.gradle.user.patch.UserPatchBasePlugin.applyPlugin(
  98. UserPatchBasePlugin.java:46)
  99. at net.minecraftforge.gradle.common.BasePlugin.apply(BasePlugin.java:154
  100. )
  101. at net.minecraftforge.gradle.common.BasePlugin.apply(BasePlugin.java:49)
  102.  
  103. at org.gradle.api.internal.plugins.DefaultPluginContainer.providePlugin(
  104. DefaultPluginContainer.java:110)
  105. at org.gradle.api.internal.plugins.DefaultPluginContainer.addPluginInter
  106. nal(DefaultPluginContainer.java:69)
  107. at org.gradle.api.internal.plugins.DefaultPluginContainer.apply(DefaultP
  108. luginContainer.java:35)
  109. at org.gradle.api.internal.plugins.DefaultObjectConfigurationAction.appl
  110. yPlugin(DefaultObjectConfigurationAction.java:117)
  111. at org.gradle.api.internal.plugins.DefaultObjectConfigurationAction.acce
  112. ss$200(DefaultObjectConfigurationAction.java:36)
  113. at org.gradle.api.internal.plugins.DefaultObjectConfigurationAction$3.ru
  114. n(DefaultObjectConfigurationAction.java:85)
  115. at org.gradle.api.internal.plugins.DefaultObjectConfigurationAction.exec
  116. ute(DefaultObjectConfigurationAction.java:130)
  117. at org.gradle.api.internal.project.AbstractPluginAware.apply(AbstractPlu
  118. ginAware.java:41)
  119. at org.gradle.api.Project$apply$0.call(Unknown Source)
  120. at org.gradle.api.internal.project.ProjectScript.apply(ProjectScript.gro
  121. ovy:34)
  122. at org.gradle.api.Script$apply$0.callCurrent(Unknown Source)
  123. at build_3qt52kpb942rlckv5bgle673u8.run(D:\Files\Minecraft\My Mods\FairS
  124. tairs\build.gradle:18)
  125. at org.gradle.groovy.scripts.internal.DefaultScriptRunnerFactory$ScriptR
  126. unnerImpl.run(DefaultScriptRunnerFactory.java:52)
  127. ... 34 more
  128. Caused by: java.io.EOFException: End of input at line 3796 column 17
  129. at com.google.gson.stream.JsonReader.nextNonWhitespace(JsonReader.java:1
  130. 377)
  131. at com.google.gson.stream.JsonReader.doPeek(JsonReader.java:508)
  132. at com.google.gson.stream.JsonReader.peek(JsonReader.java:414)
  133. at com.google.gson.Gson$3.read(Gson.java:252)
  134. at com.google.gson.Gson$3.read(Gson.java:250)
  135. at com.google.gson.internal.bind.ReflectiveTypeAdapterFactory$1.read(Ref
  136. lectiveTypeAdapterFactory.java:93)
  137. at com.google.gson.internal.bind.ReflectiveTypeAdapterFactory$Adapter.re
  138. ad(ReflectiveTypeAdapterFactory.java:172)
  139. at com.google.gson.internal.bind.TypeAdapterRuntimeTypeWrapper.read(Type
  140. AdapterRuntimeTypeWrapper.java:40)
  141. at com.google.gson.internal.bind.MapTypeAdapterFactory$Adapter.read(MapT
  142. ypeAdapterFactory.java:187)
  143. at com.google.gson.internal.bind.MapTypeAdapterFactory$Adapter.read(MapT
  144. ypeAdapterFactory.java:145)
  145. at com.google.gson.internal.bind.ReflectiveTypeAdapterFactory$1.read(Ref
  146. lectiveTypeAdapterFactory.java:93)
  147. at com.google.gson.internal.bind.ReflectiveTypeAdapterFactory$Adapter.re
  148. ad(ReflectiveTypeAdapterFactory.java:172)
  149. at com.google.gson.Gson.fromJson(Gson.java:803)
  150. ... 54 more
  151.  
  152.  
  153. BUILD FAILED
  154.  
  155. Total time: 14.631 secs
RAW Paste Data