Guest User

Untitled

a guest
Jul 7th, 2026
132
0
Never
Not a member of Pastebin yet? Sign Up, it unlocks many cool features!
text 6.04 KB | None | 0 0
  1. [1606/2228] Compiling Rust source ../gstreamer/subprojects/gstreamer/libs/gst/helpers/ptp/main.rs
  2. FAILED: [code=1] subprojects/gstreamer/libs/gst/helpers/ptp/gst-ptp-helper
  3. rustc --target i686-unknown-linux-gnu -C linker=gcc -C link-arg=-m32 --color=always -C debug-assertions=yes -C overflow-checks=no -C embed-bitcode=no --crate-type bin -Cdefault-linker-libraries -C link-arg=-Wl,--allow-shlib-undefined --edition=2018 -C force-frame-pointers=yes -C link-arg=-Wl,--icf=safe -C debuginfo=2 -C strip=none --remap-path-prefix=/build/lib32-gstreamer/src=/usr/src/debug/lib32-gstreamer --crate-name gst_ptp_helper --emit dep-info=subprojects/gstreamer/libs/gst/helpers/ptp/gst-ptp-helper.p/gst-ptp-helper.d --emit link=subprojects/gstreamer/libs/gst/helpers/ptp/gst-ptp-helper -C metadata=29082be@@gst-ptp-helper@exe -Cpanic=abort --cfg 'ptp_helper_permissions="setcap"' --extern gst_ptp_helper_conf=subprojects/gstreamer/libs/gst/helpers/ptp/libgst_ptp_helper_conf.rlib -Clink-arg=/usr/lib32/libcap.so -Lsubprojects/gstreamer/libs/gst/helpers/ptp -L/usr/lib32 ../gstreamer/subprojects/gstreamer/libs/gst/helpers/ptp/main.rs
  4. error: linking with `gcc` failed: exit status: 1
  5. |
  6. = note: "gcc" "-m32" "/build/lib32-gstreamer/src/build/subprojects/gstreamer/libs/gst/helpers/ptp/rustcmBo4Q8/symbols.o" "<5 object files omitted>" "-Wl,--as-needed" "-Wl,-Bdynamic" "-lcap" "-Wl,-Bstatic" "<sysroot>/lib/rustlib/i686-unknown-linux-gnu/lib/{libpanic_abort-*,libstd-*,libobject-*,libmemchr-*,libaddr2line-*,libgimli-*,libcfg_if-*,librustc_demangle-*,libstd_detect-*,libhashbrown-*,librustc_std_workspace_alloc-*,libminiz_oxide-*,libadler2-*,libunwind-*,liblibc-*,librustc_std_workspace_core-*,liballoc-*,libcore-*,libcompiler_builtins-*}.rlib" "-Wl,-Bdynamic" "-lgcc_s" "-lutil" "-lrt" "-lpthread" "-lm" "-ldl" "-lc" "-L" "/build/lib32-gstreamer/src/build/subprojects/gstreamer/libs/gst/helpers/ptp/rustcmBo4Q8/raw-dylibs" "-Wl,--eh-frame-hdr" "-Wl,-z,noexecstack" "-L" "subprojects/gstreamer/libs/gst/helpers/ptp" "-L" "<sysroot>/lib32" "-L" "<sysroot>/lib/rustlib/i686-unknown-linux-gnu/lib" "-o" "subprojects/gstreamer/libs/gst/helpers/ptp/gst-ptp-helper" "-Wl,--gc-sections" "-pie" "-Wl,-z,relro,-z,now" "-m32" "-Wl,--allow-shlib-undefined" "-Wl,--icf=safe" "<sysroot>/lib32/libcap.so"
  7. = note: some arguments are omitted. use `--verbose` to show all linker arguments
  8. = note: /usr/bin/ld: unrecognized option '--icf=safe'
  9. /usr/bin/ld: use the --help option for usage information
  10. collect2: error: ld returned 1 exit status
  11.  
  12.  
  13. error: aborting due to 1 previous error
  14.  
  15. [1607/2228] Linking target subprojects/gstreamer/tools/gst-typefind-1.0
  16. [1608/2228] Linking target subprojects/gstreamer/tests/validate/gst-tester-1.0
  17. [1609/2228] Compiling Rust source ../gstreamer/subprojects/gstreamer/libs/gst/helpers/ptp/main.rs
  18. FAILED: [code=1] subprojects/gstreamer/libs/gst/helpers/ptp/gst_ptp_helper_test
  19. rustc --target i686-unknown-linux-gnu -C linker=gcc -C link-arg=-m32 --color=always -C debug-assertions=yes -C overflow-checks=no -C embed-bitcode=no --crate-type bin -Cdefault-linker-libraries -C link-arg=-Wl,--allow-shlib-undefined --edition=2018 -C force-frame-pointers=yes -C link-arg=-Wl,--icf=safe -C debuginfo=2 -C strip=none --remap-path-prefix=/build/lib32-gstreamer/src=/usr/src/debug/lib32-gstreamer --crate-name gst_ptp_helper_test --emit dep-info=subprojects/gstreamer/libs/gst/helpers/ptp/gst_ptp_helper_test.p/gst_ptp_helper_test.d --emit link=subprojects/gstreamer/libs/gst/helpers/ptp/gst_ptp_helper_test -C metadata=29082be@@gst_ptp_helper_test@exe --test --cfg 'ptp_helper_permissions="setcap"' --extern gst_ptp_helper_conf=subprojects/gstreamer/libs/gst/helpers/ptp/libgst_ptp_helper_conf.rlib -Clink-arg=/usr/lib32/libcap.so -Lsubprojects/gstreamer/libs/gst/helpers/ptp -L/usr/lib32 ../gstreamer/subprojects/gstreamer/libs/gst/helpers/ptp/main.rs
  20. error: linking with `gcc` failed: exit status: 1
  21. |
  22. = note: "gcc" "-m32" "/build/lib32-gstreamer/src/build/subprojects/gstreamer/libs/gst/helpers/ptp/rustcMXf8Wz/symbols.o" "<5 object files omitted>" "-Wl,--as-needed" "-Wl,-Bdynamic" "-lcap" "-Wl,-Bstatic" "<sysroot>/lib/rustlib/i686-unknown-linux-gnu/lib/{libtest-*,libgetopts-*,librustc_std_workspace_std-*,libstd-*,libpanic_unwind-*,libobject-*,libmemchr-*,libaddr2line-*,libgimli-*,libcfg_if-*,librustc_demangle-*,libstd_detect-*,libhashbrown-*,librustc_std_workspace_alloc-*,libminiz_oxide-*,libadler2-*,libunwind-*,liblibc-*,librustc_std_workspace_core-*,liballoc-*,libcore-*,libcompiler_builtins-*}.rlib" "-Wl,-Bdynamic" "-lgcc_s" "-lutil" "-lrt" "-lpthread" "-lm" "-ldl" "-lc" "-L" "/build/lib32-gstreamer/src/build/subprojects/gstreamer/libs/gst/helpers/ptp/rustcMXf8Wz/raw-dylibs" "-Wl,--eh-frame-hdr" "-Wl,-z,noexecstack" "-L" "subprojects/gstreamer/libs/gst/helpers/ptp" "-L" "<sysroot>/lib32" "-L" "<sysroot>/lib/rustlib/i686-unknown-linux-gnu/lib" "-o" "subprojects/gstreamer/libs/gst/helpers/ptp/gst_ptp_helper_test" "-Wl,--gc-sections" "-pie" "-Wl,-z,relro,-z,now" "-m32" "-Wl,--allow-shlib-undefined" "-Wl,--icf=safe" "<sysroot>/lib32/libcap.so"
  23. = note: some arguments are omitted. use `--verbose` to show all linker arguments
  24. = note: /usr/bin/ld: unrecognized option '--icf=safe'
  25. /usr/bin/ld: use the --help option for usage information
  26. collect2: error: ld returned 1 exit status
  27.  
  28.  
  29. error: aborting due to 1 previous error
  30.  
  31. [1610/2228] Linking target subprojects/gstreamer/tools/gst-launch-1.0
  32. [1611/2228] Compiling C object subprojects/gst-plugins-good/tests/check/elements_dash_mpd.p/elements_dash_mpd.c.o
  33. [1612/2228] Linking target subprojects/gstreamer/tools/gst-stats-1.0
  34. [1613/2228] Linking target subprojects/gstreamer/tools/gst-inspect-1.0
  35. [1614/2228] Linking target subprojects/gstreamer/plugins/tracers/libgstcoretracers.so
  36. [1615/2228] Linking target subprojects/gstreamer/plugins/elements/libgstcoreelements.so
  37. ninja: build stopped: subcommand failed.
  38. INFO: autodetecting backend as ninja
  39. INFO: calculating backend command to run: /usr/bin/ninja -C /build/lib32-gstreamer/src/build
  40. ==> ERROR: A failure occurred in build().
  41. Aborting...
Advertisement
Add Comment
Please, Sign In to add comment