simeonniko

Untitled

Mar 28th, 2018
216
0
Never
Not a member of Pastebin yet? Sign Up, it unlocks many cool features!
text 7.97 KB | None | 0 0
  1. C:\Users\Simo\Downloads\ReGameDLL_CS-master\ReGameDLL_CS-master>gradlew --max-wo
  2. rkers=1 clean buildFixes
  3. :buildSrc:compileJava UP-TO-DATE
  4. :buildSrc:compileGroovy UP-TO-DATE
  5. :buildSrc:processResources UP-TO-DATE
  6. :buildSrc:classes UP-TO-DATE
  7. :buildSrc:jar UP-TO-DATE
  8. :buildSrc:assemble UP-TO-DATE
  9. :buildSrc:compileTestJava UP-TO-DATE
  10. :buildSrc:compileTestGroovy UP-TO-DATE
  11. :buildSrc:processTestResources UP-TO-DATE
  12. :buildSrc:testClasses UP-TO-DATE
  13. :buildSrc:test UP-TO-DATE
  14. :buildSrc:check UP-TO-DATE
  15. :buildSrc:build UP-TO-DATE
  16. Caught exception in FS.readPipe()
  17. java.io.IOException: Cannot run program "bash" (in directory "C:\Users\Simo"): C
  18. reateProcess error=2, The system cannot find the file specified
  19. at java.lang.ProcessBuilder.start(Unknown Source)
  20. at java.lang.Runtime.exec(Unknown Source)
  21. at org.eclipse.jgit.util.FS.readPipe(FS.java:431)
  22. at org.eclipse.jgit.util.FS_Win32.discoverGitPrefix(FS_Win32.java:113)
  23. at org.eclipse.jgit.util.FS.gitPrefix(FS.java:517)
  24. at org.eclipse.jgit.util.SystemReader$Default.openSystemConfig(SystemRea
  25. der.java:92)
  26. at org.eclipse.jgit.internal.storage.file.FileRepository.<init>(FileRepo
  27. sitory.java:171)
  28. at org.eclipse.jgit.storage.file.FileRepositoryBuilder.build(FileReposit
  29. oryBuilder.java:92)
  30. at versioning.GitVersioner.versionForDir(GitVersioner.groovy:72)
  31. at versioning.GitVersioner$versionForDir.call(Unknown Source)
  32. at org.codehaus.groovy.runtime.callsite.CallSiteArray.defaultCall(CallSi
  33. teArray.java:45)
  34. at org.codehaus.groovy.runtime.callsite.AbstractCallSite.call(AbstractCa
  35. llSite.java:108)
  36. at org.codehaus.groovy.runtime.callsite.AbstractCallSite.call(AbstractCa
  37. llSite.java:116)
  38. at build_4uoa3r0ql76ndt3obok90m84x.run(C:\Users\Simo\Downloads\ReGameDLL
  39. _CS-master\ReGameDLL_CS-master\build.gradle:17)
  40. at org.gradle.groovy.scripts.internal.DefaultScriptRunnerFactory$ScriptR
  41. unnerImpl.run(DefaultScriptRunnerFactory.java:74)
  42. at org.gradle.configuration.DefaultScriptPluginFactory$ScriptPluginImpl$
  43. 1.run(DefaultScriptPluginFactory.java:148)
  44. at org.gradle.configuration.DefaultScriptPluginFactory$ScriptPluginImpl.
  45. apply(DefaultScriptPluginFactory.java:156)
  46. at org.gradle.configuration.project.BuildScriptProcessor.execute(BuildSc
  47. riptProcessor.java:39)
  48. at org.gradle.configuration.project.BuildScriptProcessor.execute(BuildSc
  49. riptProcessor.java:26)
  50. at org.gradle.configuration.project.ConfigureActionsProjectEvaluator.eva
  51. luate(ConfigureActionsProjectEvaluator.java:34)
  52. at org.gradle.configuration.project.LifecycleProjectEvaluator.evaluate(L
  53. ifecycleProjectEvaluator.java:55)
  54. at org.gradle.api.internal.project.AbstractProject.evaluate(AbstractProj
  55. ect.java:487)
  56. at org.gradle.api.internal.project.AbstractProject.evaluate(AbstractProj
  57. ect.java:85)
  58. at org.gradle.execution.TaskPathProjectEvaluator.configureHierarchy(Task
  59. PathProjectEvaluator.java:42)
  60. at org.gradle.configuration.DefaultBuildConfigurer.configure(DefaultBuil
  61. dConfigurer.java:35)
  62. at org.gradle.initialization.DefaultGradleLauncher.doBuildStages(Default
  63. GradleLauncher.java:129)
  64. at org.gradle.initialization.DefaultGradleLauncher.doBuild(DefaultGradle
  65. Launcher.java:106)
  66. at org.gradle.initialization.DefaultGradleLauncher.run(DefaultGradleLaun
  67. cher.java:86)
  68. at org.gradle.launcher.exec.InProcessBuildActionExecuter$DefaultBuildCon
  69. troller.run(InProcessBuildActionExecuter.java:90)
  70. at org.gradle.tooling.internal.provider.ExecuteBuildActionRunner.run(Exe
  71. cuteBuildActionRunner.java:28)
  72. at org.gradle.launcher.exec.ChainingBuildActionRunner.run(ChainingBuildA
  73. ctionRunner.java:35)
  74. at org.gradle.launcher.exec.InProcessBuildActionExecuter.execute(InProce
  75. ssBuildActionExecuter.java:41)
  76. at org.gradle.launcher.exec.InProcessBuildActionExecuter.execute(InProce
  77. ssBuildActionExecuter.java:28)
  78. at org.gradle.launcher.exec.DaemonUsageSuggestingBuildActionExecuter.exe
  79. cute(DaemonUsageSuggestingBuildActionExecuter.java:50)
  80. at org.gradle.launcher.exec.DaemonUsageSuggestingBuildActionExecuter.exe
  81. cute(DaemonUsageSuggestingBuildActionExecuter.java:27)
  82. at org.gradle.launcher.cli.RunBuildAction.run(RunBuildAction.java:40)
  83. at org.gradle.internal.Actions$RunnableActionAdapter.execute(Actions.jav
  84. a:169)
  85. at org.gradle.launcher.cli.CommandLineActionFactory$ParseAndBuildAction.
  86. execute(CommandLineActionFactory.java:237)
  87. at org.gradle.launcher.cli.CommandLineActionFactory$ParseAndBuildAction.
  88. execute(CommandLineActionFactory.java:210)
  89. at org.gradle.launcher.cli.JavaRuntimeValidationAction.execute(JavaRunti
  90. meValidationAction.java:35)
  91. at org.gradle.launcher.cli.JavaRuntimeValidationAction.execute(JavaRunti
  92. meValidationAction.java:24)
  93. at org.gradle.launcher.cli.CommandLineActionFactory$WithLogging.execute(
  94. CommandLineActionFactory.java:206)
  95. at org.gradle.launcher.cli.CommandLineActionFactory$WithLogging.execute(
  96. CommandLineActionFactory.java:169)
  97. at org.gradle.launcher.cli.ExceptionReportingAction.execute(ExceptionRep
  98. ortingAction.java:33)
  99. at org.gradle.launcher.cli.ExceptionReportingAction.execute(ExceptionRep
  100. ortingAction.java:22)
  101. at org.gradle.launcher.Main.doAction(Main.java:33)
  102. at org.gradle.launcher.bootstrap.EntryPoint.run(EntryPoint.java:45)
  103. at sun.reflect.NativeMethodAccessorImpl.invoke0(Native Method)
  104. at sun.reflect.NativeMethodAccessorImpl.invoke(Unknown Source)
  105. at sun.reflect.DelegatingMethodAccessorImpl.invoke(Unknown Source)
  106. at java.lang.reflect.Method.invoke(Unknown Source)
  107. at org.gradle.launcher.bootstrap.ProcessBootstrap.runNoExit(ProcessBoots
  108. trap.java:54)
  109. at org.gradle.launcher.bootstrap.ProcessBootstrap.run(ProcessBootstrap.j
  110. ava:35)
  111. at org.gradle.launcher.GradleMain.main(GradleMain.java:23)
  112. at sun.reflect.NativeMethodAccessorImpl.invoke0(Native Method)
  113. at sun.reflect.NativeMethodAccessorImpl.invoke(Unknown Source)
  114. at sun.reflect.DelegatingMethodAccessorImpl.invoke(Unknown Source)
  115. at java.lang.reflect.Method.invoke(Unknown Source)
  116. at org.gradle.wrapper.BootstrapMainStarter.start(BootstrapMainStarter.ja
  117. va:30)
  118. at org.gradle.wrapper.WrapperExecutor.execute(WrapperExecutor.java:127)
  119. at org.gradle.wrapper.GradleWrapperMain.main(GradleWrapperMain.java:61)
  120. Caused by: java.io.IOException: CreateProcess error=2, The system cannot find th
  121. e file specified
  122. at java.lang.ProcessImpl.create(Native Method)
  123. at java.lang.ProcessImpl.<init>(Unknown Source)
  124. at java.lang.ProcessImpl.start(Unknown Source)
  125. ... 61 more
  126. ##teamcity[buildNumber '5.7.0']
  127.  
  128. FAILURE: Build failed with an exception.
  129.  
  130. * Where:
  131. Script 'C:\Users\Simo\Downloads\ReGameDLL_CS-master\ReGameDLL_CS-master\shared.g
  132. radle' line: 42
  133.  
  134. * What went wrong:
  135. A problem occurred configuring project ':dep/cppunitlite'.
  136. > Exception thrown while executing model rule: org.gradle.nativeplatform.plugins
  137. .NativeComponentModelPlugin$Rules#createNativeBinaries(org.gradle.platform.base.
  138. BinaryContainer, org.gradle.api.NamedDomainObjectSet<org.gradle.nativeplatform.N
  139. ativeComponentSpec>, org.gradle.language.base.internal.registry.LanguageTransfor
  140. mContainer, org.gradle.nativeplatform.toolchain.internal.NativeToolChainRegistry
  141. Internal, org.gradle.platform.base.internal.PlatformResolvers, org.gradle.native
  142. platform.BuildTypeContainer, org.gradle.nativeplatform.FlavorContainer, org.grad
  143. le.internal.service.ServiceRegistry, java.io.File, org.gradle.api.internal.proje
  144. ct.taskfactory.ITaskFactory)
  145. > Unknown native toolchain: org.gradle.nativeplatform.toolchain.internal.Defa
  146. ultNativeToolChainRegistry$UnavailableNativeToolChain
  147.  
  148. * Try:
  149. Run with --stacktrace option to get the stack trace. Run with --info or --debug
  150. option to get more log output.
  151.  
  152. BUILD FAILED
  153.  
  154. Total time: 9.549 secs
Advertisement
Add Comment
Please, Sign In to add comment