SHARE
TWEET

minetest_not_compile

a guest Mar 19th, 2017 72 Never
Not a member of Pastebin yet? Sign Up, it unlocks many cool features!
  1. θ61° mael@mael-GE60:~/projets 11s 130 $ rm -Rf minetest
  2. θ62° mael@mael-GE60:~/projets $ git clone --depth=1 https://www.github.com/minetest/minetest.git
  3. Clonage dans 'minetest'...
  4. remote: Counting objects: 1048, done.
  5. remote: Compressing objects: 100% (938/938), done.
  6. remote: Total 1048 (delta 126), reused 506 (delta 50), pack-reused 0
  7. Réception d'objets: 100% (1048/1048), 7.16 MiB | 2.14 MiB/s, fait.
  8. Résolution des deltas: 100% (126/126), fait.
  9. Vérification de la connectivité... fait.
  10. θ62° mael@mael-GE60:~/projets 7s $ cd minetest/
  11. θ62° mael@mael-GE60:~/projets/minetest master ± cd games/
  12. θ61° mael@mael-GE60:~/projets/minetest/games master ± git clone --depth=1 https://www.github.com/minetest/minetest_game.git
  13. Clonage dans 'minetest_game'...
  14. remote: Counting objects: 658, done.
  15. remote: Compressing objects: 100% (604/604), done.
  16. remote: Total 658 (delta 62), reused 526 (delta 39), pack-reused 0
  17. Réception d'objets: 100% (658/658), 1.34 MiB | 1.90 MiB/s, fait.
  18. Résolution des deltas: 100% (62/62), fait.
  19. Vérification de la connectivité... fait.
  20. θ64° mael@mael-GE60:~/projets/minetest/games master 3s ± cd ..
  21. θ62° mael@mael-GE60:~/projets/minetest master ± mkdir build/linux
  22. θ61° mael@mael-GE60:~/projets/minetest master ± cd build/linux/
  23. θ61° mael@mael-GE60:~/projets/minetest/build/linux master ± cmake ../../
  24. -- The C compiler identification is GNU 5.2.1
  25. -- The CXX compiler identification is GNU 5.2.1
  26. -- Check for working C compiler: /usr/bin/cc
  27. -- Check for working C compiler: /usr/bin/cc -- works
  28. -- Detecting C compiler ABI info
  29. -- Detecting C compiler ABI info - done
  30. -- Detecting C compile features
  31. -- Detecting C compile features - done
  32. -- Check for working CXX compiler: /usr/bin/c++
  33. -- Check for working CXX compiler: /usr/bin/c++ -- works
  34. -- Detecting CXX compiler ABI info
  35. -- Detecting CXX compiler ABI info - done
  36. -- Detecting CXX compile features
  37. -- Detecting CXX compile features - done
  38. -- *** Will build version 0.4.15-dev ***
  39. -- Found Irrlicht: /usr/lib/x86_64-linux-gnu/libIrrlicht.so  
  40. -- Found CURL: /usr/local/lib/libcurl.a  
  41. -- cURL support enabled.
  42. -- GetText disabled.
  43. -- Found OpenAL: /usr/lib/x86_64-linux-gnu/libopenal.so  
  44. -- Found VORBIS: /usr/include  
  45. -- Sound enabled.
  46. -- Found Freetype: /usr/lib/x86_64-linux-gnu/libfreetype.so  
  47. -- Freetype enabled.
  48. -- Found LuaJit: /usr/lib/x86_64-linux-gnu/libluajit-5.1.so  
  49. -- Using GMP provided by system.
  50. -- Found GMP: /usr/lib/x86_64-linux-gnu/libgmp.so  
  51. -- Found Curses: /usr/lib/x86_64-linux-gnu/libcurses.so  
  52. -- ncurses console enabled.
  53. -- Found PostgreSQL: /usr/lib/x86_64-linux-gnu/libpq.so (found version "9.4.8")
  54. -- PostgreSQL backend enabled
  55. -- PostgreSQL includes: /usr/include/postgresql
  56. -- LevelDB backend enabled.
  57. -- Redis backend enabled.
  58. -- Found SQLite3: /usr/lib/x86_64-linux-gnu/libsqlite3.so  
  59. -- Using bundled JSONCPP library.
  60. -- SpatialIndex AreaStore backend enabled.
  61. -- Looking for XOpenDisplay in /usr/lib/x86_64-linux-gnu/libX11.so;/usr/lib/x86_64-linux-gnu/libXext.so
  62. -- Looking for XOpenDisplay in /usr/lib/x86_64-linux-gnu/libX11.so;/usr/lib/x86_64-linux-gnu/libXext.so - found
  63. -- Looking for gethostbyname
  64. -- Looking for gethostbyname - found
  65. -- Looking for connect
  66. -- Looking for connect - found
  67. -- Looking for remove
  68. -- Looking for remove - found
  69. -- Looking for shmat
  70. -- Looking for shmat - found
  71. -- Looking for IceConnectionNumber in ICE
  72. -- Looking for IceConnectionNumber in ICE - found
  73. -- Found X11: /usr/lib/x86_64-linux-gnu/libX11.so
  74. -- Found OpenGL: /usr/lib/x86_64-linux-gnu/libGL.so  
  75. -- Found JPEG: /usr/lib/x86_64-linux-gnu/libjpeg.so  
  76. -- Found BZip2: /usr/lib/x86_64-linux-gnu/libbz2.so (found version "1.0.6")
  77. -- Looking for BZ2_bzCompressInit in /usr/lib/x86_64-linux-gnu/libbz2.so
  78. -- Looking for BZ2_bzCompressInit in /usr/lib/x86_64-linux-gnu/libbz2.so - found
  79. -- Found ZLIB: /usr/lib/x86_64-linux-gnu/libz.so (found version "1.2.8")
  80. -- Found PNG: /usr/lib/x86_64-linux-gnu/libpng.so (found version "1.2.51")
  81. -- Looking for clock_gettime in rt
  82. -- Looking for clock_gettime in rt - found
  83. -- Looking for include file endian.h
  84. -- Looking for include file endian.h - found
  85. -- Found Doxygen: /usr/bin/doxygen (found version "1.8.9.1")
  86. -- Configuring done
  87. -- Generating done
  88. -- Build files have been written to: /home/mael/projets/minetest/build/linux
  89. θ65° mael@mael-GE60:~/projets/minetest/build/linux master* ± ls
  90. CMakeCache.txt  CMakeFiles/  cmake_install.cmake  CPackConfig.cmake  CPackSourceConfig.cmake  doc/  Makefile  src/
  91. θ61° mael@mael-GE60:~/projets/minetest/build/linux master* ± make
  92. Scanning dependencies of target cguittfont
  93. [  0%] Building CXX object src/cguittfont/CMakeFiles/cguittfont.dir/xCGUITTFont.cpp.o
  94. Linking CXX static library libcguittfont.a
  95. [  0%] Built target cguittfont
  96. Scanning dependencies of target jsoncpp
  97. [  1%] Building CXX object src/jsoncpp/json/CMakeFiles/jsoncpp.dir/jsoncpp.cpp.o
  98. Linking CXX static library libjsoncpp.a
  99. [  1%] Built target jsoncpp
  100. Scanning dependencies of target GenerateVersion
  101. -- *** Detected Git version 0.4.15-dev-525d2a0 ***
  102. [  1%] Built target GenerateVersion
  103. Scanning dependencies of target minetest
  104. [  1%] Building CXX object src/CMakeFiles/minetest.dir/client/clientlauncher.cpp.o
  105. [  2%] Building CXX object src/CMakeFiles/minetest.dir/client/joystick_controller.cpp.o
  106. [  2%] Building CXX object src/CMakeFiles/minetest.dir/client/tile.cpp.o
  107. [  3%] Building CXX object src/CMakeFiles/minetest.dir/irrlicht_changes/static_text.cpp.o
  108. [  3%] Building CXX object src/CMakeFiles/minetest.dir/network/clientopcodes.cpp.o
  109. [  4%] Building CXX object src/CMakeFiles/minetest.dir/network/clientpackethandler.cpp.o
  110. [  4%] Building CXX object src/CMakeFiles/minetest.dir/network/connection.cpp.o
  111. [  4%] Building CXX object src/CMakeFiles/minetest.dir/network/networkpacket.cpp.o
  112. [  5%] Building CXX object src/CMakeFiles/minetest.dir/network/serveropcodes.cpp.o
  113. [  5%] Building CXX object src/CMakeFiles/minetest.dir/network/serverpackethandler.cpp.o
  114. [  6%] Building CXX object src/CMakeFiles/minetest.dir/script/clientscripting.cpp.o
  115. [  6%] Building CXX object src/CMakeFiles/minetest.dir/script/common/c_content.cpp.o
  116. [  7%] Building CXX object src/CMakeFiles/minetest.dir/script/common/c_converter.cpp.o
  117. [  7%] Building CXX object src/CMakeFiles/minetest.dir/script/common/c_internal.cpp.o
  118. [  8%] Building CXX object src/CMakeFiles/minetest.dir/script/common/c_types.cpp.o
  119. [  8%] Building CXX object src/CMakeFiles/minetest.dir/script/cpp_api/s_async.cpp.o
  120. [  9%] Building CXX object src/CMakeFiles/minetest.dir/script/cpp_api/s_base.cpp.o
  121. [  9%] Building CXX object src/CMakeFiles/minetest.dir/script/cpp_api/s_client.cpp.o
  122. [  9%] Building CXX object src/CMakeFiles/minetest.dir/script/cpp_api/s_entity.cpp.o
  123. [ 10%] Building CXX object src/CMakeFiles/minetest.dir/script/cpp_api/s_env.cpp.o
  124. [ 10%] Building CXX object src/CMakeFiles/minetest.dir/script/cpp_api/s_inventory.cpp.o
  125. [ 11%] Building CXX object src/CMakeFiles/minetest.dir/script/cpp_api/s_item.cpp.o
  126. [ 11%] Building CXX object src/CMakeFiles/minetest.dir/script/cpp_api/s_mainmenu.cpp.o
  127. [ 12%] Building CXX object src/CMakeFiles/minetest.dir/script/cpp_api/s_node.cpp.o
  128. [ 12%] Building CXX object src/CMakeFiles/minetest.dir/script/cpp_api/s_nodemeta.cpp.o
  129. [ 13%] Building CXX object src/CMakeFiles/minetest.dir/script/cpp_api/s_player.cpp.o
  130. [ 13%] Building CXX object src/CMakeFiles/minetest.dir/script/cpp_api/s_security.cpp.o
  131. [ 13%] Building CXX object src/CMakeFiles/minetest.dir/script/cpp_api/s_server.cpp.o
  132. [ 14%] Building CXX object src/CMakeFiles/minetest.dir/script/lua_api/l_areastore.cpp.o
  133. [ 14%] Building CXX object src/CMakeFiles/minetest.dir/script/lua_api/l_base.cpp.o
  134. [ 15%] Building CXX object src/CMakeFiles/minetest.dir/script/lua_api/l_client.cpp.o
  135. [ 15%] Building CXX object src/CMakeFiles/minetest.dir/script/lua_api/l_craft.cpp.o
  136. [ 16%] Building CXX object src/CMakeFiles/minetest.dir/script/lua_api/l_env.cpp.o
  137. [ 16%] Building CXX object src/CMakeFiles/minetest.dir/script/lua_api/l_http.cpp.o
  138. [ 17%] Building CXX object src/CMakeFiles/minetest.dir/script/lua_api/l_inventory.cpp.o
  139. [ 17%] Building CXX object src/CMakeFiles/minetest.dir/script/lua_api/l_item.cpp.o
  140. [ 18%] Building CXX object src/CMakeFiles/minetest.dir/script/lua_api/l_itemstackmeta.cpp.o
  141. [ 18%] Building CXX object src/CMakeFiles/minetest.dir/script/lua_api/l_mainmenu.cpp.o
  142. [ 18%] Building CXX object src/CMakeFiles/minetest.dir/script/lua_api/l_mapgen.cpp.o
  143. [ 19%] Building CXX object src/CMakeFiles/minetest.dir/script/lua_api/l_metadata.cpp.o
  144. [ 19%] Building CXX object src/CMakeFiles/minetest.dir/script/lua_api/l_minimap.cpp.o
  145. [ 20%] Building CXX object src/CMakeFiles/minetest.dir/script/lua_api/l_nodemeta.cpp.o
  146. [ 20%] Building CXX object src/CMakeFiles/minetest.dir/script/lua_api/l_nodetimer.cpp.o
  147. [ 21%] Building CXX object src/CMakeFiles/minetest.dir/script/lua_api/l_noise.cpp.o
  148. [ 21%] Building CXX object src/CMakeFiles/minetest.dir/script/lua_api/l_object.cpp.o
  149. [ 22%] Building CXX object src/CMakeFiles/minetest.dir/script/lua_api/l_particles.cpp.o
  150. [ 22%] Building CXX object src/CMakeFiles/minetest.dir/script/lua_api/l_rollback.cpp.o
  151. [ 22%] Building CXX object src/CMakeFiles/minetest.dir/script/lua_api/l_server.cpp.o
  152. [ 23%] Building CXX object src/CMakeFiles/minetest.dir/script/lua_api/l_settings.cpp.o
  153. [ 23%] Building CXX object src/CMakeFiles/minetest.dir/script/lua_api/l_sound.cpp.o
  154. [ 24%] Building CXX object src/CMakeFiles/minetest.dir/script/lua_api/l_storage.cpp.o
  155. [ 24%] Building CXX object src/CMakeFiles/minetest.dir/script/lua_api/l_util.cpp.o
  156. [ 25%] Building CXX object src/CMakeFiles/minetest.dir/script/lua_api/l_vmanip.cpp.o
  157. [ 25%] Building CXX object src/CMakeFiles/minetest.dir/script/scripting_mainmenu.cpp.o
  158. [ 26%] Building CXX object src/CMakeFiles/minetest.dir/script/serverscripting.cpp.o
  159. [ 26%] Building CXX object src/CMakeFiles/minetest.dir/threading/event.cpp.o
  160. [ 27%] Building CXX object src/CMakeFiles/minetest.dir/threading/mutex.cpp.o
  161. [ 27%] Building CXX object src/CMakeFiles/minetest.dir/threading/semaphore.cpp.o
  162. [ 27%] Building CXX object src/CMakeFiles/minetest.dir/threading/thread.cpp.o
  163. [ 28%] Building CXX object src/CMakeFiles/minetest.dir/unittest/test.cpp.o
  164. [ 28%] Building CXX object src/CMakeFiles/minetest.dir/unittest/test_areastore.cpp.o
  165. [ 29%] Building CXX object src/CMakeFiles/minetest.dir/unittest/test_collision.cpp.o
  166. [ 29%] Building CXX object src/CMakeFiles/minetest.dir/unittest/test_compression.cpp.o
  167. [ 30%] Building CXX object src/CMakeFiles/minetest.dir/unittest/test_connection.cpp.o
  168. [ 30%] Building CXX object src/CMakeFiles/minetest.dir/unittest/test_filepath.cpp.o
  169. [ 31%] Building CXX object src/CMakeFiles/minetest.dir/unittest/test_inventory.cpp.o
  170. [ 31%] Building CXX object src/CMakeFiles/minetest.dir/unittest/test_keycode.cpp.o
  171. [ 31%] Building CXX object src/CMakeFiles/minetest.dir/unittest/test_map_settings_manager.cpp.o
  172. [ 32%] Building CXX object src/CMakeFiles/minetest.dir/unittest/test_mapnode.cpp.o
  173. [ 32%] Building CXX object src/CMakeFiles/minetest.dir/unittest/test_nodedef.cpp.o
  174. [ 33%] Building CXX object src/CMakeFiles/minetest.dir/unittest/test_noderesolver.cpp.o
  175. [ 33%] Building CXX object src/CMakeFiles/minetest.dir/unittest/test_noise.cpp.o
  176. [ 34%] Building CXX object src/CMakeFiles/minetest.dir/unittest/test_objdef.cpp.o
  177. [ 34%] Building CXX object src/CMakeFiles/minetest.dir/unittest/test_player.cpp.o
  178. [ 35%] Building CXX object src/CMakeFiles/minetest.dir/unittest/test_profiler.cpp.o
  179. [ 35%] Building CXX object src/CMakeFiles/minetest.dir/unittest/test_random.cpp.o
  180. [ 36%] Building CXX object src/CMakeFiles/minetest.dir/unittest/test_schematic.cpp.o
  181. [ 36%] Building CXX object src/CMakeFiles/minetest.dir/unittest/test_serialization.cpp.o
  182. [ 36%] Building CXX object src/CMakeFiles/minetest.dir/unittest/test_settings.cpp.o
  183. [ 37%] Building CXX object src/CMakeFiles/minetest.dir/unittest/test_socket.cpp.o
  184. [ 37%] Building CXX object src/CMakeFiles/minetest.dir/unittest/test_threading.cpp.o
  185. [ 38%] Building CXX object src/CMakeFiles/minetest.dir/unittest/test_utilities.cpp.o
  186. [ 38%] Building CXX object src/CMakeFiles/minetest.dir/unittest/test_voxelalgorithms.cpp.o
  187. [ 39%] Building CXX object src/CMakeFiles/minetest.dir/unittest/test_voxelmanipulator.cpp.o
  188. [ 39%] Building CXX object src/CMakeFiles/minetest.dir/util/areastore.cpp.o
  189. [ 40%] Building CXX object src/CMakeFiles/minetest.dir/util/auth.cpp.o
  190. [ 40%] Building CXX object src/CMakeFiles/minetest.dir/util/base64.cpp.o
  191. [ 40%] Building CXX object src/CMakeFiles/minetest.dir/util/directiontables.cpp.o
  192. [ 41%] Building CXX object src/CMakeFiles/minetest.dir/util/enriched_string.cpp.o
  193. [ 41%] Building CXX object src/CMakeFiles/minetest.dir/util/numeric.cpp.o
  194. [ 42%] Building CXX object src/CMakeFiles/minetest.dir/util/pointedthing.cpp.o
  195. [ 42%] Building CXX object src/CMakeFiles/minetest.dir/util/serialize.cpp.o
  196. [ 43%] Building CXX object src/CMakeFiles/minetest.dir/util/sha1.cpp.o
  197. [ 43%] Building C object src/CMakeFiles/minetest.dir/util/sha256.c.o
  198. [ 44%] Building CXX object src/CMakeFiles/minetest.dir/util/srp.cpp.o
  199. [ 44%] Building CXX object src/CMakeFiles/minetest.dir/util/string.cpp.o
  200. [ 45%] Building CXX object src/CMakeFiles/minetest.dir/util/timetaker.cpp.o
  201. [ 45%] Building CXX object src/CMakeFiles/minetest.dir/ban.cpp.o
  202. [ 45%] Building CXX object src/CMakeFiles/minetest.dir/camera.cpp.o
  203. [ 46%] Building CXX object src/CMakeFiles/minetest.dir/cavegen.cpp.o
  204. [ 46%] Building CXX object src/CMakeFiles/minetest.dir/chat.cpp.o
  205. [ 47%] Building CXX object src/CMakeFiles/minetest.dir/client.cpp.o
  206. [ 47%] Building CXX object src/CMakeFiles/minetest.dir/clientenvironment.cpp.o
  207. [ 48%] Building CXX object src/CMakeFiles/minetest.dir/clientiface.cpp.o
  208. [ 48%] Building CXX object src/CMakeFiles/minetest.dir/clientmap.cpp.o
  209. [ 49%] Building CXX object src/CMakeFiles/minetest.dir/clientmedia.cpp.o
  210. [ 49%] Building CXX object src/CMakeFiles/minetest.dir/clientobject.cpp.o
  211. [ 50%] Building CXX object src/CMakeFiles/minetest.dir/clouds.cpp.o
  212. [ 50%] Building CXX object src/CMakeFiles/minetest.dir/collision.cpp.o
  213. [ 50%] Building CXX object src/CMakeFiles/minetest.dir/content_abm.cpp.o
  214. [ 51%] Building CXX object src/CMakeFiles/minetest.dir/content_cao.cpp.o
  215. [ 51%] Building CXX object src/CMakeFiles/minetest.dir/content_cso.cpp.o
  216. [ 52%] Building CXX object src/CMakeFiles/minetest.dir/content_mapblock.cpp.o
  217. [ 52%] Building CXX object src/CMakeFiles/minetest.dir/content_mapnode.cpp.o
  218. [ 53%] Building CXX object src/CMakeFiles/minetest.dir/content_nodemeta.cpp.o
  219. [ 53%] Building CXX object src/CMakeFiles/minetest.dir/content_sao.cpp.o
  220. [ 54%] Building CXX object src/CMakeFiles/minetest.dir/convert_json.cpp.o
  221. [ 54%] Building CXX object src/CMakeFiles/minetest.dir/craftdef.cpp.o
  222. [ 54%] Building CXX object src/CMakeFiles/minetest.dir/database-dummy.cpp.o
  223. [ 55%] Building CXX object src/CMakeFiles/minetest.dir/database-leveldb.cpp.o
  224. [ 55%] Building CXX object src/CMakeFiles/minetest.dir/database-postgresql.cpp.o
  225. [ 56%] Building CXX object src/CMakeFiles/minetest.dir/database-redis.cpp.o
  226. [ 56%] Building CXX object src/CMakeFiles/minetest.dir/database-sqlite3.cpp.o
  227. [ 57%] Building CXX object src/CMakeFiles/minetest.dir/database.cpp.o
  228. [ 57%] Building CXX object src/CMakeFiles/minetest.dir/debug.cpp.o
  229. [ 58%] Building CXX object src/CMakeFiles/minetest.dir/defaultsettings.cpp.o
  230. [ 58%] Building CXX object src/CMakeFiles/minetest.dir/drawscene.cpp.o
  231. [ 59%] Building CXX object src/CMakeFiles/minetest.dir/dungeongen.cpp.o
  232. [ 59%] Building CXX object src/CMakeFiles/minetest.dir/emerge.cpp.o
  233. [ 59%] Building CXX object src/CMakeFiles/minetest.dir/environment.cpp.o
  234. [ 60%] Building CXX object src/CMakeFiles/minetest.dir/filecache.cpp.o
  235. [ 60%] Building CXX object src/CMakeFiles/minetest.dir/filesys.cpp.o
  236. [ 61%] Building CXX object src/CMakeFiles/minetest.dir/fontengine.cpp.o
  237. [ 61%] Building CXX object src/CMakeFiles/minetest.dir/game.cpp.o
  238. [ 62%] Building CXX object src/CMakeFiles/minetest.dir/genericobject.cpp.o
  239. [ 62%] Building CXX object src/CMakeFiles/minetest.dir/gettext.cpp.o
  240. [ 63%] Building CXX object src/CMakeFiles/minetest.dir/guiChatConsole.cpp.o
  241. [ 63%] Building CXX object src/CMakeFiles/minetest.dir/guiEngine.cpp.o
  242. [ 63%] Building CXX object src/CMakeFiles/minetest.dir/guiFileSelectMenu.cpp.o
  243. [ 64%] Building CXX object src/CMakeFiles/minetest.dir/guiFormSpecMenu.cpp.o
  244. [ 64%] Building CXX object src/CMakeFiles/minetest.dir/guiKeyChangeMenu.cpp.o
  245. [ 65%] Building CXX object src/CMakeFiles/minetest.dir/guiPasswordChange.cpp.o
  246. [ 65%] Building CXX object src/CMakeFiles/minetest.dir/guiTable.cpp.o
  247. [ 66%] Building CXX object src/CMakeFiles/minetest.dir/guiVolumeChange.cpp.o
  248. [ 66%] Building CXX object src/CMakeFiles/minetest.dir/guiscalingfilter.cpp.o
  249. [ 67%] Building CXX object src/CMakeFiles/minetest.dir/httpfetch.cpp.o
  250. [ 67%] Building CXX object src/CMakeFiles/minetest.dir/hud.cpp.o
  251. [ 68%] Building CXX object src/CMakeFiles/minetest.dir/imagefilters.cpp.o
  252. [ 68%] Building CXX object src/CMakeFiles/minetest.dir/intlGUIEditBox.cpp.o
  253. [ 68%] Building CXX object src/CMakeFiles/minetest.dir/inventory.cpp.o
  254. [ 69%] Building CXX object src/CMakeFiles/minetest.dir/inventorymanager.cpp.o
  255. [ 69%] Building CXX object src/CMakeFiles/minetest.dir/itemdef.cpp.o
  256. [ 70%] Building CXX object src/CMakeFiles/minetest.dir/itemstackmetadata.cpp.o
  257. [ 70%] Building CXX object src/CMakeFiles/minetest.dir/keycode.cpp.o
  258. [ 71%] Building CXX object src/CMakeFiles/minetest.dir/light.cpp.o
  259. [ 71%] Building CXX object src/CMakeFiles/minetest.dir/localplayer.cpp.o
  260. [ 72%] Building CXX object src/CMakeFiles/minetest.dir/log.cpp.o
  261. [ 72%] Building CXX object src/CMakeFiles/minetest.dir/main.cpp.o
  262. [ 72%] Building CXX object src/CMakeFiles/minetest.dir/map.cpp.o
  263. [ 73%] Building CXX object src/CMakeFiles/minetest.dir/map_settings_manager.cpp.o
  264. [ 73%] Building CXX object src/CMakeFiles/minetest.dir/mapblock.cpp.o
  265. [ 74%] Building CXX object src/CMakeFiles/minetest.dir/mapblock_mesh.cpp.o
  266. [ 74%] Building CXX object src/CMakeFiles/minetest.dir/mapgen.cpp.o
  267. [ 75%] Building CXX object src/CMakeFiles/minetest.dir/mapgen_flat.cpp.o
  268. [ 75%] Building CXX object src/CMakeFiles/minetest.dir/mapgen_fractal.cpp.o
  269. [ 76%] Building CXX object src/CMakeFiles/minetest.dir/mapgen_singlenode.cpp.o
  270. [ 76%] Building CXX object src/CMakeFiles/minetest.dir/mapgen_v5.cpp.o
  271. [ 77%] Building CXX object src/CMakeFiles/minetest.dir/mapgen_v6.cpp.o
  272. [ 77%] Building CXX object src/CMakeFiles/minetest.dir/mapgen_v7.cpp.o
  273. [ 77%] Building CXX object src/CMakeFiles/minetest.dir/mapgen_valleys.cpp.o
  274. [ 78%] Building CXX object src/CMakeFiles/minetest.dir/mapnode.cpp.o
  275. [ 78%] Building CXX object src/CMakeFiles/minetest.dir/mapsector.cpp.o
  276. [ 79%] Building CXX object src/CMakeFiles/minetest.dir/mesh.cpp.o
  277. [ 79%] Building CXX object src/CMakeFiles/minetest.dir/metadata.cpp.o
  278. [ 80%] Building CXX object src/CMakeFiles/minetest.dir/mg_biome.cpp.o
  279. [ 80%] Building CXX object src/CMakeFiles/minetest.dir/mg_decoration.cpp.o
  280. [ 81%] Building CXX object src/CMakeFiles/minetest.dir/mg_ore.cpp.o
  281. [ 81%] Building CXX object src/CMakeFiles/minetest.dir/mg_schematic.cpp.o
  282. [ 81%] Building CXX object src/CMakeFiles/minetest.dir/minimap.cpp.o
  283. [ 82%] Building CXX object src/CMakeFiles/minetest.dir/mods.cpp.o
  284. [ 82%] Building CXX object src/CMakeFiles/minetest.dir/nameidmapping.cpp.o
  285. [ 83%] Building CXX object src/CMakeFiles/minetest.dir/nodedef.cpp.o
  286. [ 83%] Building CXX object src/CMakeFiles/minetest.dir/nodemetadata.cpp.o
  287. [ 84%] Building CXX object src/CMakeFiles/minetest.dir/nodetimer.cpp.o
  288. [ 84%] Building CXX object src/CMakeFiles/minetest.dir/noise.cpp.o
  289. [ 85%] Building CXX object src/CMakeFiles/minetest.dir/objdef.cpp.o
  290. [ 85%] Building CXX object src/CMakeFiles/minetest.dir/object_properties.cpp.o
  291. [ 86%] Building CXX object src/CMakeFiles/minetest.dir/particles.cpp.o
  292. [ 86%] Building CXX object src/CMakeFiles/minetest.dir/pathfinder.cpp.o
  293. [ 86%] Building CXX object src/CMakeFiles/minetest.dir/player.cpp.o
  294. [ 87%] Building CXX object src/CMakeFiles/minetest.dir/porting.cpp.o
  295. [ 87%] Building CXX object src/CMakeFiles/minetest.dir/profiler.cpp.o
  296. [ 88%] Building CXX object src/CMakeFiles/minetest.dir/quicktune.cpp.o
  297. [ 88%] Building CXX object src/CMakeFiles/minetest.dir/raycast.cpp.o
  298. [ 89%] Building CXX object src/CMakeFiles/minetest.dir/reflowscan.cpp.o
  299. [ 89%] Building CXX object src/CMakeFiles/minetest.dir/remoteplayer.cpp.o
  300. [ 90%] Building CXX object src/CMakeFiles/minetest.dir/rollback.cpp.o
  301. [ 90%] Building CXX object src/CMakeFiles/minetest.dir/rollback_interface.cpp.o
  302. [ 90%] Building CXX object src/CMakeFiles/minetest.dir/serialization.cpp.o
  303. [ 91%] Building CXX object src/CMakeFiles/minetest.dir/server.cpp.o
  304. [ 91%] Building CXX object src/CMakeFiles/minetest.dir/serverenvironment.cpp.o
  305. [ 92%] Building CXX object src/CMakeFiles/minetest.dir/serverlist.cpp.o
  306. [ 92%] Building CXX object src/CMakeFiles/minetest.dir/serverobject.cpp.o
  307. [ 93%] Building CXX object src/CMakeFiles/minetest.dir/settings.cpp.o
  308. [ 93%] Building CXX object src/CMakeFiles/minetest.dir/shader.cpp.o
  309. [ 94%] Building CXX object src/CMakeFiles/minetest.dir/sky.cpp.o
  310. [ 94%] Building CXX object src/CMakeFiles/minetest.dir/socket.cpp.o
  311. [ 95%] Building CXX object src/CMakeFiles/minetest.dir/sound.cpp.o
  312. [ 95%] Building CXX object src/CMakeFiles/minetest.dir/sound_openal.cpp.o
  313. [ 95%] Building CXX object src/CMakeFiles/minetest.dir/staticobject.cpp.o
  314. [ 96%] Building CXX object src/CMakeFiles/minetest.dir/subgame.cpp.o
  315. [ 96%] Building CXX object src/CMakeFiles/minetest.dir/terminal_chat_console.cpp.o
  316. [ 97%] Building CXX object src/CMakeFiles/minetest.dir/tileanimation.cpp.o
  317. [ 97%] Building CXX object src/CMakeFiles/minetest.dir/tool.cpp.o
  318. [ 98%] Building CXX object src/CMakeFiles/minetest.dir/treegen.cpp.o
  319. [ 98%] Building CXX object src/CMakeFiles/minetest.dir/version.cpp.o
  320. [ 99%] Building CXX object src/CMakeFiles/minetest.dir/voxel.cpp.o
  321. [ 99%] Building CXX object src/CMakeFiles/minetest.dir/voxelalgorithms.cpp.o
  322. [100%] Building CXX object src/CMakeFiles/minetest.dir/wieldmesh.cpp.o
  323. Linking CXX executable ../../../bin/minetest
  324. /usr/bin/ld: /usr/local/lib/libcurl.a(libcurl_la-ssluse.o): référence au symbole non défini «SSL_get_verify_result@@OPENSSL_1.0.0»
  325. /lib/x86_64-linux-gnu/libssl.so.1.0.0: error adding symbols: DSO missing from command line
  326. collect2: error: ld returned 1 exit status
  327. src/CMakeFiles/minetest.dir/build.make:5568: recipe for target '../../bin/minetest' failed
  328. make[2]: *** [../../bin/minetest] Error 1
  329. CMakeFiles/Makefile2:166: recipe for target 'src/CMakeFiles/minetest.dir/all' failed
  330. make[1]: *** [src/CMakeFiles/minetest.dir/all] Error 2
  331. Makefile:136: recipe for target 'all' failed
  332. make: *** [all] Error 2
  333. θ76° mael@mael-GE60:~/projets/minetest/build/linux master* 4m25s 2 ±
RAW Paste Data
We use cookies for various purposes including analytics. By continuing to use Pastebin, you agree to our use of cookies as described in the Cookies Policy. OK, I Understand
Top