Pastebin
API
tools
faq
paste
Login
Sign up
Please fix the following errors:
New Paste
Syntax Highlighting
θ61° mael@mael-GE60:~/projets 11s 130 $ rm -Rf minetest θ62° mael@mael-GE60:~/projets $ git clone --depth=1 https://www.github.com/minetest/minetest.git Clonage dans 'minetest'... remote: Counting objects: 1048, done. remote: Compressing objects: 100% (938/938), done. remote: Total 1048 (delta 126), reused 506 (delta 50), pack-reused 0 Réception d'objets: 100% (1048/1048), 7.16 MiB | 2.14 MiB/s, fait. Résolution des deltas: 100% (126/126), fait. Vérification de la connectivité... fait. θ62° mael@mael-GE60:~/projets 7s $ cd minetest/ θ62° mael@mael-GE60:~/projets/minetest master ± cd games/ θ61° mael@mael-GE60:~/projets/minetest/games master ± git clone --depth=1 https://www.github.com/minetest/minetest_game.git Clonage dans 'minetest_game'... remote: Counting objects: 658, done. remote: Compressing objects: 100% (604/604), done. remote: Total 658 (delta 62), reused 526 (delta 39), pack-reused 0 Réception d'objets: 100% (658/658), 1.34 MiB | 1.90 MiB/s, fait. Résolution des deltas: 100% (62/62), fait. Vérification de la connectivité... fait. θ64° mael@mael-GE60:~/projets/minetest/games master 3s ± cd .. θ62° mael@mael-GE60:~/projets/minetest master ± mkdir build/linux θ61° mael@mael-GE60:~/projets/minetest master ± cd build/linux/ θ61° mael@mael-GE60:~/projets/minetest/build/linux master ± cmake ../../ -- The C compiler identification is GNU 5.2.1 -- The CXX compiler identification is GNU 5.2.1 -- Check for working C compiler: /usr/bin/cc -- Check for working C compiler: /usr/bin/cc -- works -- Detecting C compiler ABI info -- Detecting C compiler ABI info - done -- Detecting C compile features -- Detecting C compile features - done -- Check for working CXX compiler: /usr/bin/c++ -- Check for working CXX compiler: /usr/bin/c++ -- works -- Detecting CXX compiler ABI info -- Detecting CXX compiler ABI info - done -- Detecting CXX compile features -- Detecting CXX compile features - done -- *** Will build version 0.4.15-dev *** -- Found Irrlicht: /usr/lib/x86_64-linux-gnu/libIrrlicht.so -- Found CURL: /usr/local/lib/libcurl.a -- cURL support enabled. -- GetText disabled. -- Found OpenAL: /usr/lib/x86_64-linux-gnu/libopenal.so -- Found VORBIS: /usr/include -- Sound enabled. -- Found Freetype: /usr/lib/x86_64-linux-gnu/libfreetype.so -- Freetype enabled. -- Found LuaJit: /usr/lib/x86_64-linux-gnu/libluajit-5.1.so -- Using GMP provided by system. -- Found GMP: /usr/lib/x86_64-linux-gnu/libgmp.so -- Found Curses: /usr/lib/x86_64-linux-gnu/libcurses.so -- ncurses console enabled. -- Found PostgreSQL: /usr/lib/x86_64-linux-gnu/libpq.so (found version "9.4.8") -- PostgreSQL backend enabled -- PostgreSQL includes: /usr/include/postgresql -- LevelDB backend enabled. -- Redis backend enabled. -- Found SQLite3: /usr/lib/x86_64-linux-gnu/libsqlite3.so -- Using bundled JSONCPP library. -- SpatialIndex AreaStore backend enabled. -- Looking for XOpenDisplay in /usr/lib/x86_64-linux-gnu/libX11.so;/usr/lib/x86_64-linux-gnu/libXext.so -- Looking for XOpenDisplay in /usr/lib/x86_64-linux-gnu/libX11.so;/usr/lib/x86_64-linux-gnu/libXext.so - found -- Looking for gethostbyname -- Looking for gethostbyname - found -- Looking for connect -- Looking for connect - found -- Looking for remove -- Looking for remove - found -- Looking for shmat -- Looking for shmat - found -- Looking for IceConnectionNumber in ICE -- Looking for IceConnectionNumber in ICE - found -- Found X11: /usr/lib/x86_64-linux-gnu/libX11.so -- Found OpenGL: /usr/lib/x86_64-linux-gnu/libGL.so -- Found JPEG: /usr/lib/x86_64-linux-gnu/libjpeg.so -- Found BZip2: /usr/lib/x86_64-linux-gnu/libbz2.so (found version "1.0.6") -- Looking for BZ2_bzCompressInit in /usr/lib/x86_64-linux-gnu/libbz2.so -- Looking for BZ2_bzCompressInit in /usr/lib/x86_64-linux-gnu/libbz2.so - found -- Found ZLIB: /usr/lib/x86_64-linux-gnu/libz.so (found version "1.2.8") -- Found PNG: /usr/lib/x86_64-linux-gnu/libpng.so (found version "1.2.51") -- Looking for clock_gettime in rt -- Looking for clock_gettime in rt - found -- Looking for include file endian.h -- Looking for include file endian.h - found -- Found Doxygen: /usr/bin/doxygen (found version "1.8.9.1") -- Configuring done -- Generating done -- Build files have been written to: /home/mael/projets/minetest/build/linux θ65° mael@mael-GE60:~/projets/minetest/build/linux master* ± ls CMakeCache.txt CMakeFiles/ cmake_install.cmake CPackConfig.cmake CPackSourceConfig.cmake doc/ Makefile src/ θ61° mael@mael-GE60:~/projets/minetest/build/linux master* ± make Scanning dependencies of target cguittfont [ 0%] Building CXX object src/cguittfont/CMakeFiles/cguittfont.dir/xCGUITTFont.cpp.o Linking CXX static library libcguittfont.a [ 0%] Built target cguittfont Scanning dependencies of target jsoncpp [ 1%] Building CXX object src/jsoncpp/json/CMakeFiles/jsoncpp.dir/jsoncpp.cpp.o Linking CXX static library libjsoncpp.a [ 1%] Built target jsoncpp Scanning dependencies of target GenerateVersion -- *** Detected Git version 0.4.15-dev-525d2a0 *** [ 1%] Built target GenerateVersion Scanning dependencies of target minetest [ 1%] Building CXX object src/CMakeFiles/minetest.dir/client/clientlauncher.cpp.o [ 2%] Building CXX object src/CMakeFiles/minetest.dir/client/joystick_controller.cpp.o [ 2%] Building CXX object src/CMakeFiles/minetest.dir/client/tile.cpp.o [ 3%] Building CXX object src/CMakeFiles/minetest.dir/irrlicht_changes/static_text.cpp.o [ 3%] Building CXX object src/CMakeFiles/minetest.dir/network/clientopcodes.cpp.o [ 4%] Building CXX object src/CMakeFiles/minetest.dir/network/clientpackethandler.cpp.o [ 4%] Building CXX object src/CMakeFiles/minetest.dir/network/connection.cpp.o [ 4%] Building CXX object src/CMakeFiles/minetest.dir/network/networkpacket.cpp.o [ 5%] Building CXX object src/CMakeFiles/minetest.dir/network/serveropcodes.cpp.o [ 5%] Building CXX object src/CMakeFiles/minetest.dir/network/serverpackethandler.cpp.o [ 6%] Building CXX object src/CMakeFiles/minetest.dir/script/clientscripting.cpp.o [ 6%] Building CXX object src/CMakeFiles/minetest.dir/script/common/c_content.cpp.o [ 7%] Building CXX object src/CMakeFiles/minetest.dir/script/common/c_converter.cpp.o [ 7%] Building CXX object src/CMakeFiles/minetest.dir/script/common/c_internal.cpp.o [ 8%] Building CXX object src/CMakeFiles/minetest.dir/script/common/c_types.cpp.o [ 8%] Building CXX object src/CMakeFiles/minetest.dir/script/cpp_api/s_async.cpp.o [ 9%] Building CXX object src/CMakeFiles/minetest.dir/script/cpp_api/s_base.cpp.o [ 9%] Building CXX object src/CMakeFiles/minetest.dir/script/cpp_api/s_client.cpp.o [ 9%] Building CXX object src/CMakeFiles/minetest.dir/script/cpp_api/s_entity.cpp.o [ 10%] Building CXX object src/CMakeFiles/minetest.dir/script/cpp_api/s_env.cpp.o [ 10%] Building CXX object src/CMakeFiles/minetest.dir/script/cpp_api/s_inventory.cpp.o [ 11%] Building CXX object src/CMakeFiles/minetest.dir/script/cpp_api/s_item.cpp.o [ 11%] Building CXX object src/CMakeFiles/minetest.dir/script/cpp_api/s_mainmenu.cpp.o [ 12%] Building CXX object src/CMakeFiles/minetest.dir/script/cpp_api/s_node.cpp.o [ 12%] Building CXX object src/CMakeFiles/minetest.dir/script/cpp_api/s_nodemeta.cpp.o [ 13%] Building CXX object src/CMakeFiles/minetest.dir/script/cpp_api/s_player.cpp.o [ 13%] Building CXX object src/CMakeFiles/minetest.dir/script/cpp_api/s_security.cpp.o [ 13%] Building CXX object src/CMakeFiles/minetest.dir/script/cpp_api/s_server.cpp.o [ 14%] Building CXX object src/CMakeFiles/minetest.dir/script/lua_api/l_areastore.cpp.o [ 14%] Building CXX object src/CMakeFiles/minetest.dir/script/lua_api/l_base.cpp.o [ 15%] Building CXX object src/CMakeFiles/minetest.dir/script/lua_api/l_client.cpp.o [ 15%] Building CXX object src/CMakeFiles/minetest.dir/script/lua_api/l_craft.cpp.o [ 16%] Building CXX object src/CMakeFiles/minetest.dir/script/lua_api/l_env.cpp.o [ 16%] Building CXX object src/CMakeFiles/minetest.dir/script/lua_api/l_http.cpp.o [ 17%] Building CXX object src/CMakeFiles/minetest.dir/script/lua_api/l_inventory.cpp.o [ 17%] Building CXX object src/CMakeFiles/minetest.dir/script/lua_api/l_item.cpp.o [ 18%] Building CXX object src/CMakeFiles/minetest.dir/script/lua_api/l_itemstackmeta.cpp.o [ 18%] Building CXX object src/CMakeFiles/minetest.dir/script/lua_api/l_mainmenu.cpp.o [ 18%] Building CXX object src/CMakeFiles/minetest.dir/script/lua_api/l_mapgen.cpp.o [ 19%] Building CXX object src/CMakeFiles/minetest.dir/script/lua_api/l_metadata.cpp.o [ 19%] Building CXX object src/CMakeFiles/minetest.dir/script/lua_api/l_minimap.cpp.o [ 20%] Building CXX object src/CMakeFiles/minetest.dir/script/lua_api/l_nodemeta.cpp.o [ 20%] Building CXX object src/CMakeFiles/minetest.dir/script/lua_api/l_nodetimer.cpp.o [ 21%] Building CXX object src/CMakeFiles/minetest.dir/script/lua_api/l_noise.cpp.o [ 21%] Building CXX object src/CMakeFiles/minetest.dir/script/lua_api/l_object.cpp.o [ 22%] Building CXX object src/CMakeFiles/minetest.dir/script/lua_api/l_particles.cpp.o [ 22%] Building CXX object src/CMakeFiles/minetest.dir/script/lua_api/l_rollback.cpp.o [ 22%] Building CXX object src/CMakeFiles/minetest.dir/script/lua_api/l_server.cpp.o [ 23%] Building CXX object src/CMakeFiles/minetest.dir/script/lua_api/l_settings.cpp.o [ 23%] Building CXX object src/CMakeFiles/minetest.dir/script/lua_api/l_sound.cpp.o [ 24%] Building CXX object src/CMakeFiles/minetest.dir/script/lua_api/l_storage.cpp.o [ 24%] Building CXX object src/CMakeFiles/minetest.dir/script/lua_api/l_util.cpp.o [ 25%] Building CXX object src/CMakeFiles/minetest.dir/script/lua_api/l_vmanip.cpp.o [ 25%] Building CXX object src/CMakeFiles/minetest.dir/script/scripting_mainmenu.cpp.o [ 26%] Building CXX object src/CMakeFiles/minetest.dir/script/serverscripting.cpp.o [ 26%] Building CXX object src/CMakeFiles/minetest.dir/threading/event.cpp.o [ 27%] Building CXX object src/CMakeFiles/minetest.dir/threading/mutex.cpp.o [ 27%] Building CXX object src/CMakeFiles/minetest.dir/threading/semaphore.cpp.o [ 27%] Building CXX object src/CMakeFiles/minetest.dir/threading/thread.cpp.o [ 28%] Building CXX object src/CMakeFiles/minetest.dir/unittest/test.cpp.o [ 28%] Building CXX object src/CMakeFiles/minetest.dir/unittest/test_areastore.cpp.o [ 29%] Building CXX object src/CMakeFiles/minetest.dir/unittest/test_collision.cpp.o [ 29%] Building CXX object src/CMakeFiles/minetest.dir/unittest/test_compression.cpp.o [ 30%] Building CXX object src/CMakeFiles/minetest.dir/unittest/test_connection.cpp.o [ 30%] Building CXX object src/CMakeFiles/minetest.dir/unittest/test_filepath.cpp.o [ 31%] Building CXX object src/CMakeFiles/minetest.dir/unittest/test_inventory.cpp.o [ 31%] Building CXX object src/CMakeFiles/minetest.dir/unittest/test_keycode.cpp.o [ 31%] Building CXX object src/CMakeFiles/minetest.dir/unittest/test_map_settings_manager.cpp.o [ 32%] Building CXX object src/CMakeFiles/minetest.dir/unittest/test_mapnode.cpp.o [ 32%] Building CXX object src/CMakeFiles/minetest.dir/unittest/test_nodedef.cpp.o [ 33%] Building CXX object src/CMakeFiles/minetest.dir/unittest/test_noderesolver.cpp.o [ 33%] Building CXX object src/CMakeFiles/minetest.dir/unittest/test_noise.cpp.o [ 34%] Building CXX object src/CMakeFiles/minetest.dir/unittest/test_objdef.cpp.o [ 34%] Building CXX object src/CMakeFiles/minetest.dir/unittest/test_player.cpp.o [ 35%] Building CXX object src/CMakeFiles/minetest.dir/unittest/test_profiler.cpp.o [ 35%] Building CXX object src/CMakeFiles/minetest.dir/unittest/test_random.cpp.o [ 36%] Building CXX object src/CMakeFiles/minetest.dir/unittest/test_schematic.cpp.o [ 36%] Building CXX object src/CMakeFiles/minetest.dir/unittest/test_serialization.cpp.o [ 36%] Building CXX object src/CMakeFiles/minetest.dir/unittest/test_settings.cpp.o [ 37%] Building CXX object src/CMakeFiles/minetest.dir/unittest/test_socket.cpp.o [ 37%] Building CXX object src/CMakeFiles/minetest.dir/unittest/test_threading.cpp.o [ 38%] Building CXX object src/CMakeFiles/minetest.dir/unittest/test_utilities.cpp.o [ 38%] Building CXX object src/CMakeFiles/minetest.dir/unittest/test_voxelalgorithms.cpp.o [ 39%] Building CXX object src/CMakeFiles/minetest.dir/unittest/test_voxelmanipulator.cpp.o [ 39%] Building CXX object src/CMakeFiles/minetest.dir/util/areastore.cpp.o [ 40%] Building CXX object src/CMakeFiles/minetest.dir/util/auth.cpp.o [ 40%] Building CXX object src/CMakeFiles/minetest.dir/util/base64.cpp.o [ 40%] Building CXX object src/CMakeFiles/minetest.dir/util/directiontables.cpp.o [ 41%] Building CXX object src/CMakeFiles/minetest.dir/util/enriched_string.cpp.o [ 41%] Building CXX object src/CMakeFiles/minetest.dir/util/numeric.cpp.o [ 42%] Building CXX object src/CMakeFiles/minetest.dir/util/pointedthing.cpp.o [ 42%] Building CXX object src/CMakeFiles/minetest.dir/util/serialize.cpp.o [ 43%] Building CXX object src/CMakeFiles/minetest.dir/util/sha1.cpp.o [ 43%] Building C object src/CMakeFiles/minetest.dir/util/sha256.c.o [ 44%] Building CXX object src/CMakeFiles/minetest.dir/util/srp.cpp.o [ 44%] Building CXX object src/CMakeFiles/minetest.dir/util/string.cpp.o [ 45%] Building CXX object src/CMakeFiles/minetest.dir/util/timetaker.cpp.o [ 45%] Building CXX object src/CMakeFiles/minetest.dir/ban.cpp.o [ 45%] Building CXX object src/CMakeFiles/minetest.dir/camera.cpp.o [ 46%] Building CXX object src/CMakeFiles/minetest.dir/cavegen.cpp.o [ 46%] Building CXX object src/CMakeFiles/minetest.dir/chat.cpp.o [ 47%] Building CXX object src/CMakeFiles/minetest.dir/client.cpp.o [ 47%] Building CXX object src/CMakeFiles/minetest.dir/clientenvironment.cpp.o [ 48%] Building CXX object src/CMakeFiles/minetest.dir/clientiface.cpp.o [ 48%] Building CXX object src/CMakeFiles/minetest.dir/clientmap.cpp.o [ 49%] Building CXX object src/CMakeFiles/minetest.dir/clientmedia.cpp.o [ 49%] Building CXX object src/CMakeFiles/minetest.dir/clientobject.cpp.o [ 50%] Building CXX object src/CMakeFiles/minetest.dir/clouds.cpp.o [ 50%] Building CXX object src/CMakeFiles/minetest.dir/collision.cpp.o [ 50%] Building CXX object src/CMakeFiles/minetest.dir/content_abm.cpp.o [ 51%] Building CXX object src/CMakeFiles/minetest.dir/content_cao.cpp.o [ 51%] Building CXX object src/CMakeFiles/minetest.dir/content_cso.cpp.o [ 52%] Building CXX object src/CMakeFiles/minetest.dir/content_mapblock.cpp.o [ 52%] Building CXX object src/CMakeFiles/minetest.dir/content_mapnode.cpp.o [ 53%] Building CXX object src/CMakeFiles/minetest.dir/content_nodemeta.cpp.o [ 53%] Building CXX object src/CMakeFiles/minetest.dir/content_sao.cpp.o [ 54%] Building CXX object src/CMakeFiles/minetest.dir/convert_json.cpp.o [ 54%] Building CXX object src/CMakeFiles/minetest.dir/craftdef.cpp.o [ 54%] Building CXX object src/CMakeFiles/minetest.dir/database-dummy.cpp.o [ 55%] Building CXX object src/CMakeFiles/minetest.dir/database-leveldb.cpp.o [ 55%] Building CXX object src/CMakeFiles/minetest.dir/database-postgresql.cpp.o [ 56%] Building CXX object src/CMakeFiles/minetest.dir/database-redis.cpp.o [ 56%] Building CXX object src/CMakeFiles/minetest.dir/database-sqlite3.cpp.o [ 57%] Building CXX object src/CMakeFiles/minetest.dir/database.cpp.o [ 57%] Building CXX object src/CMakeFiles/minetest.dir/debug.cpp.o [ 58%] Building CXX object src/CMakeFiles/minetest.dir/defaultsettings.cpp.o [ 58%] Building CXX object src/CMakeFiles/minetest.dir/drawscene.cpp.o [ 59%] Building CXX object src/CMakeFiles/minetest.dir/dungeongen.cpp.o [ 59%] Building CXX object src/CMakeFiles/minetest.dir/emerge.cpp.o [ 59%] Building CXX object src/CMakeFiles/minetest.dir/environment.cpp.o [ 60%] Building CXX object src/CMakeFiles/minetest.dir/filecache.cpp.o [ 60%] Building CXX object src/CMakeFiles/minetest.dir/filesys.cpp.o [ 61%] Building CXX object src/CMakeFiles/minetest.dir/fontengine.cpp.o [ 61%] Building CXX object src/CMakeFiles/minetest.dir/game.cpp.o [ 62%] Building CXX object src/CMakeFiles/minetest.dir/genericobject.cpp.o [ 62%] Building CXX object src/CMakeFiles/minetest.dir/gettext.cpp.o [ 63%] Building CXX object src/CMakeFiles/minetest.dir/guiChatConsole.cpp.o [ 63%] Building CXX object src/CMakeFiles/minetest.dir/guiEngine.cpp.o [ 63%] Building CXX object src/CMakeFiles/minetest.dir/guiFileSelectMenu.cpp.o [ 64%] Building CXX object src/CMakeFiles/minetest.dir/guiFormSpecMenu.cpp.o [ 64%] Building CXX object src/CMakeFiles/minetest.dir/guiKeyChangeMenu.cpp.o [ 65%] Building CXX object src/CMakeFiles/minetest.dir/guiPasswordChange.cpp.o [ 65%] Building CXX object src/CMakeFiles/minetest.dir/guiTable.cpp.o [ 66%] Building CXX object src/CMakeFiles/minetest.dir/guiVolumeChange.cpp.o [ 66%] Building CXX object src/CMakeFiles/minetest.dir/guiscalingfilter.cpp.o [ 67%] Building CXX object src/CMakeFiles/minetest.dir/httpfetch.cpp.o [ 67%] Building CXX object src/CMakeFiles/minetest.dir/hud.cpp.o [ 68%] Building CXX object src/CMakeFiles/minetest.dir/imagefilters.cpp.o [ 68%] Building CXX object src/CMakeFiles/minetest.dir/intlGUIEditBox.cpp.o [ 68%] Building CXX object src/CMakeFiles/minetest.dir/inventory.cpp.o [ 69%] Building CXX object src/CMakeFiles/minetest.dir/inventorymanager.cpp.o [ 69%] Building CXX object src/CMakeFiles/minetest.dir/itemdef.cpp.o [ 70%] Building CXX object src/CMakeFiles/minetest.dir/itemstackmetadata.cpp.o [ 70%] Building CXX object src/CMakeFiles/minetest.dir/keycode.cpp.o [ 71%] Building CXX object src/CMakeFiles/minetest.dir/light.cpp.o [ 71%] Building CXX object src/CMakeFiles/minetest.dir/localplayer.cpp.o [ 72%] Building CXX object src/CMakeFiles/minetest.dir/log.cpp.o [ 72%] Building CXX object src/CMakeFiles/minetest.dir/main.cpp.o [ 72%] Building CXX object src/CMakeFiles/minetest.dir/map.cpp.o [ 73%] Building CXX object src/CMakeFiles/minetest.dir/map_settings_manager.cpp.o [ 73%] Building CXX object src/CMakeFiles/minetest.dir/mapblock.cpp.o [ 74%] Building CXX object src/CMakeFiles/minetest.dir/mapblock_mesh.cpp.o [ 74%] Building CXX object src/CMakeFiles/minetest.dir/mapgen.cpp.o [ 75%] Building CXX object src/CMakeFiles/minetest.dir/mapgen_flat.cpp.o [ 75%] Building CXX object src/CMakeFiles/minetest.dir/mapgen_fractal.cpp.o [ 76%] Building CXX object src/CMakeFiles/minetest.dir/mapgen_singlenode.cpp.o [ 76%] Building CXX object src/CMakeFiles/minetest.dir/mapgen_v5.cpp.o [ 77%] Building CXX object src/CMakeFiles/minetest.dir/mapgen_v6.cpp.o [ 77%] Building CXX object src/CMakeFiles/minetest.dir/mapgen_v7.cpp.o [ 77%] Building CXX object src/CMakeFiles/minetest.dir/mapgen_valleys.cpp.o [ 78%] Building CXX object src/CMakeFiles/minetest.dir/mapnode.cpp.o [ 78%] Building CXX object src/CMakeFiles/minetest.dir/mapsector.cpp.o [ 79%] Building CXX object src/CMakeFiles/minetest.dir/mesh.cpp.o [ 79%] Building CXX object src/CMakeFiles/minetest.dir/metadata.cpp.o [ 80%] Building CXX object src/CMakeFiles/minetest.dir/mg_biome.cpp.o [ 80%] Building CXX object src/CMakeFiles/minetest.dir/mg_decoration.cpp.o [ 81%] Building CXX object src/CMakeFiles/minetest.dir/mg_ore.cpp.o [ 81%] Building CXX object src/CMakeFiles/minetest.dir/mg_schematic.cpp.o [ 81%] Building CXX object src/CMakeFiles/minetest.dir/minimap.cpp.o [ 82%] Building CXX object src/CMakeFiles/minetest.dir/mods.cpp.o [ 82%] Building CXX object src/CMakeFiles/minetest.dir/nameidmapping.cpp.o [ 83%] Building CXX object src/CMakeFiles/minetest.dir/nodedef.cpp.o [ 83%] Building CXX object src/CMakeFiles/minetest.dir/nodemetadata.cpp.o [ 84%] Building CXX object src/CMakeFiles/minetest.dir/nodetimer.cpp.o [ 84%] Building CXX object src/CMakeFiles/minetest.dir/noise.cpp.o [ 85%] Building CXX object src/CMakeFiles/minetest.dir/objdef.cpp.o [ 85%] Building CXX object src/CMakeFiles/minetest.dir/object_properties.cpp.o [ 86%] Building CXX object src/CMakeFiles/minetest.dir/particles.cpp.o [ 86%] Building CXX object src/CMakeFiles/minetest.dir/pathfinder.cpp.o [ 86%] Building CXX object src/CMakeFiles/minetest.dir/player.cpp.o [ 87%] Building CXX object src/CMakeFiles/minetest.dir/porting.cpp.o [ 87%] Building CXX object src/CMakeFiles/minetest.dir/profiler.cpp.o [ 88%] Building CXX object src/CMakeFiles/minetest.dir/quicktune.cpp.o [ 88%] Building CXX object src/CMakeFiles/minetest.dir/raycast.cpp.o [ 89%] Building CXX object src/CMakeFiles/minetest.dir/reflowscan.cpp.o [ 89%] Building CXX object src/CMakeFiles/minetest.dir/remoteplayer.cpp.o [ 90%] Building CXX object src/CMakeFiles/minetest.dir/rollback.cpp.o [ 90%] Building CXX object src/CMakeFiles/minetest.dir/rollback_interface.cpp.o [ 90%] Building CXX object src/CMakeFiles/minetest.dir/serialization.cpp.o [ 91%] Building CXX object src/CMakeFiles/minetest.dir/server.cpp.o [ 91%] Building CXX object src/CMakeFiles/minetest.dir/serverenvironment.cpp.o [ 92%] Building CXX object src/CMakeFiles/minetest.dir/serverlist.cpp.o [ 92%] Building CXX object src/CMakeFiles/minetest.dir/serverobject.cpp.o [ 93%] Building CXX object src/CMakeFiles/minetest.dir/settings.cpp.o [ 93%] Building CXX object src/CMakeFiles/minetest.dir/shader.cpp.o [ 94%] Building CXX object src/CMakeFiles/minetest.dir/sky.cpp.o [ 94%] Building CXX object src/CMakeFiles/minetest.dir/socket.cpp.o [ 95%] Building CXX object src/CMakeFiles/minetest.dir/sound.cpp.o [ 95%] Building CXX object src/CMakeFiles/minetest.dir/sound_openal.cpp.o [ 95%] Building CXX object src/CMakeFiles/minetest.dir/staticobject.cpp.o [ 96%] Building CXX object src/CMakeFiles/minetest.dir/subgame.cpp.o [ 96%] Building CXX object src/CMakeFiles/minetest.dir/terminal_chat_console.cpp.o [ 97%] Building CXX object src/CMakeFiles/minetest.dir/tileanimation.cpp.o [ 97%] Building CXX object src/CMakeFiles/minetest.dir/tool.cpp.o [ 98%] Building CXX object src/CMakeFiles/minetest.dir/treegen.cpp.o [ 98%] Building CXX object src/CMakeFiles/minetest.dir/version.cpp.o [ 99%] Building CXX object src/CMakeFiles/minetest.dir/voxel.cpp.o [ 99%] Building CXX object src/CMakeFiles/minetest.dir/voxelalgorithms.cpp.o [100%] Building CXX object src/CMakeFiles/minetest.dir/wieldmesh.cpp.o Linking CXX executable ../../../bin/minetest /usr/bin/ld: /usr/local/lib/libcurl.a(libcurl_la-ssluse.o): référence au symbole non défini «SSL_get_verify_result@@OPENSSL_1.0.0» /lib/x86_64-linux-gnu/libssl.so.1.0.0: error adding symbols: DSO missing from command line collect2: error: ld returned 1 exit status src/CMakeFiles/minetest.dir/build.make:5568: recipe for target '../../bin/minetest' failed make[2]: *** [../../bin/minetest] Error 1 CMakeFiles/Makefile2:166: recipe for target 'src/CMakeFiles/minetest.dir/all' failed make[1]: *** [src/CMakeFiles/minetest.dir/all] Error 2 Makefile:136: recipe for target 'all' failed make: *** [all] Error 2 θ76° mael@mael-GE60:~/projets/minetest/build/linux master* 4m25s 2 ±
Optional Paste Settings
Category:
None
Cryptocurrency
Cybersecurity
Fixit
Food
Gaming
Haiku
Help
History
Housing
Jokes
Legal
Money
Movies
Music
Pets
Photo
Science
Software
Source Code
Spirit
Sports
Travel
TV
Writing
Tags:
Syntax Highlighting:
None
Bash
C
C#
C++
CSS
HTML
JSON
Java
JavaScript
Lua
Markdown (PRO members only)
Objective C
PHP
Perl
Python
Ruby
Swift
4CS
6502 ACME Cross Assembler
6502 Kick Assembler
6502 TASM/64TASS
ABAP
AIMMS
ALGOL 68
APT Sources
ARM
ASM (NASM)
ASP
ActionScript
ActionScript 3
Ada
Apache Log
AppleScript
Arduino
Asymptote
AutoIt
Autohotkey
Avisynth
Awk
BASCOM AVR
BNF
BOO
Bash
Basic4GL
Batch
BibTeX
Blitz Basic
Blitz3D
BlitzMax
BrainFuck
C
C (WinAPI)
C Intermediate Language
C for Macs
C#
C++
C++ (WinAPI)
C++ (with Qt extensions)
C: Loadrunner
CAD DCL
CAD Lisp
CFDG
CMake
COBOL
CSS
Ceylon
ChaiScript
Chapel
Clojure
Clone C
Clone C++
CoffeeScript
ColdFusion
Cuesheet
D
DCL
DCPU-16
DCS
DIV
DOT
Dart
Delphi
Delphi Prism (Oxygene)
Diff
E
ECMAScript
EPC
Easytrieve
Eiffel
Email
Erlang
Euphoria
F#
FO Language
Falcon
Filemaker
Formula One
Fortran
FreeBasic
FreeSWITCH
GAMBAS
GDB
GDScript
Game Maker
Genero
Genie
GetText
Go
Godot GLSL
Groovy
GwBasic
HQ9 Plus
HTML
HTML 5
Haskell
Haxe
HicEst
IDL
INI file
INTERCAL
IO
ISPF Panel Definition
Icon
Inno Script
J
JCL
JSON
Java
Java 5
JavaScript
Julia
KSP (Kontakt Script)
KiXtart
Kotlin
LDIF
LLVM
LOL Code
LScript
Latex
Liberty BASIC
Linden Scripting
Lisp
Loco Basic
Logtalk
Lotus Formulas
Lotus Script
Lua
M68000 Assembler
MIX Assembler
MK-61/52
MPASM
MXML
MagikSF
Make
MapBasic
Markdown (PRO members only)
MatLab
Mercury
MetaPost
Modula 2
Modula 3
Motorola 68000 HiSoft Dev
MySQL
Nagios
NetRexx
Nginx
Nim
NullSoft Installer
OCaml
OCaml Brief
Oberon 2
Objeck Programming Langua
Objective C
Octave
Open Object Rexx
OpenBSD PACKET FILTER
OpenGL Shading
Openoffice BASIC
Oracle 11
Oracle 8
Oz
PARI/GP
PCRE
PHP
PHP Brief
PL/I
PL/SQL
POV-Ray
ParaSail
Pascal
Pawn
Per
Perl
Perl 6
Phix
Pic 16
Pike
Pixel Bender
PostScript
PostgreSQL
PowerBuilder
PowerShell
ProFTPd
Progress
Prolog
Properties
ProvideX
Puppet
PureBasic
PyCon
Python
Python for S60
QBasic
QML
R
RBScript
REBOL
REG
RPM Spec
Racket
Rails
Rexx
Robots
Roff Manpage
Ruby
Ruby Gnuplot
Rust
SAS
SCL
SPARK
SPARQL
SQF
SQL
SSH Config
Scala
Scheme
Scilab
SdlBasic
Smalltalk
Smarty
StandardML
StoneScript
SuperCollider
Swift
SystemVerilog
T-SQL
TCL
TeXgraph
Tera Term
TypeScript
TypoScript
UPC
Unicon
UnrealScript
Urbi
VB.NET
VBScript
VHDL
VIM
Vala
Vedit
VeriLog
Visual Pro Log
VisualBasic
VisualFoxPro
WHOIS
WhiteSpace
Winbatch
XBasic
XML
XPP
Xojo
Xorg Config
YAML
YARA
Z80 Assembler
ZXBasic
autoconf
jQuery
mIRC
newLISP
q/kdb+
thinBasic
Paste Expiration:
Never
Burn after read
10 Minutes
1 Hour
1 Day
1 Week
2 Weeks
1 Month
6 Months
1 Year
Paste Exposure:
Public
Unlisted
Private
Folder:
(members only)
Password
NEW
Enabled
Disabled
Burn after read
NEW
Paste Name / Title:
Create New Paste
Hello
Guest
Sign Up
or
Login
Sign in with Facebook
Sign in with Twitter
Sign in with Google
You are currently not logged in, this means you can not edit or delete anything you paste.
Sign Up
or
Login
Public Pastes
Crypto admin access
29 min ago | 0.43 KB
Free Crypto Method
CSS | 30 min ago | 0.72 KB
+12,000$ in 2 days
CSS | 35 min ago | 0.72 KB
Documents
35 min ago | 0.43 KB
DRV8874Driver (AI coded)
Python | 8 hours ago | 7.14 KB
action_names_for_shortcuts_win
23 hours ago | 3.38 KB
Gatewarden Build Order -- Idle Hacking
1 day ago | 1.18 KB
OG OLDHAM CODE
1 day ago | 27.75 KB
We use cookies for various purposes including analytics. By continuing to use Pastebin, you agree to our use of cookies as described in the
Cookies Policy
.
OK, I Understand
Not a member of Pastebin yet?
Sign Up
, it unlocks many cool features!