SHARE
TWEET

sphinx-autobuild error

a guest Jul 29th, 2018 61 Never
Not a member of Pastebin yet? Sign Up, it unlocks many cool features!
  1. sphinx-autobuild -b html  _build/html
  2. Traceback (most recent call last):
  3.   File "/usr/lib/python3.6/site-packages/pkg_resources/__init__.py", line 570, in _build_master
  4.     ws.require(__requires__)
  5.   File "/usr/lib/python3.6/site-packages/pkg_resources/__init__.py", line 888, in require
  6.     needed = self.resolve(parse_requirements(requirements))
  7.   File "/usr/lib/python3.6/site-packages/pkg_resources/__init__.py", line 779, in resolve
  8.     raise VersionConflict(dist, req).with_context(dependent_req)
  9. pkg_resources.ContextualVersionConflict: (port-for 0.4 (/usr/lib/python3.6/site-packages), Requirement.parse('port_for==0.3.1'), {'sphinx-autobuild'})
  10.  
  11. During handling of the above exception, another exception occurred:
  12.  
  13. Traceback (most recent call last):
  14.   File "/usr/bin/sphinx-autobuild", line 6, in <module>
  15.     from pkg_resources import load_entry_point
  16.   File "/usr/lib/python3.6/site-packages/pkg_resources/__init__.py", line 3095, in <module>
  17.     @_call_aside
  18.   File "/usr/lib/python3.6/site-packages/pkg_resources/__init__.py", line 3079, in _call_aside
  19.     f(*args, **kwargs)
  20.   File "/usr/lib/python3.6/site-packages/pkg_resources/__init__.py", line 3108, in _initialize_master_working_set
  21.     working_set = WorkingSet._build_master()
  22.   File "/usr/lib/python3.6/site-packages/pkg_resources/__init__.py", line 572, in _build_master
  23.     return cls._build_from_requirements(__requires__)
  24.   File "/usr/lib/python3.6/site-packages/pkg_resources/__init__.py", line 585, in _build_from_requirements
  25.     dists = ws.resolve(reqs, Environment())
  26.   File "/usr/lib/python3.6/site-packages/pkg_resources/__init__.py", line 774, in resolve
  27.     raise DistributionNotFound(req, requirers)
  28. pkg_resources.DistributionNotFound: The 'port_for==0.3.1' distribution was not found and is required by sphinx-autobuild
  29. make: *** [Makefile:23: livehtml] Error 1
RAW Paste Data
We use cookies for various purposes including analytics. By continuing to use Pastebin, you agree to our use of cookies as described in the Cookies Policy. OK, I Understand
 
Top