SHARE
TWEET

Untitled

a guest Oct 17th, 2018 98 Never
Not a member of Pastebin yet? Sign Up, it unlocks many cool features!
  1. /build/gcc-git/src/gcc-build/./prev-gcc/xg++ -B/build/gcc-git/src/gcc-build/./prev-gcc/ -B/usr/x86_64-pc-linux-gnu/bin/ -nostdinc++ -B/build/gcc-git/src/gcc-build/prev-x86_64-pc-linux-gnu/libstdc++-v3/src/.libs -B/build/gcc-git/src/gcc-build/prev-x86_64-pc-linux-gnu/libstdc++-v3/libsupc++/.libs  -I/build/gcc-git/src/gcc-build/prev-x86_64-pc-linux-gnu/libstdc++-v3/include/x86_64-pc-linux-gnu  -I/build/gcc-git/src/gcc-build/prev-x86_64-pc-linux-gnu/libstdc++-v3/include  -I/build/gcc-git/src/gcc/libstdc++-v3/libsupc++ -L/build/gcc-git/src/gcc-build/prev-x86_64-pc-linux-gnu/libstdc++-v3/src/.libs -L/build/gcc-git/src/gcc-build/prev-x86_64-pc-linux-gnu/libstdc++-v3/libsupc++/.libs -fno-PIE -c   -g -O2 -fchecking=1 -DIN_GCC     -fno-exceptions -fno-rtti -fasynchronous-unwind-tables -W -Wall -Wno-narrowing -Wwrite-strings -Wcast-qual -Wmissing-format-attribute -Woverloaded-virtual -pedantic -Wno-long-long -Wno-variadic-macros -Wno-overlength-strings   -DHAVE_CONFIG_H -I. -I. -I/build/gcc-git/src/gcc/gcc -I/build/gcc-git/src/gcc/gcc/. -I/build/gcc-git/src/gcc/gcc/../include -I/build/gcc-git/src/gcc/gcc/../libcpp/include  -I/build/gcc-git/src/gcc/gcc/../libdecnumber -I/build/gcc-git/src/gcc/gcc/../libdecnumber/bid -I../libdecnumber -I/build/gcc-git/src/gcc/gcc/../libbacktrace -I/build/gcc-git/src/gcc-build/./isl/include -I/build/gcc-git/src/gcc/isl/include -D_FORTIFY_SOURCE=2 -o insn-automata.o -MT insn-automata.o -MMD -MP -MF ./.deps/insn-automata.TPo insn-automata.c
  2. /build/gcc-git/src/gcc/gcc/config/i386/i386.c: In function ‘const char* output_fix_trunc(rtx_insn*, rtx_def**, bool)’:
  3. /build/gcc-git/src/gcc/gcc/config/i386/i386.c:19200:1: error: invalid operand in unary operation
  4. 19200 | output_fix_trunc (rtx_insn *insn, rtx *operands, bool fisttp)
  5.       | ^~~~~~~~~~~~~~~~
  6. /build/gcc-git/src/gcc/gcc/config/i386/i386.c:19200:1: error: incorrect sharing of tree nodes
  7. (ssizetype) _19
  8. _58 = (long unsigned int) ((ssizetype) _19 <= 7 ? 7 - (ssizetype) _19 : 0);
  9. /build/gcc-git/src/gcc/gcc/config/i386/i386.c:19200: confused by earlier errors, bailing out
  10. make[3]: *** [Makefile:2287: i386.o] Error 1
RAW Paste Data
We use cookies for various purposes including analytics. By continuing to use Pastebin, you agree to our use of cookies as described in the Cookies Policy. OK, I Understand
 
Top