Guest User

Untitled

a guest
Oct 5th, 2018
283
0
Never
Not a member of Pastebin yet? Sign Up, it unlocks many cool features!
text 17.26 KB | None | 0 0
  1. me@webserver:/var/www/html/ReaSite$ sudo npm run development
  2.  
  3. > @ development /var/www/html/ReaSite
  4. > cross-env NODE_ENV=development node_modules/webpack/bin/webpack.js --progress --hide-modules --config=node_modules/laravel-mix/setup/webpack.config.js
  5.  
  6. 95% emitting
  7.  
  8. ERROR Failed to compile with 2 errors 15:02:13
  9.  
  10. error in ./resources/assets/sass/app.scss
  11.  
  12. Module build failed: Error: Node Sass does not yet support your current environment: Linux Unsupported architecture (arm) with Node.js 8.x
  13. For more information on which environments are supported please see:
  14. https://github.com/sass/node-sass/releases/tag/v4.9.3
  15. at module.exports (/var/www/html/ReaSite/node_modules/node-sass/lib/binding.js:13:13)
  16. at Object.<anonymous> (/var/www/html/ReaSite/node_modules/node-sass/lib/index.js:14:35)
  17. at Module._compile (module.js:653:30)
  18. at Object.Module._extensions..js (module.js:664:10)
  19. at Module.load (module.js:566:32)
  20. at tryModuleLoad (module.js:506:12)
  21. at Function.Module._load (module.js:498:3)
  22. at Module.require (module.js:597:17)
  23. at require (internal/module.js:11:18)
  24. at Object.<anonymous> (/var/www/html/ReaSite/node_modules/sass-loader/lib/loader.js:3:14)
  25. at Module._compile (module.js:653:30)
  26. at Object.Module._extensions..js (module.js:664:10)
  27. at Module.load (module.js:566:32)
  28. at tryModuleLoad (module.js:506:12)
  29. at Function.Module._load (module.js:498:3)
  30. at Module.require (module.js:597:17)
  31. at require (internal/module.js:11:18)
  32. at loadLoader (/var/www/html/ReaSite/node_modules/loader-runner/lib/loadLoader.js:13:17)
  33. at iteratePitchingLoaders (/var/www/html/ReaSite/node_modules/loader-runner/lib/LoaderRunner.js:169:2)
  34. at iteratePitchingLoaders (/var/www/html/ReaSite/node_modules/loader-runner/lib/LoaderRunner.js:165:10)
  35. at /var/www/html/ReaSite/node_modules/loader-runner/lib/LoaderRunner.js:173:18
  36. at loadLoader (/var/www/html/ReaSite/node_modules/loader-runner/lib/loadLoader.js:36:3)
  37. at iteratePitchingLoaders (/var/www/html/ReaSite/node_modules/loader-runner/lib/LoaderRunner.js:169:2)
  38. at iteratePitchingLoaders (/var/www/html/ReaSite/node_modules/loader-runner/lib/LoaderRunner.js:165:10)
  39. at /var/www/html/ReaSite/node_modules/loader-runner/lib/LoaderRunner.js:173:18
  40. at loadLoader (/var/www/html/ReaSite/node_modules/loader-runner/lib/loadLoader.js:36:3)
  41. at iteratePitchingLoaders (/var/www/html/ReaSite/node_modules/loader-runner/lib/LoaderRunner.js:169:2)
  42. at iteratePitchingLoaders (/var/www/html/ReaSite/node_modules/loader-runner/lib/LoaderRunner.js:165:10)
  43. at /var/www/html/ReaSite/node_modules/loader-runner/lib/LoaderRunner.js:173:18
  44. at loadLoader (/var/www/html/ReaSite/node_modules/loader-runner/lib/loadLoader.js:36:3)
  45.  
  46. @ ./resources/assets/sass/app.scss 4:14-266
  47. @ multi ./resources/assets/js/app.js ./resources/assets/sass/app.scss
  48.  
  49. error in ./resources/assets/sass/app.scss
  50.  
  51. Module build failed: ModuleBuildError: Module build failed: Error: Node Sass does not yet support your current environment: Linux Unsupported architecture (arm) with Node.js 8.x
  52. For more information on which environments are supported please see:
  53. https://github.com/sass/node-sass/releases/tag/v4.9.3
  54. at module.exports (/var/www/html/ReaSite/node_modules/node-sass/lib/binding.js:13:13)
  55. at Object.<anonymous> (/var/www/html/ReaSite/node_modules/node-sass/lib/index.js:14:35)
  56. at Module._compile (module.js:653:30)
  57. at Object.Module._extensions..js (module.js:664:10)
  58. at Module.load (module.js:566:32)
  59. at tryModuleLoad (module.js:506:12)
  60. at Function.Module._load (module.js:498:3)
  61. at Module.require (module.js:597:17)
  62. at require (internal/module.js:11:18)
  63. at Object.<anonymous> (/var/www/html/ReaSite/node_modules/sass-loader/lib/loader.js:3:14)
  64. at Module._compile (module.js:653:30)
  65. at Object.Module._extensions..js (module.js:664:10)
  66. at Module.load (module.js:566:32)
  67. at tryModuleLoad (module.js:506:12)
  68. at Function.Module._load (module.js:498:3)
  69. at Module.require (module.js:597:17)
  70. at require (internal/module.js:11:18)
  71. at loadLoader (/var/www/html/ReaSite/node_modules/loader-runner/lib/loadLoader.js:13:17)
  72. at iteratePitchingLoaders (/var/www/html/ReaSite/node_modules/loader-runner/lib/LoaderRunner.js:169:2)
  73. at iteratePitchingLoaders (/var/www/html/ReaSite/node_modules/loader-runner/lib/LoaderRunner.js:165:10)
  74. at /var/www/html/ReaSite/node_modules/loader-runner/lib/LoaderRunner.js:173:18
  75. at loadLoader (/var/www/html/ReaSite/node_modules/loader-runner/lib/loadLoader.js:36:3)
  76. at iteratePitchingLoaders (/var/www/html/ReaSite/node_modules/loader-runner/lib/LoaderRunner.js:169:2)
  77. at iteratePitchingLoaders (/var/www/html/ReaSite/node_modules/loader-runner/lib/LoaderRunner.js:165:10)
  78. at /var/www/html/ReaSite/node_modules/loader-runner/lib/LoaderRunner.js:173:18
  79. at loadLoader (/var/www/html/ReaSite/node_modules/loader-runner/lib/loadLoader.js:36:3)
  80. at iteratePitchingLoaders (/var/www/html/ReaSite/node_modules/loader-runner/lib/LoaderRunner.js:169:2)
  81. at iteratePitchingLoaders (/var/www/html/ReaSite/node_modules/loader-runner/lib/LoaderRunner.js:165:10)
  82. at /var/www/html/ReaSite/node_modules/loader-runner/lib/LoaderRunner.js:173:18
  83. at loadLoader (/var/www/html/ReaSite/node_modules/loader-runner/lib/loadLoader.js:36:3)
  84. at runLoaders (/var/www/html/ReaSite/node_modules/webpack/lib/NormalModule.js:195:19)
  85. at /var/www/html/ReaSite/node_modules/loader-runner/lib/LoaderRunner.js:364:11
  86. at /var/www/html/ReaSite/node_modules/loader-runner/lib/LoaderRunner.js:170:18
  87. at loadLoader (/var/www/html/ReaSite/node_modules/loader-runner/lib/loadLoader.js:27:11)
  88. at iteratePitchingLoaders (/var/www/html/ReaSite/node_modules/loader-runner/lib/LoaderRunner.js:169:2)
  89. at iteratePitchingLoaders (/var/www/html/ReaSite/node_modules/loader-runner/lib/LoaderRunner.js:165:10)
  90. at /var/www/html/ReaSite/node_modules/loader-runner/lib/LoaderRunner.js:173:18
  91. at loadLoader (/var/www/html/ReaSite/node_modules/loader-runner/lib/loadLoader.js:36:3)
  92. at iteratePitchingLoaders (/var/www/html/ReaSite/node_modules/loader-runner/lib/LoaderRunner.js:169:2)
  93. at iteratePitchingLoaders (/var/www/html/ReaSite/node_modules/loader-runner/lib/LoaderRunner.js:165:10)
  94. at /var/www/html/ReaSite/node_modules/loader-runner/lib/LoaderRunner.js:173:18
  95. at loadLoader (/var/www/html/ReaSite/node_modules/loader-runner/lib/loadLoader.js:36:3)
  96. at iteratePitchingLoaders (/var/www/html/ReaSite/node_modules/loader-runner/lib/LoaderRunner.js:169:2)
  97. at iteratePitchingLoaders (/var/www/html/ReaSite/node_modules/loader-runner/lib/LoaderRunner.js:165:10)
  98. at /var/www/html/ReaSite/node_modules/loader-runner/lib/LoaderRunner.js:173:18
  99. at loadLoader (/var/www/html/ReaSite/node_modules/loader-runner/lib/loadLoader.js:36:3)
  100. at iteratePitchingLoaders (/var/www/html/ReaSite/node_modules/loader-runner/lib/LoaderRunner.js:169:2)
  101. at runLoaders (/var/www/html/ReaSite/node_modules/loader-runner/lib/LoaderRunner.js:362:2)
  102. at NormalModule.doBuild (/var/www/html/ReaSite/node_modules/webpack/lib/NormalModule.js:182:3)
  103. at NormalModule.build (/var/www/html/ReaSite/node_modules/webpack/lib/NormalModule.js:275:15)
  104. at Compilation.buildModule (/var/www/html/ReaSite/node_modules/webpack/lib/Compilation.js:157:10)
  105. at moduleFactory.create (/var/www/html/ReaSite/node_modules/webpack/lib/Compilation.js:460:10)
  106. at factory (/var/www/html/ReaSite/node_modules/webpack/lib/NormalModuleFactory.js:243:5)
  107. at applyPluginsAsyncWaterfall (/var/www/html/ReaSite/node_modules/webpack/lib/NormalModuleFactory.js:94:13)
  108. at /var/www/html/ReaSite/node_modules/tapable/lib/Tapable.js:268:11
  109. at NormalModuleFactory.params.normalModuleFactory.plugin (/var/www/html/ReaSite/node_modules/webpack/lib/CompatibilityPlugin.js:52:5)
  110. at NormalModuleFactory.applyPluginsAsyncWaterfall (/var/www/html/ReaSite/node_modules/tapable/lib/Tapable.js:272:13)
  111. at resolver (/var/www/html/ReaSite/node_modules/webpack/lib/NormalModuleFactory.js:69:10)
  112. at process.nextTick (/var/www/html/ReaSite/node_modules/webpack/lib/NormalModuleFactory.js:196:7)
  113. at _combinedTickCallback (internal/process/next_tick.js:132:7)
  114. Asset Size Chunks Chunk Names
  115. /js/app.js 1.24 MB 0 [emitted] [big] /js/app
  116.  
  117. ERROR in ./node_modules/css-loader??ref--5-2!./node_modules/postcss-loader/lib??postcss!./node_modules/resolve-url-loader??ref--5-4!./node_modules/sass-loader/lib/loader.js??ref--5-5!./resources/assets/sass/app.scss
  118. Module build failed: Error: Node Sass does not yet support your current environment: Linux Unsupported architecture (arm) with Node.js 8.x
  119. For more information on which environments are supported please see:
  120. https://github.com/sass/node-sass/releases/tag/v4.9.3
  121. at module.exports (/var/www/html/ReaSite/node_modules/node-sass/lib/binding.js:13:13)
  122. at Object.<anonymous> (/var/www/html/ReaSite/node_modules/node-sass/lib/index.js:14:35)
  123. at Module._compile (module.js:653:30)
  124. at Object.Module._extensions..js (module.js:664:10)
  125. at Module.load (module.js:566:32)
  126. at tryModuleLoad (module.js:506:12)
  127. at Function.Module._load (module.js:498:3)
  128. at Module.require (module.js:597:17)
  129. at require (internal/module.js:11:18)
  130. at Object.<anonymous> (/var/www/html/ReaSite/node_modules/sass-loader/lib/loader.js:3:14)
  131. at Module._compile (module.js:653:30)
  132. at Object.Module._extensions..js (module.js:664:10)
  133. at Module.load (module.js:566:32)
  134. at tryModuleLoad (module.js:506:12)
  135. at Function.Module._load (module.js:498:3)
  136. at Module.require (module.js:597:17)
  137. at require (internal/module.js:11:18)
  138. at loadLoader (/var/www/html/ReaSite/node_modules/loader-runner/lib/loadLoader.js:13:17)
  139. at iteratePitchingLoaders (/var/www/html/ReaSite/node_modules/loader-runner/lib/LoaderRunner.js:169:2)
  140. at iteratePitchingLoaders (/var/www/html/ReaSite/node_modules/loader-runner/lib/LoaderRunner.js:165:10)
  141. at /var/www/html/ReaSite/node_modules/loader-runner/lib/LoaderRunner.js:173:18
  142. at loadLoader (/var/www/html/ReaSite/node_modules/loader-runner/lib/loadLoader.js:36:3)
  143. at iteratePitchingLoaders (/var/www/html/ReaSite/node_modules/loader-runner/lib/LoaderRunner.js:169:2)
  144. at iteratePitchingLoaders (/var/www/html/ReaSite/node_modules/loader-runner/lib/LoaderRunner.js:165:10)
  145. at /var/www/html/ReaSite/node_modules/loader-runner/lib/LoaderRunner.js:173:18
  146. at loadLoader (/var/www/html/ReaSite/node_modules/loader-runner/lib/loadLoader.js:36:3)
  147. at iteratePitchingLoaders (/var/www/html/ReaSite/node_modules/loader-runner/lib/LoaderRunner.js:169:2)
  148. at iteratePitchingLoaders (/var/www/html/ReaSite/node_modules/loader-runner/lib/LoaderRunner.js:165:10)
  149. at /var/www/html/ReaSite/node_modules/loader-runner/lib/LoaderRunner.js:173:18
  150. at loadLoader (/var/www/html/ReaSite/node_modules/loader-runner/lib/loadLoader.js:36:3)
  151. @ ./resources/assets/sass/app.scss 4:14-266
  152. @ multi ./resources/assets/js/app.js ./resources/assets/sass/app.scss
  153.  
  154. ERROR in ./resources/assets/sass/app.scss
  155. Module build failed: ModuleBuildError: Module build failed: Error: Node Sass does not yet support your current environment: Linux Unsupported architecture (arm) with Node.js 8.x
  156. For more information on which environments are supported please see:
  157. https://github.com/sass/node-sass/releases/tag/v4.9.3
  158. at module.exports (/var/www/html/ReaSite/node_modules/node-sass/lib/binding.js:13:13)
  159. at Object.<anonymous> (/var/www/html/ReaSite/node_modules/node-sass/lib/index.js:14:35)
  160. at Module._compile (module.js:653:30)
  161. at Object.Module._extensions..js (module.js:664:10)
  162. at Module.load (module.js:566:32)
  163. at tryModuleLoad (module.js:506:12)
  164. at Function.Module._load (module.js:498:3)
  165. at Module.require (module.js:597:17)
  166. at require (internal/module.js:11:18)
  167. at Object.<anonymous> (/var/www/html/ReaSite/node_modules/sass-loader/lib/loader.js:3:14)
  168. at Module._compile (module.js:653:30)
  169. at Object.Module._extensions..js (module.js:664:10)
  170. at Module.load (module.js:566:32)
  171. at tryModuleLoad (module.js:506:12)
  172. at Function.Module._load (module.js:498:3)
  173. at Module.require (module.js:597:17)
  174. at require (internal/module.js:11:18)
  175. at loadLoader (/var/www/html/ReaSite/node_modules/loader-runner/lib/loadLoader.js:13:17)
  176. at iteratePitchingLoaders (/var/www/html/ReaSite/node_modules/loader-runner/lib/LoaderRunner.js:169:2)
  177. at iteratePitchingLoaders (/var/www/html/ReaSite/node_modules/loader-runner/lib/LoaderRunner.js:165:10)
  178. at /var/www/html/ReaSite/node_modules/loader-runner/lib/LoaderRunner.js:173:18
  179. at loadLoader (/var/www/html/ReaSite/node_modules/loader-runner/lib/loadLoader.js:36:3)
  180. at iteratePitchingLoaders (/var/www/html/ReaSite/node_modules/loader-runner/lib/LoaderRunner.js:169:2)
  181. at iteratePitchingLoaders (/var/www/html/ReaSite/node_modules/loader-runner/lib/LoaderRunner.js:165:10)
  182. at /var/www/html/ReaSite/node_modules/loader-runner/lib/LoaderRunner.js:173:18
  183. at loadLoader (/var/www/html/ReaSite/node_modules/loader-runner/lib/loadLoader.js:36:3)
  184. at iteratePitchingLoaders (/var/www/html/ReaSite/node_modules/loader-runner/lib/LoaderRunner.js:169:2)
  185. at iteratePitchingLoaders (/var/www/html/ReaSite/node_modules/loader-runner/lib/LoaderRunner.js:165:10)
  186. at /var/www/html/ReaSite/node_modules/loader-runner/lib/LoaderRunner.js:173:18
  187. at loadLoader (/var/www/html/ReaSite/node_modules/loader-runner/lib/loadLoader.js:36:3)
  188. at runLoaders (/var/www/html/ReaSite/node_modules/webpack/lib/NormalModule.js:195:19)
  189. at /var/www/html/ReaSite/node_modules/loader-runner/lib/LoaderRunner.js:364:11
  190. at /var/www/html/ReaSite/node_modules/loader-runner/lib/LoaderRunner.js:170:18
  191. at loadLoader (/var/www/html/ReaSite/node_modules/loader-runner/lib/loadLoader.js:27:11)
  192. at iteratePitchingLoaders (/var/www/html/ReaSite/node_modules/loader-runner/lib/LoaderRunner.js:169:2)
  193. at iteratePitchingLoaders (/var/www/html/ReaSite/node_modules/loader-runner/lib/LoaderRunner.js:165:10)
  194. at /var/www/html/ReaSite/node_modules/loader-runner/lib/LoaderRunner.js:173:18
  195. at loadLoader (/var/www/html/ReaSite/node_modules/loader-runner/lib/loadLoader.js:36:3)
  196. at iteratePitchingLoaders (/var/www/html/ReaSite/node_modules/loader-runner/lib/LoaderRunner.js:169:2)
  197. at iteratePitchingLoaders (/var/www/html/ReaSite/node_modules/loader-runner/lib/LoaderRunner.js:165:10)
  198. at /var/www/html/ReaSite/node_modules/loader-runner/lib/LoaderRunner.js:173:18
  199. at loadLoader (/var/www/html/ReaSite/node_modules/loader-runner/lib/loadLoader.js:36:3)
  200. at iteratePitchingLoaders (/var/www/html/ReaSite/node_modules/loader-runner/lib/LoaderRunner.js:169:2)
  201. at iteratePitchingLoaders (/var/www/html/ReaSite/node_modules/loader-runner/lib/LoaderRunner.js:165:10)
  202. at /var/www/html/ReaSite/node_modules/loader-runner/lib/LoaderRunner.js:173:18
  203. at loadLoader (/var/www/html/ReaSite/node_modules/loader-runner/lib/loadLoader.js:36:3)
  204. at iteratePitchingLoaders (/var/www/html/ReaSite/node_modules/loader-runner/lib/LoaderRunner.js:169:2)
  205. at runLoaders (/var/www/html/ReaSite/node_modules/loader-runner/lib/LoaderRunner.js:362:2)
  206. at NormalModule.doBuild (/var/www/html/ReaSite/node_modules/webpack/lib/NormalModule.js:182:3)
  207. at NormalModule.build (/var/www/html/ReaSite/node_modules/webpack/lib/NormalModule.js:275:15)
  208. at Compilation.buildModule (/var/www/html/ReaSite/node_modules/webpack/lib/Compilation.js:157:10)
  209. at moduleFactory.create (/var/www/html/ReaSite/node_modules/webpack/lib/Compilation.js:460:10)
  210. at factory (/var/www/html/ReaSite/node_modules/webpack/lib/NormalModuleFactory.js:243:5)
  211. at applyPluginsAsyncWaterfall (/var/www/html/ReaSite/node_modules/webpack/lib/NormalModuleFactory.js:94:13)
  212. at /var/www/html/ReaSite/node_modules/tapable/lib/Tapable.js:268:11
  213. at NormalModuleFactory.params.normalModuleFactory.plugin (/var/www/html/ReaSite/node_modules/webpack/lib/CompatibilityPlugin.js:52:5)
  214. at NormalModuleFactory.applyPluginsAsyncWaterfall (/var/www/html/ReaSite/node_modules/tapable/lib/Tapable.js:272:13)
  215. at resolver (/var/www/html/ReaSite/node_modules/webpack/lib/NormalModuleFactory.js:69:10)
  216. at process.nextTick (/var/www/html/ReaSite/node_modules/webpack/lib/NormalModuleFactory.js:196:7)
  217. at _combinedTickCallback (internal/process/next_tick.js:132:7)
  218. @ ./resources/assets/sass/app.scss
  219. @ multi ./resources/assets/js/app.js ./resources/assets/sass/app.scss
  220. npm ERR! code ELIFECYCLE
  221. npm ERR! errno 2
  222. npm ERR! @ development: `cross-env NODE_ENV=development node_modules/webpack/bin/webpack.js --progress --hide-modules --config=node_modules/laravel-mix/setup/webpack.config.js`
  223. npm ERR! Exit status 2
  224. npm ERR!
  225. npm ERR! Failed at the @ development script.
  226. npm ERR! This is probably not a problem with npm. There is likely additional logging output above.
  227.  
  228. npm ERR! A complete log of this run can be found in:
  229. npm ERR! /home/benno/.npm/_logs/2018-10-05T13_02_13_665Z-debug.log
Advertisement
Add Comment
Please, Sign In to add comment