Advertisement
Guest User

Untitled

a guest
Feb 1st, 2022
14
Never
Not a member of Pastebin yet? Sign Up, it unlocks many cool features!
  1. Deniss-Air:qaframework-bdd-tests juliet$ npm run refapp2OpenConceptLab
  2.  
  3. > openmrs-contrib-qaframework@0.1.0 refapp2OpenConceptLab /Users/juliet/Desktop/openmrs-contrib-qaframework/qaframework-bdd-tests
  4. > mvn test -Dcucumber.filter.tags='@selenium and @openConceptLab'
  5.  
  6. [INFO] Scanning for projects...
  7. [WARNING]
  8. [WARNING] Some problems were encountered while building the effective model for org.openmrs.contrib:qaframework-bdd-tests:jar:1.0-SNAPSHOT
  9. [WARNING] 'build.plugins.plugin.version' for org.apache.maven.plugins:maven-compiler-plugin is missing. @ line 183, column 21
  10. [WARNING]
  11. [WARNING] It is highly recommended to fix these problems because they threaten the stability of your build.
  12. [WARNING]
  13. [WARNING] For this reason, future Maven versions might no longer support building such malformed projects.
  14. [WARNING]
  15. [INFO]
  16. [INFO] -------------< org.openmrs.contrib:qaframework-bdd-tests >--------------
  17. [INFO] Building qaframework-bdd-tests 1.0-SNAPSHOT
  18. [INFO] --------------------------------[ jar ]---------------------------------
  19. [INFO]
  20. [INFO] --- frontend-maven-plugin:1.11.3:install-node-and-npm (install node and npm) @ qaframework-bdd-tests ---
  21. [INFO] Node v15.8.0 is already installed.
  22. [INFO]
  23. [INFO] --- maven-resources-plugin:2.6:resources (default-resources) @ qaframework-bdd-tests ---
  24. [INFO] Using 'UTF-8' encoding to copy filtered resources.
  25. [INFO] skip non existing resourceDirectory /Users/juliet/Desktop/openmrs-contrib-qaframework/qaframework-bdd-tests/src/main/resources
  26. [INFO]
  27. [INFO] --- maven-compiler-plugin:3.1:compile (default-compile) @ qaframework-bdd-tests ---
  28. [INFO] Nothing to compile - all classes are up to date
  29. [INFO]
  30. [INFO] --- maven-resources-plugin:2.6:testResources (default-testResources) @ qaframework-bdd-tests ---
  31. [INFO] Using 'UTF-8' encoding to copy filtered resources.
  32. [INFO] Copying 53 resources
  33. [INFO]
  34. [INFO] --- maven-compiler-plugin:3.1:testCompile (default-testCompile) @ qaframework-bdd-tests ---
  35. [INFO] Nothing to compile - all classes are up to date
  36. [INFO]
  37. [INFO] --- maven-antrun-plugin:1.8:run (make-mac-chromedriver-executable) @ qaframework-bdd-tests ---
  38. [INFO] Executing tasks
  39.  
  40. main:
  41. [INFO] Executed tasks
  42. [INFO]
  43. [INFO] --- maven-antrun-plugin:1.8:run (make-linux-chromedriver-executable) @ qaframework-bdd-tests ---
  44. [INFO] Executing tasks
  45.  
  46. main:
  47. [INFO] Executed tasks
  48. [INFO]
  49. [INFO] --- maven-antrun-plugin:1.8:run (make-windows-chromedriver-executable) @ qaframework-bdd-tests ---
  50. [INFO] Executing tasks
  51.  
  52. main:
  53. [INFO] Executed tasks
  54. [INFO]
  55. [INFO] --- maven-antrun-plugin:1.8:run (make-mac-firefoxdriver-executable) @ qaframework-bdd-tests ---
  56. [INFO] Executing tasks
  57.  
  58. main:
  59. [INFO] Executed tasks
  60. [INFO]
  61. [INFO] --- maven-antrun-plugin:1.8:run (make-linux-firefoxdriver-executable) @ qaframework-bdd-tests ---
  62. [INFO] Executing tasks
  63.  
  64. main:
  65. [INFO] Executed tasks
  66. [INFO]
  67. [INFO] --- maven-antrun-plugin:1.8:run (make-windows-firefoxdriver-executable) @ qaframework-bdd-tests ---
  68. [INFO] Executing tasks
  69.  
  70. main:
  71. [INFO] Executed tasks
  72. [INFO]
  73. [INFO] --- maven-surefire-plugin:2.12.4:test (default-test) @ qaframework-bdd-tests ---
  74. [INFO] Surefire report directory: /Users/juliet/Desktop/openmrs-contrib-qaframework/qaframework-bdd-tests/target/surefire-reports
  75.  
  76. -------------------------------------------------------
  77. T E S T S
  78. -------------------------------------------------------
  79. Running org.openmrs.contrib.qaframework.RunTest
  80. Running locally...
  81. log4j:WARN No appenders could be found for logger (io.netty.util.internal.logging.InternalLoggerFactory).
  82. log4j:WARN Please initialize the log4j system properly.
  83. 1643719376695 geckodriver INFO Listening on 127.0.0.1:5389
  84. 1643719377803 mozrunner::runner INFO Running command: "/Applications/Firefox.app/Contents/MacOS/firefox-bin" "--marionette" "-foreground" "-no-remote" "-profile" "/var/folders/fg/gzbqmc0d0qz0nwq3k8qkc5f80000gn/T/rust_mozprofilejX029r"
  85. 1643719380002 Marionette INFO Marionette enabled
  86. _RegisterApplication(), FAILED TO establish the default connection to the WindowServer, _CGSDefaultConnection() is NULL.
  87. _RegisterApplication(), FAILED TO establish the default connection to the WindowServer, _CGSDefaultConnection() is NULL.
  88. console.warn: SearchSettings: "get: No settings file exists, new profile?" (new NotFoundError("Could not open the file at /var/folders/fg/gzbqmc0d0qz0nwq3k8qkc5f80000gn/T/rust_mozprofilejX029r/search.json.mozlz4", (void 0)))
  89. console.error: BackgroundUpdate:
  90. _reasonsToNotScheduleUpdates: Failed to check for Maintenance Service Registry Key: [Exception... "Component returned failure code: 0x80004001 (NS_ERROR_NOT_IMPLEMENTED) [nsIUpdateProcessor.getServiceRegKeyExists]" nsresult: "0x80004001 (NS_ERROR_NOT_IMPLEMENTED)" location: "JS frame :: resource://gre/modules/BackgroundUpdate.jsm :: _reasonsToNotScheduleUpdates :: line 243" data: no]
  91. 1643719384924 Marionette INFO Listening on port 53232
  92. 1643719385030 RemoteAgent WARN TLS certificate errors will be ignored for this session
  93. Feb 01, 2022 3:43:05 PM org.openqa.selenium.remote.ProtocolHandshake createSession
  94. INFO: Detected dialect: W3C
  95. _RegisterApplication(), FAILED TO establish the default connection to the WindowServer, _CGSDefaultConnection() is NULL.
  96. console.warn: LoginRecipes: "getRecipes: falling back to a synchronous message for:" "https://qa-refapp.openmrs.org"
  97. console.warn: LoginRecipes: "getRecipes: falling back to a synchronous message for:" "https://qa-refapp.openmrs.org"
  98. console.warn: LoginRecipes: "getRecipes: falling back to a synchronous message for:" "https://qa-refapp.openmrs.org"
  99. console.warn: LoginRecipes: "getRecipes: falling back to a synchronous message for:" "https://qa-refapp.openmrs.org"
  100. console.warn: LoginRecipes: "getRecipes: falling back to a synchronous message for:" "https://qa-refapp.openmrs.org"
  101. console.warn: LoginRecipes: "getRecipes: falling back to a synchronous message for:" "https://qa-refapp.openmrs.org"
  102. 1643719552803 Marionette INFO Stopped listening on port 53232
  103.  
  104. ###!!! [Parent][RunMessage] Error: Channel closing: too late to send/recv, messages will be lost
  105.  
  106. Running locally...
  107. 1643719553603 geckodriver INFO Listening on 127.0.0.1:47084
  108. 1643719553658 mozrunner::runner INFO Running command: "/Applications/Firefox.app/Contents/MacOS/firefox-bin" "--marionette" "-foreground" "-no-remote" "-profile" "/var/folders/fg/gzbqmc0d0qz0nwq3k8qkc5f80000gn/T/rust_mozprofilem7AukY"
  109. 1643719554614 Marionette INFO Marionette enabled
  110. _RegisterApplication(), FAILED TO establish the default connection to the WindowServer, _CGSDefaultConnection() is NULL.
  111. _RegisterApplication(), FAILED TO establish the default connection to the WindowServer, _CGSDefaultConnection() is NULL.
  112. console.warn: SearchSettings: "get: No settings file exists, new profile?" (new NotFoundError("Could not open the file at /var/folders/fg/gzbqmc0d0qz0nwq3k8qkc5f80000gn/T/rust_mozprofilem7AukY/search.json.mozlz4", (void 0)))
  113. console.error: BackgroundUpdate:
  114. _reasonsToNotScheduleUpdates: Failed to check for Maintenance Service Registry Key: [Exception... "Component returned failure code: 0x80004001 (NS_ERROR_NOT_IMPLEMENTED) [nsIUpdateProcessor.getServiceRegKeyExists]" nsresult: "0x80004001 (NS_ERROR_NOT_IMPLEMENTED)" location: "JS frame :: resource://gre/modules/BackgroundUpdate.jsm :: _reasonsToNotScheduleUpdates :: line 243" data: no]
  115. 1643719556790 Marionette INFO Listening on port 53521
  116. 1643719556853 RemoteAgent WARN TLS certificate errors will be ignored for this session
  117. Feb 01, 2022 3:45:56 PM org.openqa.selenium.remote.ProtocolHandshake createSession
  118. INFO: Detected dialect: W3C
  119. _RegisterApplication(), FAILED TO establish the default connection to the WindowServer, _CGSDefaultConnection() is NULL.
  120. console.warn: LoginRecipes: "getRecipes: falling back to a synchronous message for:" "https://qa-refapp.openmrs.org"
  121. console.warn: LoginRecipes: "getRecipes: falling back to a synchronous message for:" "https://qa-refapp.openmrs.org"
  122. console.warn: LoginRecipes: "getRecipes: falling back to a synchronous message for:" "https://qa-refapp.openmrs.org"
  123. 1643719579100 Marionette INFO Stopped listening on port 53521
  124.  
  125. ###!!! [Parent][RunMessage] Error: Channel closing: too late to send/recv, messages will be lost
  126.  
  127. Tests run: 1, Failures: 0, Errors: 1, Skipped: 0, Time elapsed: 208.517 sec <<< FAILURE!
  128. OCL MANAGEMENT(OCL Subscription module) Time elapsed: 205.978 sec <<< ERROR!
  129. java.lang.NoClassDefFoundError: org.openqa.selenium.WebDriverException
  130. at org.openqa.selenium.support.ui.WebDriverWait.timeoutException(WebDriverWait.java:138)
  131. at org.openqa.selenium.support.ui.FluentWait.lambda$checkConditionInLoop$2(FluentWait.java:255)
  132. at java.util.concurrent.CompletableFuture$AsyncSupply.run(CompletableFuture.java:1604)
  133. at java.util.concurrent.CompletableFuture$AsyncSupply.exec(CompletableFuture.java:1596)
  134. at java.util.concurrent.ForkJoinTask.doExec(ForkJoinTask.java:289)
  135. at java.util.concurrent.ForkJoinPool$WorkQueue.runTask(ForkJoinPool.java:1056)
  136. at java.util.concurrent.ForkJoinPool.runWorker(ForkJoinPool.java:1692)
  137. at java.util.concurrent.ForkJoinWorkerThread.run(ForkJoinWorkerThread.java:157)
  138.  
  139.  
  140. Results :
  141.  
  142. Tests in error:
  143. OCL MANAGEMENT(OCL Subscription module): org.openqa.selenium.WebDriverException
  144.  
  145. Tests run: 1, Failures: 0, Errors: 1, Skipped: 0
  146.  
  147. [INFO] ------------------------------------------------------------------------
  148. [INFO] BUILD FAILURE
  149. [INFO] ------------------------------------------------------------------------
  150. [INFO] Total time: 03:36 min
  151. [INFO] Finished at: 2022-02-01T15:46:20+03:00
  152. [INFO] ------------------------------------------------------------------------
  153. [ERROR] Failed to execute goal org.apache.maven.plugins:maven-surefire-plugin:2.12.4:test (default-test) on project qaframework-bdd-tests: There are test failures.
  154. [ERROR]
  155. [ERROR] Please refer to /Users/juliet/Desktop/openmrs-contrib-qaframework/qaframework-bdd-tests/target/surefire-reports for the individual test results.
  156. [ERROR] -> [Help 1]
  157. [ERROR]
  158. [ERROR] To see the full stack trace of the errors, re-run Maven with the -e switch.
  159. [ERROR] Re-run Maven using the -X switch to enable full debug logging.
  160. [ERROR]
  161. [ERROR] For more information about the errors and possible solutions, please read the following articles:
  162. [ERROR] [Help 1] http://cwiki.apache.org/confluence/display/MAVEN/MojoFailureException
  163. npm ERR! code ELIFECYCLE
  164. npm ERR! errno 1
  165. npm ERR! openmrs-contrib-qaframework@0.1.0 refapp2OpenConceptLab: `mvn test -Dcucumber.filter.tags='@selenium and @openConceptLab'`
  166. npm ERR! Exit status 1
  167. npm ERR!
  168. npm ERR! Failed at the openmrs-contrib-qaframework@0.1.0 refapp2OpenConceptLab script.
  169. npm ERR! This is probably not a problem with npm. There is likely additional logging output above.
  170. npm WARN Local package.json exists, but node_modules missing, did you mean to install?
  171.  
  172. npm ERR! A complete log of this run can be found in:
  173. npm ERR! /Users/juliet/.npm/_logs/2022-02-01T12_46_20_478Z-debug.log
  174. Deniss-Air:qaframework-bdd-tests juliet$ clear
  175.  
  176. Deniss-Air:qaframework-bdd-tests juliet$ npm run refapp2OpenConceptLab
  177.  
  178. > openmrs-contrib-qaframework@0.1.0 refapp2OpenConceptLab /Users/juliet/Desktop/openmrs-contrib-qaframework/qaframework-bdd-tests
  179. > mvn test -Dcucumber.filter.tags='@selenium and @openConceptLab'
  180.  
  181. [INFO] Scanning for projects...
  182. [WARNING]
  183. [WARNING] Some problems were encountered while building the effective model for org.openmrs.contrib:qaframework-bdd-tests:jar:1.0-SNAPSHOT
  184. [WARNING] 'build.plugins.plugin.version' for org.apache.maven.plugins:maven-compiler-plugin is missing. @ line 183, column 21
  185. [WARNING]
  186. [WARNING] It is highly recommended to fix these problems because they threaten the stability of your build.
  187. [WARNING]
  188. [WARNING] For this reason, future Maven versions might no longer support building such malformed projects.
  189. [WARNING]
  190. [INFO]
  191. [INFO] -------------< org.openmrs.contrib:qaframework-bdd-tests >--------------
  192. [INFO] Building qaframework-bdd-tests 1.0-SNAPSHOT
  193. [INFO] --------------------------------[ jar ]---------------------------------
  194. [INFO]
  195. [INFO] --- frontend-maven-plugin:1.11.3:install-node-and-npm (install node and npm) @ qaframework-bdd-tests ---
  196. [INFO] Node v15.8.0 is already installed.
  197. [INFO]
  198. [INFO] --- maven-resources-plugin:2.6:resources (default-resources) @ qaframework-bdd-tests ---
  199. [INFO] Using 'UTF-8' encoding to copy filtered resources.
  200. [INFO] skip non existing resourceDirectory /Users/juliet/Desktop/openmrs-contrib-qaframework/qaframework-bdd-tests/src/main/resources
  201. [INFO]
  202. [INFO] --- maven-compiler-plugin:3.1:compile (default-compile) @ qaframework-bdd-tests ---
  203. [INFO] Nothing to compile - all classes are up to date
  204. [INFO]
  205. [INFO] --- maven-resources-plugin:2.6:testResources (default-testResources) @ qaframework-bdd-tests ---
  206. [INFO] Using 'UTF-8' encoding to copy filtered resources.
  207. [INFO] Copying 53 resources
  208. [INFO]
  209. [INFO] --- maven-compiler-plugin:3.1:testCompile (default-testCompile) @ qaframework-bdd-tests ---
  210. [INFO] Nothing to compile - all classes are up to date
  211. [INFO]
  212. [INFO] --- maven-antrun-plugin:1.8:run (make-mac-chromedriver-executable) @ qaframework-bdd-tests ---
  213. [INFO] Executing tasks
  214.  
  215. main:
  216. [INFO] Executed tasks
  217. [INFO]
  218. [INFO] --- maven-antrun-plugin:1.8:run (make-linux-chromedriver-executable) @ qaframework-bdd-tests ---
  219. [INFO] Executing tasks
  220.  
  221. main:
  222. [INFO] Executed tasks
  223. [INFO]
  224. [INFO] --- maven-antrun-plugin:1.8:run (make-windows-chromedriver-executable) @ qaframework-bdd-tests ---
  225. [INFO] Executing tasks
  226.  
  227. main:
  228. [INFO] Executed tasks
  229. [INFO]
  230. [INFO] --- maven-antrun-plugin:1.8:run (make-mac-firefoxdriver-executable) @ qaframework-bdd-tests ---
  231. [INFO] Executing tasks
  232.  
  233. main:
  234. [INFO] Executed tasks
  235. [INFO]
  236. [INFO] --- maven-antrun-plugin:1.8:run (make-linux-firefoxdriver-executable) @ qaframework-bdd-tests ---
  237. [INFO] Executing tasks
  238.  
  239. main:
  240. [INFO] Executed tasks
  241. [INFO]
  242. [INFO] --- maven-antrun-plugin:1.8:run (make-windows-firefoxdriver-executable) @ qaframework-bdd-tests ---
  243. [INFO] Executing tasks
  244.  
  245. main:
  246. [INFO] Executed tasks
  247. [INFO]
  248. [INFO] --- maven-surefire-plugin:2.12.4:test (default-test) @ qaframework-bdd-tests ---
  249. [INFO] Surefire report directory: /Users/juliet/Desktop/openmrs-contrib-qaframework/qaframework-bdd-tests/target/surefire-reports
  250.  
  251. -------------------------------------------------------
  252. T E S T S
  253. -------------------------------------------------------
  254. Running org.openmrs.contrib.qaframework.RunTest
  255. Running locally...
  256. log4j:WARN No appenders could be found for logger (io.netty.util.internal.logging.InternalLoggerFactory).
  257. log4j:WARN Please initialize the log4j system properly.
  258. 1643719850744 geckodriver INFO Listening on 127.0.0.1:31058
  259. 1643719851985 mozrunner::runner INFO Running command: "/Applications/Firefox.app/Contents/MacOS/firefox-bin" "--marionette" "-foreground" "-no-remote" "-profile" "/var/folders/fg/gzbqmc0d0qz0nwq3k8qkc5f80000gn/T/rust_mozprofilevS5C5Z"
  260. 1643719854061 Marionette INFO Marionette enabled
  261. _RegisterApplication(), FAILED TO establish the default connection to the WindowServer, _CGSDefaultConnection() is NULL.
  262. _RegisterApplication(), FAILED TO establish the default connection to the WindowServer, _CGSDefaultConnection() is NULL.
  263. console.warn: SearchSettings: "get: No settings file exists, new profile?" (new NotFoundError("Could not open the file at /var/folders/fg/gzbqmc0d0qz0nwq3k8qkc5f80000gn/T/rust_mozprofilevS5C5Z/search.json.mozlz4", (void 0)))
  264. console.error: BackgroundUpdate:
  265. _reasonsToNotScheduleUpdates: Failed to check for Maintenance Service Registry Key: [Exception... "Component returned failure code: 0x80004001 (NS_ERROR_NOT_IMPLEMENTED) [nsIUpdateProcessor.getServiceRegKeyExists]" nsresult: "0x80004001 (NS_ERROR_NOT_IMPLEMENTED)" location: "JS frame :: resource://gre/modules/BackgroundUpdate.jsm :: _reasonsToNotScheduleUpdates :: line 243" data: no]
  266. 1643719858628 Marionette INFO Listening on port 53727
  267. 1643719858716 RemoteAgent WARN TLS certificate errors will be ignored for this session
  268. _RegisterApplication(), FAILED TO establish the default connection to the WindowServer, _CGSDefaultConnection() is NULL.
  269. Feb 01, 2022 3:50:58 PM org.openqa.selenium.remote.ProtocolHandshake createSession
  270. INFO: Detected dialect: W3C
  271. console.warn: LoginRecipes: "getRecipes: falling back to a synchronous message for:" "https://qa-refapp.openmrs.org"
  272. console.warn: LoginRecipes: "getRecipes: falling back to a synchronous message for:" "https://qa-refapp.openmrs.org"
  273. console.warn: LoginRecipes: "getRecipes: falling back to a synchronous message for:" "https://qa-refapp.openmrs.org"
  274. console.warn: LoginRecipes: "getRecipes: falling back to a synchronous message for:" "https://qa-refapp.openmrs.org"
  275. console.warn: LoginRecipes: "getRecipes: falling back to a synchronous message for:" "https://qa-refapp.openmrs.org"
  276. console.warn: LoginRecipes: "getRecipes: falling back to a synchronous message for:" "https://qa-refapp.openmrs.org"
  277. 1643720079122 Marionette INFO Stopped listening on port 53727
  278.  
  279. ###!!! [Parent][RunMessage] Error: Channel closing: too late to send/recv, messages will be lost
  280.  
  281. Running locally...
  282. 1643720079870 geckodriver INFO Listening on 127.0.0.1:18885
  283. 1643720079962 mozrunner::runner INFO Running command: "/Applications/Firefox.app/Contents/MacOS/firefox-bin" "--marionette" "-foreground" "-no-remote" "-profile" "/var/folders/fg/gzbqmc0d0qz0nwq3k8qkc5f80000gn/T/rust_mozprofileSwYH4W"
  284. 1643720080801 Marionette INFO Marionette enabled
  285. _RegisterApplication(), FAILED TO establish the default connection to the WindowServer, _CGSDefaultConnection() is NULL.
  286. _RegisterApplication(), FAILED TO establish the default connection to the WindowServer, _CGSDefaultConnection() is NULL.
  287. console.warn: SearchSettings: "get: No settings file exists, new profile?" (new NotFoundError("Could not open the file at /var/folders/fg/gzbqmc0d0qz0nwq3k8qkc5f80000gn/T/rust_mozprofileSwYH4W/search.json.mozlz4", (void 0)))
  288. console.error: BackgroundUpdate:
  289. _reasonsToNotScheduleUpdates: Failed to check for Maintenance Service Registry Key: [Exception... "Component returned failure code: 0x80004001 (NS_ERROR_NOT_IMPLEMENTED) [nsIUpdateProcessor.getServiceRegKeyExists]" nsresult: "0x80004001 (NS_ERROR_NOT_IMPLEMENTED)" location: "JS frame :: resource://gre/modules/BackgroundUpdate.jsm :: _reasonsToNotScheduleUpdates :: line 243" data: no]
  290. 1643720083385 Marionette INFO Listening on port 54022
  291. 1643720083512 RemoteAgent WARN TLS certificate errors will be ignored for this session
  292. Feb 01, 2022 3:54:43 PM org.openqa.selenium.remote.ProtocolHandshake createSession
  293. INFO: Detected dialect: W3C
  294. _RegisterApplication(), FAILED TO establish the default connection to the WindowServer, _CGSDefaultConnection() is NULL.
  295. console.warn: LoginRecipes: "getRecipes: falling back to a synchronous message for:" "https://qa-refapp.openmrs.org"
  296. console.warn: LoginRecipes: "getRecipes: falling back to a synchronous message for:" "https://qa-refapp.openmrs.org"
  297. console.warn: LoginRecipes: "getRecipes: falling back to a synchronous message for:" "https://qa-refapp.openmrs.org"
  298. 1643720107734 Marionette INFO Stopped listening on port 54022
  299.  
  300. ###!!! [Parent][RunMessage] Error: Channel closing: too late to send/recv, messages will be lost
  301.  
  302. Tests run: 1, Failures: 0, Errors: 1, Skipped: 0, Time elapsed: 264.378 sec <<< FAILURE!
  303. OCL MANAGEMENT(OCL Subscription module) Time elapsed: 261.595 sec <<< ERROR!
  304. java.lang.NoClassDefFoundError: org.openqa.selenium.WebDriverException
  305. at org.openqa.selenium.support.ui.WebDriverWait.timeoutException(WebDriverWait.java:138)
  306. at org.openqa.selenium.support.ui.FluentWait.lambda$checkConditionInLoop$2(FluentWait.java:255)
  307. at java.util.concurrent.CompletableFuture$AsyncSupply.run(CompletableFuture.java:1604)
  308. at java.util.concurrent.CompletableFuture$AsyncSupply.exec(CompletableFuture.java:1596)
  309. at java.util.concurrent.ForkJoinTask.doExec(ForkJoinTask.java:289)
  310. at java.util.concurrent.ForkJoinPool$WorkQueue.runTask(ForkJoinPool.java:1056)
  311. at java.util.concurrent.ForkJoinPool.runWorker(ForkJoinPool.java:1692)
  312. at java.util.concurrent.ForkJoinWorkerThread.run(ForkJoinWorkerThread.java:157)
  313.  
  314.  
  315. Results :
  316.  
  317. Tests in error:
  318. OCL MANAGEMENT(OCL Subscription module): org.openqa.selenium.WebDriverException
  319.  
  320. Tests run: 1, Failures: 0, Errors: 1, Skipped: 0
  321.  
  322. [INFO] ------------------------------------------------------------------------
  323. [INFO] BUILD FAILURE
  324. [INFO] ------------------------------------------------------------------------
  325. [INFO] Total time: 04:32 min
  326. [INFO] Finished at: 2022-02-01T15:55:09+03:00
  327. [INFO] ------------------------------------------------------------------------
  328. [ERROR] Failed to execute goal org.apache.maven.plugins:maven-surefire-plugin:2.12.4:test (default-test) on project qaframework-bdd-tests: There are test failures.
  329. [ERROR]
  330. [ERROR] Please refer to /Users/juliet/Desktop/openmrs-contrib-qaframework/qaframework-bdd-tests/target/surefire-reports for the individual test results.
  331. [ERROR] -> [Help 1]
  332. [ERROR]
  333. [ERROR] To see the full stack trace of the errors, re-run Maven with the -e switch.
  334. [ERROR] Re-run Maven using the -X switch to enable full debug logging.
  335. [ERROR]
  336. [ERROR] For more information about the errors and possible solutions, please read the following articles:
  337. [ERROR] [Help 1] http://cwiki.apache.org/confluence/display/MAVEN/MojoFailureException
  338. npm ERR! code ELIFECYCLE
  339. npm ERR! errno 1
  340. npm ERR! openmrs-contrib-qaframework@0.1.0 refapp2OpenConceptLab: `mvn test -Dcucumber.filter.tags='@selenium and @openConceptLab'`
  341. npm ERR! Exit status 1
  342. npm ERR!
  343. npm ERR! Failed at the openmrs-contrib-qaframework@0.1.0 refapp2OpenConceptLab script.
  344. npm ERR! This is probably not a problem with npm. There is likely additional logging output above.
  345. npm WARN Local package.json exists, but node_modules missing, did you mean to install?
  346.  
  347. npm ERR! A complete log of this run can be found in:
  348. npm ERR! /Users/juliet/.npm/_logs/2022-02-01T12_55_09_443Z-debug.log
  349. Deniss-Air:qaframework-bdd-tests juliet$
Advertisement
RAW Paste Data Copied
Advertisement