Guest User

Untitled

a guest
Jun 4th, 2021
52
Never
Not a member of Pastebin yet? Sign Up, it unlocks many cool features!
  1. Executing
  2. Gradle task: build
  3.  
  4. Build
  5. info: MCreator 2021.1.18117, forge-1.16.5, 64-bit, 16384 MB, Mac OS X, JVM
  6. 1.8.0_275, JAVA_HOME:
  7. /Applications/MCreator.app/Contents/MacOS/jdk/Contents/Home/jre
  8.  
  9. >
  10. Task :compileJava FAILED
  11.  
  12. /Users/drewkaplan/MCreatorWorkspaces/New
  13. Mountains
  14. 1.2/src/main/java/net/mcreator/mountainupdta/entity/renderer/GoatRenderer.java:41:
  15. error: type argument T is not within bounds of type-variable E
  16.  
  17. public static class ModelGoatModel<T extends GoatEntity> extends
  18. AgeableModel<T> {
  19.  
  20.  
  21.  
  22. ^
  23.  
  24.  
  25. where T,E are type-variables:
  26.  
  27.  
  28. T extends GoatEntity declared in class ModelGoatModel
  29.  
  30.  
  31. E extends Entity declared in class AgeableModel
  32.  
  33. /Users/drewkaplan/MCreatorWorkspaces/New
  34. Mountains
  35. 1.2/src/main/java/net/mcreator/mountainupdta/entity/renderer/GoatRenderer.java:41:
  36. error: ModelGoatModel is not abstract and does not override abstract
  37. method getBodyParts() in AgeableModel
  38.  
  39. public static class ModelGoatModel<T extends GoatEntity> extends
  40. AgeableModel<T> {
  41.  
  42.  
  43. ^
  44.  
  45. /Users/drewkaplan/MCreatorWorkspaces/New
  46. Mountains
  47. 1.2/src/main/java/net/mcreator/mountainupdta/entity/renderer/GoatRenderer.java:53:
  48. error: cannot find symbol
  49.  
  50. this.field_78090_t = 64;
  51.  
  52.  
  53. ^
  54.  
  55.  
  56. symbol: variable field_78090_t
  57.  
  58. /Users/drewkaplan/MCreatorWorkspaces/New
  59. Mountains
  60. 1.2/src/main/java/net/mcreator/mountainupdta/entity/renderer/GoatRenderer.java:54:
  61. error: cannot find symbol
  62.  
  63. this.field_78089_u = 64;
  64.  
  65.  
  66. ^
  67.  
  68.  
  69. symbol: variable field_78089_u
  70.  
  71. /Users/drewkaplan/MCreatorWorkspaces/New
  72. Mountains
  73. 1.2/src/main/java/net/mcreator/mountainupdta/entity/renderer/GoatRenderer.java:55:
  74. error: cannot find symbol
  75.  
  76. (this.headModel = new ModelRenderer((Model)
  77. this)).func_78793_a(1.0f, 14.0f, 0.0f);
  78.  
  79.  
  80. ^
  81.  
  82.  
  83. symbol: method func_78793_a(float,float,float)
  84.  
  85.  
  86. location: class ModelRenderer
  87.  
  88. /Users/drewkaplan/MCreatorWorkspaces/New
  89. Mountains
  90. 1.2/src/main/java/net/mcreator/mountainupdta/entity/renderer/GoatRenderer.java:56:
  91. error: cannot find symbol
  92.  
  93. this.headModel.func_78784_a(2, 61).func_228300_a_(2.0f, -11.0f,
  94. -10.0f, 3.0f, 2.0f, 1.0f);
  95.  
  96.  
  97. ^
  98.  
  99.  
  100. symbol: method func_78784_a(int,int)
  101.  
  102.  
  103. location: variable headModel of type ModelRenderer
  104.  
  105. /Users/drewkaplan/MCreatorWorkspaces/New
  106. Mountains
  107. 1.2/src/main/java/net/mcreator/mountainupdta/entity/renderer/GoatRenderer.java:57:
  108. error: cannot find symbol
  109.  
  110. this.headModel.func_78784_a(2, 61).func_228300_a_(-6.0f, -11.0f,
  111. -10.0f, 3.0f, 2.0f, 1.0f);
  112.  
  113.  
  114. ^
  115.  
  116.  
  117. symbol: method func_78784_a(int,int)
  118.  
  119.  
  120. location: variable headModel of type ModelRenderer
  121.  
  122. /Users/drewkaplan/MCreatorWorkspaces/New
  123. Mountains
  124. 1.2/src/main/java/net/mcreator/mountainupdta/entity/renderer/GoatRenderer.java:58:
  125. error: cannot find symbol
  126.  
  127. this.headModel.func_78784_a(23, 52).func_228300_a_(-0.5f, -3.0f,
  128. -14.0f, 0.0f, 7.0f, 5.0f);
  129.  
  130.  
  131. ^
  132.  
  133.  
  134. symbol: method func_78784_a(int,int)
  135.  
  136.  
  137. location: variable headModel of type ModelRenderer
  138.  
  139. /Users/drewkaplan/MCreatorWorkspaces/New
  140. Mountains
  141. 1.2/src/main/java/net/mcreator/mountainupdta/entity/renderer/GoatRenderer.java:59:
  142. error: cannot find symbol
  143.  
  144. (this.leftHorn = new ModelRenderer((Model)
  145. this)).func_78793_a(0.0f, 0.0f, 0.0f);
  146.  
  147.  
  148. ^
  149.  
  150.  
  151. symbol: method func_78793_a(float,float,float)
  152.  
  153.  
  154. location: class ModelRenderer
  155.  
  156. /Users/drewkaplan/MCreatorWorkspaces/New
  157. Mountains
  158. 1.2/src/main/java/net/mcreator/mountainupdta/entity/renderer/GoatRenderer.java:60:
  159. error: cannot find symbol
  160.  
  161. this.leftHorn.func_78784_a(12, 55).func_228300_a_(-0.01f, -16.0f,
  162. -10.0f, 2.0f, 7.0f, 2.0f);
  163.  
  164.  
  165. ^
  166.  
  167.  
  168. symbol: method func_78784_a(int,int)
  169.  
  170.  
  171. location: variable leftHorn of type ModelRenderer
  172.  
  173. /Users/drewkaplan/MCreatorWorkspaces/New
  174. Mountains
  175. 1.2/src/main/java/net/mcreator/mountainupdta/entity/renderer/GoatRenderer.java:61:
  176. error: cannot find symbol
  177.  
  178. this.headModel.func_78792_a(this.leftHorn);
  179.  
  180.  
  181. ^
  182.  
  183.  
  184. symbol: method func_78792_a(ModelRenderer)
  185.  
  186.  
  187. location: variable headModel of type ModelRenderer
  188.  
  189. /Users/drewkaplan/MCreatorWorkspaces/New
  190. Mountains
  191. 1.2/src/main/java/net/mcreator/mountainupdta/entity/renderer/GoatRenderer.java:62:
  192. error: cannot find symbol
  193.  
  194. (this.rightHorn = new ModelRenderer((Model)
  195. this)).func_78793_a(0.0f, 0.0f, 0.0f);
  196.  
  197.  
  198. ^
  199.  
  200.  
  201. symbol: method func_78793_a(float,float,float)
  202.  
  203.  
  204. location: class ModelRenderer
  205.  
  206. /Users/drewkaplan/MCreatorWorkspaces/New
  207. Mountains
  208. 1.2/src/main/java/net/mcreator/mountainupdta/entity/renderer/GoatRenderer.java:63:
  209. error: cannot find symbol
  210.  
  211. this.rightHorn.func_78784_a(12, 55).func_228300_a_(-2.99f, -16.0f,
  212. -10.0f, 2.0f, 7.0f, 2.0f);
  213.  
  214.  
  215. ^
  216.  
  217.  
  218. symbol: method func_78784_a(int,int)
  219.  
  220.  
  221. location: variable rightHorn of type ModelRenderer
  222.  
  223. /Users/drewkaplan/MCreatorWorkspaces/New
  224. Mountains
  225. 1.2/src/main/java/net/mcreator/mountainupdta/entity/renderer/GoatRenderer.java:64:
  226. error: cannot find symbol
  227.  
  228. this.headModel.func_78792_a(this.rightHorn);
  229.  
  230.  
  231. ^
  232.  
  233.  
  234. symbol: method func_78792_a(ModelRenderer)
  235.  
  236.  
  237. location: variable headModel of type ModelRenderer
  238.  
  239. /Users/drewkaplan/MCreatorWorkspaces/New
  240. Mountains
  241. 1.2/src/main/java/net/mcreator/mountainupdta/entity/renderer/GoatRenderer.java:65:
  242. error: cannot find symbol
  243.  
  244. (this.nose = new ModelRenderer((Model) this)).func_78793_a(0.0f,
  245. -8.0f, -8.0f);
  246.  
  247.  
  248. ^
  249.  
  250.  
  251. symbol: method func_78793_a(float,float,float)
  252.  
  253.  
  254. location: class ModelRenderer
  255.  
  256. /Users/drewkaplan/MCreatorWorkspaces/New
  257. Mountains
  258. 1.2/src/main/java/net/mcreator/mountainupdta/entity/renderer/GoatRenderer.java:67:
  259. error: cannot find symbol
  260.  
  261. this.nose.func_78784_a(34, 46).func_228300_a_(-3.0f, -4.0f, -8.0f,
  262. 5.0f, 7.0f, 10.0f);
  263.  
  264.  
  265. ^
  266.  
  267.  
  268. symbol: method func_78784_a(int,int)
  269.  
  270.  
  271. location: variable nose of type ModelRenderer
  272.  
  273. /Users/drewkaplan/MCreatorWorkspaces/New
  274. Mountains
  275. 1.2/src/main/java/net/mcreator/mountainupdta/entity/renderer/GoatRenderer.java:68:
  276. error: cannot find symbol
  277.  
  278. this.headModel.func_78792_a(this.nose);
  279.  
  280.  
  281. ^
  282.  
  283.  
  284. symbol: method func_78792_a(ModelRenderer)
  285.  
  286.  
  287. location: variable headModel of type ModelRenderer
  288.  
  289. /Users/drewkaplan/MCreatorWorkspaces/New
  290. Mountains
  291. 1.2/src/main/java/net/mcreator/mountainupdta/entity/renderer/GoatRenderer.java:69:
  292. error: cannot find symbol
  293.  
  294. (this.body = new ModelRenderer((Model) this)).func_78793_a(0.0f,
  295. 12.0f, 0.0f);
  296.  
  297.  
  298. ^
  299.  
  300.  
  301. symbol: method func_78793_a(float,float,float)
  302.  
  303.  
  304. location: class ModelRenderer
  305.  
  306. /Users/drewkaplan/MCreatorWorkspaces/New
  307. Mountains
  308. 1.2/src/main/java/net/mcreator/mountainupdta/entity/renderer/GoatRenderer.java:70:
  309. error: cannot find symbol
  310.  
  311. this.body.func_78784_a(1, 1).func_228300_a_(-4.0f, -5.0f, -7.0f,
  312. 9.0f, 11.0f, 16.0f);
  313.  
  314.  
  315. ^
  316.  
  317.  
  318. symbol: method func_78784_a(int,int)
  319.  
  320.  
  321. location: variable body of type ModelRenderer
  322.  
  323. /Users/drewkaplan/MCreatorWorkspaces/New
  324. Mountains
  325. 1.2/src/main/java/net/mcreator/mountainupdta/entity/renderer/GoatRenderer.java:71:
  326. error: cannot find symbol
  327.  
  328. this.body.func_78784_a(0, 28).func_228300_a_(-5.0f, -6.0f, -8.0f,
  329. 11.0f, 14.0f, 11.0f);
  330.  
  331.  
  332. ^
  333.  
  334.  
  335. symbol: method func_78784_a(int,int)
  336.  
  337.  
  338. location: variable body of type ModelRenderer
  339.  
  340. /Users/drewkaplan/MCreatorWorkspaces/New
  341. Mountains
  342. 1.2/src/main/java/net/mcreator/mountainupdta/entity/renderer/GoatRenderer.java:72:
  343. error: cannot find symbol
  344.  
  345. (this.legBackLeft = new ModelRenderer((Model)
  346. this)).func_78793_a(1.0f, 14.0f, 4.0f);
  347.  
  348.  
  349. ^
  350.  
  351.  
  352. symbol: method func_78793_a(float,float,float)
  353.  
  354.  
  355. location: class ModelRenderer
  356.  
  357. /Users/drewkaplan/MCreatorWorkspaces/New
  358. Mountains
  359. 1.2/src/main/java/net/mcreator/mountainupdta/entity/renderer/GoatRenderer.java:73:
  360. error: cannot find symbol
  361.  
  362. this.legBackLeft.func_78784_a(36, 29).func_228300_a_(0.0f, 4.0f,
  363. 0.0f, 3.0f, 6.0f, 3.0f);
  364.  
  365.  
  366. ^
  367.  
  368.  
  369. symbol: method func_78784_a(int,int)
  370.  
  371.  
  372. location: variable legBackLeft of type ModelRenderer
  373.  
  374. /Users/drewkaplan/MCreatorWorkspaces/New
  375. Mountains
  376. 1.2/src/main/java/net/mcreator/mountainupdta/entity/renderer/GoatRenderer.java:74:
  377. error: cannot find symbol
  378.  
  379. (this.legBackRight = new ModelRenderer((Model)
  380. this)).func_78793_a(-3.0f, 14.0f, 4.0f);
  381.  
  382.  
  383. ^
  384.  
  385.  
  386. symbol: method func_78793_a(float,float,float)
  387.  
  388.  
  389. location: class ModelRenderer
  390.  
  391. /Users/drewkaplan/MCreatorWorkspaces/New
  392. Mountains
  393. 1.2/src/main/java/net/mcreator/mountainupdta/entity/renderer/GoatRenderer.java:75:
  394. error: cannot find symbol
  395.  
  396. this.legBackRight.func_78784_a(49, 29).func_228300_a_(0.0f, 4.0f,
  397. 0.0f, 3.0f, 6.0f, 3.0f);
  398.  
  399.  
  400. ^
  401.  
  402.  
  403. symbol: method func_78784_a(int,int)
  404.  
  405.  
  406. location: variable legBackRight of type ModelRenderer
  407.  
  408. /Users/drewkaplan/MCreatorWorkspaces/New
  409. Mountains
  410. 1.2/src/main/java/net/mcreator/mountainupdta/entity/renderer/GoatRenderer.java:76:
  411. error: cannot find symbol
  412.  
  413. (this.legFrontLeft = new ModelRenderer((Model)
  414. this)).func_78793_a(-3.0f, 14.0f, -6.0f);
  415.  
  416.  
  417. ^
  418.  
  419.  
  420. symbol: method func_78793_a(float,float,float)
  421.  
  422.  
  423. location: class ModelRenderer
  424.  
  425. /Users/drewkaplan/MCreatorWorkspaces/New
  426. Mountains
  427. 1.2/src/main/java/net/mcreator/mountainupdta/entity/renderer/GoatRenderer.java:77:
  428. error: cannot find symbol
  429.  
  430. this.legFrontLeft.func_78784_a(49, 2).func_228300_a_(0.0f, 0.0f,
  431. 0.0f, 3.0f, 10.0f, 3.0f);
  432.  
  433.  
  434. ^
  435.  
  436.  
  437. symbol: method func_78784_a(int,int)
  438.  
  439.  
  440. location: variable legFrontLeft of type ModelRenderer
  441.  
  442. /Users/drewkaplan/MCreatorWorkspaces/New
  443. Mountains
  444. 1.2/src/main/java/net/mcreator/mountainupdta/entity/renderer/GoatRenderer.java:78:
  445. error: cannot find symbol
  446.  
  447. (this.legFrontRight = new ModelRenderer((Model)
  448. this)).func_78793_a(1.0f, 14.0f, -6.0f);
  449.  
  450.  
  451. ^
  452.  
  453.  
  454. symbol: method func_78793_a(float,float,float)
  455.  
  456.  
  457. location: class ModelRenderer
  458.  
  459. /Users/drewkaplan/MCreatorWorkspaces/New
  460. Mountains
  461. 1.2/src/main/java/net/mcreator/mountainupdta/entity/renderer/GoatRenderer.java:79:
  462. error: cannot find symbol
  463.  
  464. this.legFrontRight.func_78784_a(35, 2).func_228300_a_(0.0f, 0.0f,
  465. 0.0f, 3.0f, 10.0f, 3.0f);
  466.  
  467.  
  468. ^
  469.  
  470.  
  471. symbol: method func_78784_a(int,int)
  472.  
  473.  
  474. location: variable legFrontRight of type ModelRenderer
  475.  
  476. /Users/drewkaplan/MCreatorWorkspaces/New
  477. Mountains
  478. 1.2/src/main/java/net/mcreator/mountainupdta/entity/renderer/GoatRenderer.java:83:
  479. error: incompatible types: ImmutableList
  480. cannot be converted to Iterable
  481.  
  482.  
  483. return (Iterable<ModelRenderer>) ImmutableList.of((Object)
  484. this.headModel);
  485.  
  486.  
  487. ^
  488.  
  489. /Users/drewkaplan/MCreatorWorkspaces/New
  490. Mountains
  491. 1.2/src/main/java/net/mcreator/mountainupdta/entity/renderer/GoatRenderer.java:87:
  492. error: incompatible types: ImmutableList
  493. cannot be converted to Iterable
  494.  
  495.  
  496. return (Iterable<ModelRenderer>) ImmutableList.of((Object)
  497. this.body, (Object) this.legBackRight, (Object) this.legBackLeft,
  498.  
  499.  
  500. ^
  501.  
  502. /Users/drewkaplan/MCreatorWorkspaces/New
  503. Mountains
  504. 1.2/src/main/java/net/mcreator/mountainupdta/entity/renderer/GoatRenderer.java:92:
  505. error: cannot find symbol
  506.  
  507. modelRenderer.field_78795_f = x;
  508.  
  509.  
  510. ^
  511.  
  512.  
  513. symbol: variable field_78795_f
  514.  
  515.  
  516. location: variable modelRenderer of type ModelRenderer
  517.  
  518. /Users/drewkaplan/MCreatorWorkspaces/New
  519. Mountains
  520. 1.2/src/main/java/net/mcreator/mountainupdta/entity/renderer/GoatRenderer.java:93:
  521. error: cannot find symbol
  522.  
  523. modelRenderer.field_78796_g = y;
  524.  
  525.  
  526. ^
  527.  
  528.  
  529. symbol: variable field_78796_g
  530.  
  531.  
  532. location: variable modelRenderer of type ModelRenderer
  533.  
  534. /Users/drewkaplan/MCreatorWorkspaces/New
  535. Mountains
  536. 1.2/src/main/java/net/mcreator/mountainupdta/entity/renderer/GoatRenderer.java:94:
  537. error: cannot find symbol
  538.  
  539. modelRenderer.field_78808_h = z;
  540.  
  541.  
  542. ^
  543.  
  544.  
  545. symbol: variable field_78808_h
  546.  
  547.  
  548. location: variable modelRenderer of type ModelRenderer
  549.  
  550. /Users/drewkaplan/MCreatorWorkspaces/New
  551. Mountains
  552. 1.2/src/main/java/net/mcreator/mountainupdta/entity/renderer/GoatRenderer.java:97:
  553. error: name clash: setRotationAngles(Entity,float,float,float,float,float)
  554. in ModelGoatModel and setRotationAngles(T,float,float,float,float,float)
  555. in EntityModel have the same erasure, yet neither overrides the other
  556.  
  557. public void setRotationAngles(Entity e, float f, float f1, float f2,
  558. float f3, float f4) {
  559.  
  560.  
  561. ^
  562.  
  563.  
  564. where T is a type-variable:
  565.  
  566.  
  567. T extends Entity declared in class EntityModel
  568.  
  569. 34
  570. errors
  571.  
  572. FAILURE:
  573. Build failed with an exception.
  574.  
  575. *
  576. What went wrong:
  577.  
  578. Execution
  579. failed for task ':compileJava'.
  580.  
  581. >
  582. Compilation failed; see the compiler error output for details.
  583.  
  584. *
  585. Try:
  586.  
  587. Run
  588. with --stacktrace option to get the stack trace. Run with --info or
  589. --debug option to get more log output. Run with --scan to get full
  590. insights.
  591.  
  592. *
  593. Get more help at https://help.gradle.org
  594.  
  595. BUILD
  596. FAILED in 1s
  597.  
  598. 1
  599. actionable task: 1 executed
  600.  
  601. BUILD
  602. FAILED
  603.  
  604. Task
  605. completed in 2 seconds
RAW Paste Data