zappp4

checkstyle error

Aug 23rd, 2025
52
0
Never
Not a member of Pastebin yet? Sign Up, it unlocks many cool features!
Bash 3.33 KB | None | 0 0
  1. -> make
  2. java --version
  3. openjdk 17.0.16 2025-07-15
  4. OpenJDK Runtime Environment (build 17.0.16+8-suse-1699-x8664)
  5. OpenJDK 64-Bit Server VM (build 17.0.16+8-suse-1699-x8664, mixed mode, sharing)
  6. gradle --version
  7.  
  8. ------------------------------------------------------------
  9. Gradle 8.8
  10. ------------------------------------------------------------
  11.  
  12. Build time:   2024-05-31 21:46:56 UTC
  13. Revision:     4bd1b3d3fc3f31db5a26eecb416a165b8cc36082
  14.  
  15. Kotlin:       1.9.22
  16. Groovy:       3.0.21
  17. Ant:          Apache Ant(TM) version 1.10.13 compiled on January 4 2023
  18. JVM:          17.0.16 (Oracle Corporation 17.0.16+8-suse-1699-x8664)
  19. OS:           Linux 6.15.8-1-default amd64
  20.  
  21. gradle --console=plain build
  22. Starting a Gradle Daemon (subsequent builds will be faster)
  23. > Task :pulumi:extractIncludeProto
  24. > Task :pulumi:extractProto
  25. > Task :pulumi:generateProto
  26.  
  27. > Task :pulumi:compileJava
  28. Note: Some input files use unchecked or unsafe operations.
  29. Note: Recompile with -Xlint:unchecked for details.
  30.  
  31. > Task :pulumi:processResources
  32. > Task :pulumi:classes
  33. > Task :pulumi:jar
  34. > Task :pulumi:javadoc
  35. > Task :pulumi:javadocJar
  36. > Task :pulumi:assemble
  37. > Task :pulumi:extractIncludePubProto
  38. > Task :pulumi:extractPubProto
  39. > Task :pulumi:generatePubProto NO-SOURCE
  40.  
  41. > Task :pulumi:compilePubJava
  42.  
  43. <-- Example errors -->
  44.  
  45. /home/zappp/Desktop/open-source/pulumi-java/sdk/java/pulumi/src/main/java/com/pulumi/internal/PulumiInternal.java:24: error: package javax.annotation does not exist
  46. import javax.annotation.ParametersAreNonnullByDefault;
  47.                        ^
  48. /home/zappp/Desktop/open-source/pulumi-java/sdk/java/pulumi/src/main/java/com/pulumi/deployment/internal/DeploymentImpl.java:9: error: package com.google.gson does not exist
  49. import com.google.gson.Gson;
  50.                       ^
  51. /home/zappp/Desktop/open-source/pulumi-java/sdk/java/pulumi/src/main/java/com/pulumi/deployment/internal/DeploymentImpl.java:10: error: package com.google.gson does not exist
  52. import com.google.gson.JsonElement;
  53.  
  54. /home/zappp/Desktop/open-source/pulumi-java/sdk/java/pulumi/src/main/java/com/pulumi/serialization/internal/Structs.java:4: error: package com.google.protobuf does not exist
  55. import com.google.protobuf.Value;
  56.  
  57.   symbol: class ParametersAreNonnullByDefault
  58. Note: Some input files use unchecked or unsafe operations.
  59. Note: Recompile with -Xlint:unchecked for details.
  60. 100 errors
  61.  
  62. > Task :pulumi:compilePubJava FAILED
  63.  
  64. > Task :pulumi:checkstyleMain
  65.  
  66. < -- Bunch of checkstyle warnings -->
  67.  
  68. [ant:checkstyle] [WARN] /home/zappp/Desktop/open-source/pulumi-java/sdk/java/pulumi/src/main/java/com/pulumi/Context.java:14: Javadoc has empty description section. [JavadocStyle]
  69. [ant:checkstyle] [WARN] /home/zappp/Desktop/open-source/pulumi-
  70. Checkstyle rule violations were found. See the report at: file:///home/zappp/Desktop/open-source/pulumi-java/sdk/java/pulumi/build/reports/checkstyle/main.html
  71. Checkstyle files with violations: 85
  72. Checkstyle violations by severity: [warning:1488]
  73.  
  74. FAILURE: Build failed with an exception.
  75.  
  76. * What went wrong:
  77. Execution failed for task ':pulumi:compilePubJava'.
  78. > Compilation failed; see the compiler error output for details.
  79.  
  80. * Try:
  81. > Run with --info option to get more log output.
  82. > Run with --scan to get full insights.
  83.  
  84. BUILD FAILED in 2m 43s
  85. 12 actionable tasks: 12 executed
  86. make: *** [Makefile:5: build] Error 1
Advertisement
Add Comment
Please, Sign In to add comment