Guest User

Untitled

a guest
Jun 9th, 2018
197
0
Never
Not a member of Pastebin yet? Sign Up, it unlocks many cool features!
text 85.22 KB | None | 0 0
  1. This file contains any messages produced by compilers while
  2. running configure, to aid debugging if configure makes a mistake.
  3.  
  4. It was created by curl configure -, which was
  5. generated by GNU Autoconf 2.69. Invocation command line was
  6.  
  7. $ /root/linux-i386/bin/linux-i386/gen/contrib/development/libs/curl/curl/configure --prefix=/Developer --target=i386-aros --build=x86_64-linux --host=i386-aros --without-pic --disable-shared --disable-nls --without-x --disable-shared --without-random --disable-threaded-resolver --disable-ntlm-wb --libdir=/root/linux-i386/bin/linux-i386/AROS/Developer/lib
  8.  
  9. ## --------- ##
  10. ## Platform. ##
  11. ## --------- ##
  12.  
  13. hostname = ubuntu-s-1vcpu-1gb-lon1-01
  14. uname -m = x86_64
  15. uname -r = 4.4.0-127-generic
  16. uname -s = Linux
  17. uname -v = #153-Ubuntu SMP Sat May 19 10:58:46 UTC 2018
  18.  
  19. /usr/bin/uname -p = unknown
  20. /bin/uname -X = unknown
  21.  
  22. /bin/arch = unknown
  23. /usr/bin/arch -k = unknown
  24. /usr/convex/getsysinfo = unknown
  25. /usr/bin/hostinfo = unknown
  26. /bin/machine = unknown
  27. /usr/bin/oslevel = unknown
  28. /bin/universe = unknown
  29.  
  30. PATH: /root/linux-i386/bin/linux-x86_64/tools/crosstools
  31. PATH: /root/linux-i386/bin/linux-x86_64/tools
  32. PATH: /root/linux-i386/bin/linux-x86_64/tools/i386-linux
  33. PATH: /usr/local/sbin
  34. PATH: /usr/local/bin
  35. PATH: /usr/sbin
  36. PATH: /usr/bin
  37. PATH: /sbin
  38. PATH: /bin
  39. PATH: /usr/games
  40. PATH: /usr/local/games
  41. PATH: /snap/bin
  42.  
  43.  
  44. ## ----------- ##
  45. ## Core tests. ##
  46. ## ----------- ##
  47.  
  48. configure:3119: checking whether to enable maintainer-specific portions of Makefiles
  49. configure:3128: result: no
  50. configure:3152: checking whether make supports nested variables
  51. configure:3169: result: yes
  52. configure:3182: checking whether to enable debug build options
  53. configure:3204: result: no
  54. configure:3208: checking whether to enable compiler optimizer
  55. configure:3229: result: (assumed) yes
  56. configure:3241: checking whether to enable strict compiler warnings
  57. configure:3260: result: no
  58. configure:3264: checking whether to enable compiler warnings as errors
  59. configure:3283: result: no
  60. configure:3287: checking whether to enable curl debug memory tracking
  61. configure:3309: result: no
  62. configure:3326: checking whether to enable hiding of library internal symbols
  63. configure:3347: result: yes
  64. configure:3358: checking whether to enable c-ares for DNS lookups
  65. configure:3380: result: no
  66. configure:3384: checking whether to disable dependency on -lrt
  67. configure:3400: result: (assumed no)
  68. configure:3429: checking for path separator
  69. configure:3431: result: :
  70. configure:3457: checking for sed
  71. configure:3476: found /bin/sed
  72. configure:3489: result: /bin/sed
  73. configure:3506: checking for grep
  74. configure:3525: found /bin/grep
  75. configure:3538: result: /bin/grep
  76. configure:3554: checking for egrep
  77. configure:3557: result: /bin/grep -E
  78. configure:3852: using CFLAGS: -m32 -march=i486 -DAROS_BUILD_TYPE=AROS_BUILD_TYPE_PERSONAL -g -DADEBUG=1 -DMDEBUG=1 -O0 -nix
  79. configure:3858: CFLAGS note: CFLAGS should only be used to specify C compiler flags, not macro definitions. Use CPPFLAGS for: -DAROS_BUILD_TYPE=AROS_BUILD_TYPE_PERSONAL
  80. configure:3858: CFLAGS note: CFLAGS should only be used to specify C compiler flags, not macro definitions. Use CPPFLAGS for: -DADEBUG=1
  81. configure:3858: CFLAGS note: CFLAGS should only be used to specify C compiler flags, not macro definitions. Use CPPFLAGS for: -DMDEBUG=1
  82. configure:3889: WARNING: Continuing even with errors mentioned immediately above this line.
  83. configure:3936: checking for a BSD-compatible install
  84. configure:4004: result: /usr/bin/install -c
  85. configure:4026: checking for i386-aros-gcc
  86. configure:4053: result: /root/linux-i386/bin/linux-x86_64/tools/crosstools/i386-aros-gcc
  87. configure:4322: checking for C compiler version
  88. configure:4331: /root/linux-i386/bin/linux-x86_64/tools/crosstools/i386-aros-gcc --version >&5
  89. i386-aros-gcc (GCC) 4.6.4
  90. Copyright (C) 2011 Free Software Foundation, Inc.
  91. This is free software; see the source for copying conditions. There is NO
  92. warranty; not even for MERCHANTABILITY or FITNESS FOR A PARTICULAR PURPOSE.
  93.  
  94. configure:4342: $? = 0
  95. configure:4331: /root/linux-i386/bin/linux-x86_64/tools/crosstools/i386-aros-gcc -v >&5
  96. Using built-in specs.
  97. COLLECT_GCC=/root/linux-i386/bin/linux-x86_64/tools/crosstools/i386-aros-gcc
  98. COLLECT_LTO_WRAPPER=/root/linux-i386/bin/linux-x86_64/tools/crosstools/libexec/gcc/i386-aros/4.6.4/lto-wrapper
  99. Target: i386-aros
  100. Configured with: /root/linux-i386/bin/linux-x86_64/Ports/host/gcc/gcc-4.6.4/configure --prefix=/root/linux-i386/bin/linux-x86_64/tools/crosstools --target=i386-aros --with-dwarf2 --with-sysroot=/root/linux-i386/bin/linux-i386/AROS/Developer --with-native-system-header-dir=/include --bindir=/root/linux-i386/bin/linux-x86_64/tools/crosstools --libdir=/root/linux-i386/bin/linux-x86_64/tools/crosstools/lib --enable-languages=c,c++ --enable-long-long --enable-version-specific-runtime-libs --enable-frame-pointer --with-isl=/root/linux-i386/bin/linux-x86_64/tools/crosstools --disable-isl-version-check --disable-bootstrap --disable-sjlj-exceptions --disable-tls --disable-plugins --disable-nls --disable-libssp --disable-libstdcxx-pch --disable-build-with-cxx --disable-build-poststage1-with-cxx
  101. Thread model: single
  102. gcc version 4.6.4 (GCC)
  103. configure:4342: $? = 0
  104. configure:4331: /root/linux-i386/bin/linux-x86_64/tools/crosstools/i386-aros-gcc -V >&5
  105. i386-aros-gcc: error: unrecognized option '-V'
  106. i386-aros-gcc: fatal error: no input files
  107. compilation terminated.
  108. configure:4342: $? = 1
  109. configure:4331: /root/linux-i386/bin/linux-x86_64/tools/crosstools/i386-aros-gcc -qversion >&5
  110. i386-aros-gcc: error: unrecognized option '-qversion'
  111. i386-aros-gcc: fatal error: no input files
  112. compilation terminated.
  113. configure:4342: $? = 1
  114. configure:4361: checking whether the C compiler works
  115. configure:4383: /root/linux-i386/bin/linux-x86_64/tools/crosstools/i386-aros-gcc -m32 -march=i486 -DAROS_BUILD_TYPE=AROS_BUILD_TYPE_PERSONAL -g -DADEBUG=1 -DMDEBUG=1 -O0 -nix -D__BSD_VISIBLE=1 -L/root/linux-i386/bin/linux-i386/AROS/Developer/lib -nix conftest.c >&5
  116. configure:4387: $? = 0
  117. configure:4435: result: yes
  118. configure:4438: checking for C compiler default output file name
  119. configure:4440: result: a.out
  120. configure:4446: checking for suffix of executables
  121. configure:4453: /root/linux-i386/bin/linux-x86_64/tools/crosstools/i386-aros-gcc -o conftest -m32 -march=i486 -DAROS_BUILD_TYPE=AROS_BUILD_TYPE_PERSONAL -g -DADEBUG=1 -DMDEBUG=1 -O0 -nix -D__BSD_VISIBLE=1 -L/root/linux-i386/bin/linux-i386/AROS/Developer/lib -nix conftest.c >&5
  122. configure:4457: $? = 0
  123. configure:4479: result:
  124. configure:4500: checking whether we are cross compiling
  125. configure:4538: result: yes
  126. configure:4543: checking for suffix of object files
  127. configure:4564: /root/linux-i386/bin/linux-x86_64/tools/crosstools/i386-aros-gcc -c -m32 -march=i486 -DAROS_BUILD_TYPE=AROS_BUILD_TYPE_PERSONAL -g -DADEBUG=1 -DMDEBUG=1 -O0 -nix -D__BSD_VISIBLE=1 conftest.c >&5
  128. configure:4568: $? = 0
  129. configure:4589: result: o
  130. configure:4593: checking whether we are using the GNU C compiler
  131. configure:4611: /root/linux-i386/bin/linux-x86_64/tools/crosstools/i386-aros-gcc -c -m32 -march=i486 -DAROS_BUILD_TYPE=AROS_BUILD_TYPE_PERSONAL -g -DADEBUG=1 -DMDEBUG=1 -O0 -nix -D__BSD_VISIBLE=1 conftest.c >&5
  132. configure:4611: $? = 0
  133. configure:4620: result: yes
  134. configure:4629: checking whether /root/linux-i386/bin/linux-x86_64/tools/crosstools/i386-aros-gcc accepts -g
  135. configure:4648: /root/linux-i386/bin/linux-x86_64/tools/crosstools/i386-aros-gcc -c -g -D__BSD_VISIBLE=1 conftest.c >&5
  136. configure:4648: $? = 0
  137. configure:4687: result: yes
  138. configure:4704: checking for /root/linux-i386/bin/linux-x86_64/tools/crosstools/i386-aros-gcc option to accept ISO C89
  139. configure:4766: /root/linux-i386/bin/linux-x86_64/tools/crosstools/i386-aros-gcc -c -m32 -march=i486 -DAROS_BUILD_TYPE=AROS_BUILD_TYPE_PERSONAL -g -DADEBUG=1 -DMDEBUG=1 -O0 -nix -D__BSD_VISIBLE=1 conftest.c >&5
  140. configure:4766: $? = 0
  141. configure:4779: result: none needed
  142. configure:4804: checking whether /root/linux-i386/bin/linux-x86_64/tools/crosstools/i386-aros-gcc understands -c and -o together
  143. configure:4825: /root/linux-i386/bin/linux-x86_64/tools/crosstools/i386-aros-gcc -c conftest.c -o conftest2.o
  144. configure:4828: $? = 0
  145. configure:4825: /root/linux-i386/bin/linux-x86_64/tools/crosstools/i386-aros-gcc -c conftest.c -o conftest2.o
  146. configure:4828: $? = 0
  147. configure:4840: result: yes
  148. configure:4863: checking how to run the C preprocessor
  149. configure:4933: result: /root/linux-i386/bin/linux-x86_64/tools/crosstools/i386-aros-gcc -E
  150. configure:4953: /root/linux-i386/bin/linux-x86_64/tools/crosstools/i386-aros-gcc -E -D__BSD_VISIBLE=1 conftest.c
  151. configure:4953: $? = 0
  152. configure:4967: /root/linux-i386/bin/linux-x86_64/tools/crosstools/i386-aros-gcc -E -D__BSD_VISIBLE=1 conftest.c
  153. conftest.c:9:28: fatal error: ac_nonexistent.h: No such file or directory
  154. compilation terminated.
  155. configure:4967: $? = 1
  156. configure: failed program was:
  157. | /* confdefs.h */
  158. | #define PACKAGE_NAME "curl"
  159. | #define PACKAGE_TARNAME "curl"
  160. | #define PACKAGE_VERSION "-"
  161. | #define PACKAGE_STRING "curl -"
  162. | #define PACKAGE_BUGREPORT "a suitable curl mailing list: https://curl.haxx.se/mail/"
  163. | #define PACKAGE_URL ""
  164. | /* end confdefs.h. */
  165. | #include <ac_nonexistent.h>
  166. configure:5007: checking for a sed that does not truncate output
  167. configure:5071: result: /bin/sed
  168. configure:5090: checking whether to build with code coverage support
  169. configure:5110: result: no
  170. configure:5455: checking whether build environment is sane
  171. configure:5510: result: yes
  172. configure:5566: checking for i386-aros-strip
  173. configure:5593: result: /root/linux-i386/bin/linux-x86_64/tools/crosstools/i386-aros-strip
  174. configure:5658: checking for a thread-safe mkdir -p
  175. configure:5697: result: /bin/mkdir -p
  176. configure:5704: checking for gawk
  177. configure:5720: found /usr/bin/gawk
  178. configure:5731: result: gawk
  179. configure:5742: checking whether make sets $(MAKE)
  180. configure:5764: result: yes
  181. configure:5794: checking for style of include used by make
  182. configure:5822: result: GNU
  183. configure:5923: checking dependency style of /root/linux-i386/bin/linux-x86_64/tools/crosstools/i386-aros-gcc
  184. configure:6034: result: gcc3
  185. configure:6097: checking curl version
  186. configure:6099: result: 7.60.0
  187. configure:6145: checking build system type
  188. configure:6159: result: x86_64-pc-linux-gnu
  189. configure:6179: checking host system type
  190. configure:6192: result: i386-pc-aros
  191. configure:6221: checking for grep that handles long lines and -e
  192. configure:6279: result: /bin/grep
  193. configure:6284: checking for egrep
  194. configure:6346: result: /bin/grep -E
  195. configure:6353: checking if OS is AIX (to define _ALL_SOURCE)
  196. configure:6373: result: no
  197. configure:6383: checking if _THREAD_SAFE is already defined
  198. configure:6404: /root/linux-i386/bin/linux-x86_64/tools/crosstools/i386-aros-gcc -c -m32 -march=i486 -DAROS_BUILD_TYPE=AROS_BUILD_TYPE_PERSONAL -g -DADEBUG=1 -DMDEBUG=1 -O0 -nix -D__BSD_VISIBLE=1 conftest.c >&5
  199. conftest.c: In function 'main':
  200. conftest.c:21:7: error: unknown type name 'force'
  201. conftest.c:21:25: error: expected '=', ',', ';', 'asm' or '__attribute__' before 'error'
  202. configure:6404: $? = 1
  203. configure: failed program was:
  204. | /* confdefs.h */
  205. | #define PACKAGE_NAME "curl"
  206. | #define PACKAGE_TARNAME "curl"
  207. | #define PACKAGE_VERSION "-"
  208. | #define PACKAGE_STRING "curl -"
  209. | #define PACKAGE_BUGREPORT "a suitable curl mailing list: https://curl.haxx.se/mail/"
  210. | #define PACKAGE_URL ""
  211. | #define PACKAGE "curl"
  212. | #define VERSION "-"
  213. | #define OS "i386-pc-aros"
  214. | /* end confdefs.h. */
  215. |
  216. |
  217. |
  218. | int main (void)
  219. | {
  220. |
  221. | #ifdef _THREAD_SAFE
  222. | int dummy=1;
  223. | #else
  224. | force compilation error
  225. | #endif
  226. |
  227. | ;
  228. | return 0;
  229. | }
  230. |
  231. configure:6412: result: no
  232. configure:6420: checking if _THREAD_SAFE is actually needed
  233. configure:6439: result: no
  234. configure:6444: checking if _THREAD_SAFE is onwards defined
  235. configure:6461: result: no
  236. configure:6468: checking if _REENTRANT is already defined
  237. configure:6489: /root/linux-i386/bin/linux-x86_64/tools/crosstools/i386-aros-gcc -c -m32 -march=i486 -DAROS_BUILD_TYPE=AROS_BUILD_TYPE_PERSONAL -g -DADEBUG=1 -DMDEBUG=1 -O0 -nix -D__BSD_VISIBLE=1 conftest.c >&5
  238. conftest.c: In function 'main':
  239. conftest.c:21:7: error: unknown type name 'force'
  240. conftest.c:21:25: error: expected '=', ',', ';', 'asm' or '__attribute__' before 'error'
  241. configure:6489: $? = 1
  242. configure: failed program was:
  243. | /* confdefs.h */
  244. | #define PACKAGE_NAME "curl"
  245. | #define PACKAGE_TARNAME "curl"
  246. | #define PACKAGE_VERSION "-"
  247. | #define PACKAGE_STRING "curl -"
  248. | #define PACKAGE_BUGREPORT "a suitable curl mailing list: https://curl.haxx.se/mail/"
  249. | #define PACKAGE_URL ""
  250. | #define PACKAGE "curl"
  251. | #define VERSION "-"
  252. | #define OS "i386-pc-aros"
  253. | /* end confdefs.h. */
  254. |
  255. |
  256. |
  257. | int main (void)
  258. | {
  259. |
  260. | #ifdef _REENTRANT
  261. | int dummy=1;
  262. | #else
  263. | force compilation error
  264. | #endif
  265. |
  266. | ;
  267. | return 0;
  268. | }
  269. |
  270. configure:6497: result: no
  271. configure:6505: checking if _REENTRANT is actually needed
  272. configure:6536: /root/linux-i386/bin/linux-x86_64/tools/crosstools/i386-aros-gcc -c -m32 -march=i486 -DAROS_BUILD_TYPE=AROS_BUILD_TYPE_PERSONAL -g -DADEBUG=1 -DMDEBUG=1 -O0 -nix -D__BSD_VISIBLE=1 conftest.c >&5
  273. configure:6536: $? = 0
  274. configure:6567: /root/linux-i386/bin/linux-x86_64/tools/crosstools/i386-aros-gcc -c -m32 -march=i486 -DAROS_BUILD_TYPE=AROS_BUILD_TYPE_PERSONAL -g -DADEBUG=1 -DMDEBUG=1 -O0 -nix -D__BSD_VISIBLE=1 conftest.c >&5
  275. configure:6567: $? = 0
  276. configure:6638: /root/linux-i386/bin/linux-x86_64/tools/crosstools/i386-aros-gcc -o conftest -m32 -march=i486 -DAROS_BUILD_TYPE=AROS_BUILD_TYPE_PERSONAL -g -DADEBUG=1 -DMDEBUG=1 -O0 -nix -D__BSD_VISIBLE=1 -L/root/linux-i386/bin/linux-i386/AROS/Developer/lib -nix conftest.c >&5
  277. configure:6638: $? = 0
  278. configure:6717: /root/linux-i386/bin/linux-x86_64/tools/crosstools/i386-aros-gcc -o conftest -m32 -march=i486 -DAROS_BUILD_TYPE=AROS_BUILD_TYPE_PERSONAL -g -DADEBUG=1 -DMDEBUG=1 -O0 -nix -D__BSD_VISIBLE=1 -L/root/linux-i386/bin/linux-i386/AROS/Developer/lib -nix conftest.c >&5
  279. configure:6717: $? = 0
  280. configure:6796: /root/linux-i386/bin/linux-x86_64/tools/crosstools/i386-aros-gcc -o conftest -m32 -march=i486 -DAROS_BUILD_TYPE=AROS_BUILD_TYPE_PERSONAL -g -DADEBUG=1 -DMDEBUG=1 -O0 -nix -D__BSD_VISIBLE=1 -L/root/linux-i386/bin/linux-i386/AROS/Developer/lib -nix conftest.c >&5
  281. There are undefined symbols in 'conftest':
  282. U strerror_r /root/linux-i386/bin/linux-i386/gen/contrib/development/libs/curl/curl/conftest.c:31
  283. configure:6796: $? = 1
  284. configure: failed program was:
  285. | /* confdefs.h */
  286. | #define PACKAGE_NAME "curl"
  287. | #define PACKAGE_TARNAME "curl"
  288. | #define PACKAGE_VERSION "-"
  289. | #define PACKAGE_STRING "curl -"
  290. | #define PACKAGE_BUGREPORT "a suitable curl mailing list: https://curl.haxx.se/mail/"
  291. | #define PACKAGE_URL ""
  292. | #define PACKAGE "curl"
  293. | #define VERSION "-"
  294. | #define OS "i386-pc-aros"
  295. | /* end confdefs.h. */
  296. |
  297. |
  298. | #define strerror_r innocuous_strerror_r
  299. | #ifdef __STDC__
  300. | # include <limits.h>
  301. | #else
  302. | # include <assert.h>
  303. | #endif
  304. | #undef strerror_r
  305. | #ifdef __cplusplus
  306. | extern "C"
  307. | #endif
  308. | char strerror_r ();
  309. | #if defined __stub_strerror_r || defined __stub___strerror_r
  310. | choke me
  311. | #endif
  312. |
  313. | int main (void)
  314. | {
  315. | return strerror_r ();
  316. | ;
  317. | return 0;
  318. | }
  319. |
  320. configure:6875: /root/linux-i386/bin/linux-x86_64/tools/crosstools/i386-aros-gcc -o conftest -m32 -march=i486 -DAROS_BUILD_TYPE=AROS_BUILD_TYPE_PERSONAL -g -DADEBUG=1 -DMDEBUG=1 -O0 -nix -D__BSD_VISIBLE=1 -L/root/linux-i386/bin/linux-i386/AROS/Developer/lib -nix conftest.c >&5
  321. configure:6875: $? = 0
  322. configure:6954: /root/linux-i386/bin/linux-x86_64/tools/crosstools/i386-aros-gcc -o conftest -m32 -march=i486 -DAROS_BUILD_TYPE=AROS_BUILD_TYPE_PERSONAL -g -DADEBUG=1 -DMDEBUG=1 -O0 -nix -D__BSD_VISIBLE=1 -L/root/linux-i386/bin/linux-i386/AROS/Developer/lib -nix conftest.c >&5
  323. There are undefined symbols in 'conftest':
  324. U inet_ntoa_r /root/linux-i386/bin/linux-i386/gen/contrib/development/libs/curl/curl/conftest.c:31
  325. configure:6954: $? = 1
  326. configure: failed program was:
  327. | /* confdefs.h */
  328. | #define PACKAGE_NAME "curl"
  329. | #define PACKAGE_TARNAME "curl"
  330. | #define PACKAGE_VERSION "-"
  331. | #define PACKAGE_STRING "curl -"
  332. | #define PACKAGE_BUGREPORT "a suitable curl mailing list: https://curl.haxx.se/mail/"
  333. | #define PACKAGE_URL ""
  334. | #define PACKAGE "curl"
  335. | #define VERSION "-"
  336. | #define OS "i386-pc-aros"
  337. | /* end confdefs.h. */
  338. |
  339. |
  340. | #define inet_ntoa_r innocuous_inet_ntoa_r
  341. | #ifdef __STDC__
  342. | # include <limits.h>
  343. | #else
  344. | # include <assert.h>
  345. | #endif
  346. | #undef inet_ntoa_r
  347. | #ifdef __cplusplus
  348. | extern "C"
  349. | #endif
  350. | char inet_ntoa_r ();
  351. | #if defined __stub_inet_ntoa_r || defined __stub___inet_ntoa_r
  352. | choke me
  353. | #endif
  354. |
  355. | int main (void)
  356. | {
  357. | return inet_ntoa_r ();
  358. | ;
  359. | return 0;
  360. | }
  361. |
  362. configure:7037: /root/linux-i386/bin/linux-x86_64/tools/crosstools/i386-aros-gcc -o conftest -m32 -march=i486 -DAROS_BUILD_TYPE=AROS_BUILD_TYPE_PERSONAL -g -DADEBUG=1 -DMDEBUG=1 -O0 -nix -D__BSD_VISIBLE=1 -L/root/linux-i386/bin/linux-i386/AROS/Developer/lib -nix conftest.c >&5
  363. There are undefined symbols in 'conftest':
  364. U gethostbyaddr_r /root/linux-i386/bin/linux-i386/gen/contrib/development/libs/curl/curl/conftest.c:31
  365. configure:7037: $? = 1
  366. configure: failed program was:
  367. | /* confdefs.h */
  368. | #define PACKAGE_NAME "curl"
  369. | #define PACKAGE_TARNAME "curl"
  370. | #define PACKAGE_VERSION "-"
  371. | #define PACKAGE_STRING "curl -"
  372. | #define PACKAGE_BUGREPORT "a suitable curl mailing list: https://curl.haxx.se/mail/"
  373. | #define PACKAGE_URL ""
  374. | #define PACKAGE "curl"
  375. | #define VERSION "-"
  376. | #define OS "i386-pc-aros"
  377. | /* end confdefs.h. */
  378. |
  379. |
  380. | #define gethostbyaddr_r innocuous_gethostbyaddr_r
  381. | #ifdef __STDC__
  382. | # include <limits.h>
  383. | #else
  384. | # include <assert.h>
  385. | #endif
  386. | #undef gethostbyaddr_r
  387. | #ifdef __cplusplus
  388. | extern "C"
  389. | #endif
  390. | char gethostbyaddr_r ();
  391. | #if defined __stub_gethostbyaddr_r || defined __stub___gethostbyaddr_r
  392. | choke me
  393. | #endif
  394. |
  395. | int main (void)
  396. | {
  397. | return gethostbyaddr_r ();
  398. | ;
  399. | return 0;
  400. | }
  401. |
  402. configure:7116: /root/linux-i386/bin/linux-x86_64/tools/crosstools/i386-aros-gcc -o conftest -m32 -march=i486 -DAROS_BUILD_TYPE=AROS_BUILD_TYPE_PERSONAL -g -DADEBUG=1 -DMDEBUG=1 -O0 -nix -D__BSD_VISIBLE=1 -L/root/linux-i386/bin/linux-i386/AROS/Developer/lib -nix conftest.c >&5
  403. There are undefined symbols in 'conftest':
  404. U gethostbyname_r /root/linux-i386/bin/linux-i386/gen/contrib/development/libs/curl/curl/conftest.c:31
  405. configure:7116: $? = 1
  406. configure: failed program was:
  407. | /* confdefs.h */
  408. | #define PACKAGE_NAME "curl"
  409. | #define PACKAGE_TARNAME "curl"
  410. | #define PACKAGE_VERSION "-"
  411. | #define PACKAGE_STRING "curl -"
  412. | #define PACKAGE_BUGREPORT "a suitable curl mailing list: https://curl.haxx.se/mail/"
  413. | #define PACKAGE_URL ""
  414. | #define PACKAGE "curl"
  415. | #define VERSION "-"
  416. | #define OS "i386-pc-aros"
  417. | /* end confdefs.h. */
  418. |
  419. |
  420. | #define gethostbyname_r innocuous_gethostbyname_r
  421. | #ifdef __STDC__
  422. | # include <limits.h>
  423. | #else
  424. | # include <assert.h>
  425. | #endif
  426. | #undef gethostbyname_r
  427. | #ifdef __cplusplus
  428. | extern "C"
  429. | #endif
  430. | char gethostbyname_r ();
  431. | #if defined __stub_gethostbyname_r || defined __stub___gethostbyname_r
  432. | choke me
  433. | #endif
  434. |
  435. | int main (void)
  436. | {
  437. | return gethostbyname_r ();
  438. | ;
  439. | return 0;
  440. | }
  441. |
  442. configure:7195: /root/linux-i386/bin/linux-x86_64/tools/crosstools/i386-aros-gcc -o conftest -m32 -march=i486 -DAROS_BUILD_TYPE=AROS_BUILD_TYPE_PERSONAL -g -DADEBUG=1 -DMDEBUG=1 -O0 -nix -D__BSD_VISIBLE=1 -L/root/linux-i386/bin/linux-i386/AROS/Developer/lib -nix conftest.c >&5
  443. There are undefined symbols in 'conftest':
  444. U getprotobyname_r /root/linux-i386/bin/linux-i386/gen/contrib/development/libs/curl/curl/conftest.c:31
  445. configure:7195: $? = 1
  446. configure: failed program was:
  447. | /* confdefs.h */
  448. | #define PACKAGE_NAME "curl"
  449. | #define PACKAGE_TARNAME "curl"
  450. | #define PACKAGE_VERSION "-"
  451. | #define PACKAGE_STRING "curl -"
  452. | #define PACKAGE_BUGREPORT "a suitable curl mailing list: https://curl.haxx.se/mail/"
  453. | #define PACKAGE_URL ""
  454. | #define PACKAGE "curl"
  455. | #define VERSION "-"
  456. | #define OS "i386-pc-aros"
  457. | /* end confdefs.h. */
  458. |
  459. |
  460. | #define getprotobyname_r innocuous_getprotobyname_r
  461. | #ifdef __STDC__
  462. | # include <limits.h>
  463. | #else
  464. | # include <assert.h>
  465. | #endif
  466. | #undef getprotobyname_r
  467. | #ifdef __cplusplus
  468. | extern "C"
  469. | #endif
  470. | char getprotobyname_r ();
  471. | #if defined __stub_getprotobyname_r || defined __stub___getprotobyname_r
  472. | choke me
  473. | #endif
  474. |
  475. | int main (void)
  476. | {
  477. | return getprotobyname_r ();
  478. | ;
  479. | return 0;
  480. | }
  481. |
  482. configure:7274: /root/linux-i386/bin/linux-x86_64/tools/crosstools/i386-aros-gcc -o conftest -m32 -march=i486 -DAROS_BUILD_TYPE=AROS_BUILD_TYPE_PERSONAL -g -DADEBUG=1 -DMDEBUG=1 -O0 -nix -D__BSD_VISIBLE=1 -L/root/linux-i386/bin/linux-i386/AROS/Developer/lib -nix conftest.c >&5
  483. There are undefined symbols in 'conftest':
  484. U getservbyport_r /root/linux-i386/bin/linux-i386/gen/contrib/development/libs/curl/curl/conftest.c:31
  485. configure:7274: $? = 1
  486. configure: failed program was:
  487. | /* confdefs.h */
  488. | #define PACKAGE_NAME "curl"
  489. | #define PACKAGE_TARNAME "curl"
  490. | #define PACKAGE_VERSION "-"
  491. | #define PACKAGE_STRING "curl -"
  492. | #define PACKAGE_BUGREPORT "a suitable curl mailing list: https://curl.haxx.se/mail/"
  493. | #define PACKAGE_URL ""
  494. | #define PACKAGE "curl"
  495. | #define VERSION "-"
  496. | #define OS "i386-pc-aros"
  497. | /* end confdefs.h. */
  498. |
  499. |
  500. | #define getservbyport_r innocuous_getservbyport_r
  501. | #ifdef __STDC__
  502. | # include <limits.h>
  503. | #else
  504. | # include <assert.h>
  505. | #endif
  506. | #undef getservbyport_r
  507. | #ifdef __cplusplus
  508. | extern "C"
  509. | #endif
  510. | char getservbyport_r ();
  511. | #if defined __stub_getservbyport_r || defined __stub___getservbyport_r
  512. | choke me
  513. | #endif
  514. |
  515. | int main (void)
  516. | {
  517. | return getservbyport_r ();
  518. | ;
  519. | return 0;
  520. | }
  521. |
  522. configure:7330: result: no
  523. configure:7335: checking if _REENTRANT is onwards defined
  524. configure:7352: result: no
  525. configure:7365: checking for special C compiler options needed for large files
  526. configure:7409: result: no
  527. configure:7415: checking for _FILE_OFFSET_BITS value needed for large files
  528. configure:7439: /root/linux-i386/bin/linux-x86_64/tools/crosstools/i386-aros-gcc -c -m32 -march=i486 -DAROS_BUILD_TYPE=AROS_BUILD_TYPE_PERSONAL -g -DADEBUG=1 -DMDEBUG=1 -O0 -nix -D__BSD_VISIBLE=1 conftest.c >&5
  529. conftest.c:18:3: warning: left shift count >= width of type [enabled by default]
  530. conftest.c:18:3: warning: left shift count >= width of type [enabled by default]
  531. conftest.c:19:10: warning: left shift count >= width of type [enabled by default]
  532. conftest.c:19:10: warning: left shift count >= width of type [enabled by default]
  533. conftest.c:18:7: error: variably modified 'off_t_is_large' at file scope
  534. configure:7439: $? = 1
  535. configure: failed program was:
  536. | /* confdefs.h */
  537. | #define PACKAGE_NAME "curl"
  538. | #define PACKAGE_TARNAME "curl"
  539. | #define PACKAGE_VERSION "-"
  540. | #define PACKAGE_STRING "curl -"
  541. | #define PACKAGE_BUGREPORT "a suitable curl mailing list: https://curl.haxx.se/mail/"
  542. | #define PACKAGE_URL ""
  543. | #define PACKAGE "curl"
  544. | #define VERSION "-"
  545. | #define OS "i386-pc-aros"
  546. | /* end confdefs.h. */
  547. | #include <sys/types.h>
  548. | /* Check that off_t can represent 2**63 - 1 correctly.
  549. | We can't simply define LARGE_OFF_T to be 9223372036854775807,
  550. | since some C++ compilers masquerading as C compilers
  551. | incorrectly reject 9223372036854775807. */
  552. | #define LARGE_OFF_T (((off_t) 1 << 62) - 1 + ((off_t) 1 << 62))
  553. | int off_t_is_large[(LARGE_OFF_T % 2147483629 == 721
  554. | && LARGE_OFF_T % 2147483647 == 1)
  555. | ? 1 : -1];
  556. | int main (void)
  557. | {
  558. |
  559. | ;
  560. | return 0;
  561. | }
  562. configure:7462: /root/linux-i386/bin/linux-x86_64/tools/crosstools/i386-aros-gcc -c -m32 -march=i486 -DAROS_BUILD_TYPE=AROS_BUILD_TYPE_PERSONAL -g -DADEBUG=1 -DMDEBUG=1 -O0 -nix -D__BSD_VISIBLE=1 conftest.c >&5
  563. conftest.c:19:3: warning: left shift count >= width of type [enabled by default]
  564. conftest.c:19:3: warning: left shift count >= width of type [enabled by default]
  565. conftest.c:20:10: warning: left shift count >= width of type [enabled by default]
  566. conftest.c:20:10: warning: left shift count >= width of type [enabled by default]
  567. conftest.c:19:7: error: variably modified 'off_t_is_large' at file scope
  568. configure:7462: $? = 1
  569. configure: failed program was:
  570. | /* confdefs.h */
  571. | #define PACKAGE_NAME "curl"
  572. | #define PACKAGE_TARNAME "curl"
  573. | #define PACKAGE_VERSION "-"
  574. | #define PACKAGE_STRING "curl -"
  575. | #define PACKAGE_BUGREPORT "a suitable curl mailing list: https://curl.haxx.se/mail/"
  576. | #define PACKAGE_URL ""
  577. | #define PACKAGE "curl"
  578. | #define VERSION "-"
  579. | #define OS "i386-pc-aros"
  580. | /* end confdefs.h. */
  581. | #define _FILE_OFFSET_BITS 64
  582. | #include <sys/types.h>
  583. | /* Check that off_t can represent 2**63 - 1 correctly.
  584. | We can't simply define LARGE_OFF_T to be 9223372036854775807,
  585. | since some C++ compilers masquerading as C compilers
  586. | incorrectly reject 9223372036854775807. */
  587. | #define LARGE_OFF_T (((off_t) 1 << 62) - 1 + ((off_t) 1 << 62))
  588. | int off_t_is_large[(LARGE_OFF_T % 2147483629 == 721
  589. | && LARGE_OFF_T % 2147483647 == 1)
  590. | ? 1 : -1];
  591. | int main (void)
  592. | {
  593. |
  594. | ;
  595. | return 0;
  596. | }
  597. configure:7470: result: unknown
  598. configure:7482: checking for _LARGE_FILES value needed for large files
  599. configure:7506: /root/linux-i386/bin/linux-x86_64/tools/crosstools/i386-aros-gcc -c -m32 -march=i486 -DAROS_BUILD_TYPE=AROS_BUILD_TYPE_PERSONAL -g -DADEBUG=1 -DMDEBUG=1 -O0 -nix -D__BSD_VISIBLE=1 conftest.c >&5
  600. conftest.c:18:3: warning: left shift count >= width of type [enabled by default]
  601. conftest.c:18:3: warning: left shift count >= width of type [enabled by default]
  602. conftest.c:19:10: warning: left shift count >= width of type [enabled by default]
  603. conftest.c:19:10: warning: left shift count >= width of type [enabled by default]
  604. conftest.c:18:7: error: variably modified 'off_t_is_large' at file scope
  605. configure:7506: $? = 1
  606. configure: failed program was:
  607. | /* confdefs.h */
  608. | #define PACKAGE_NAME "curl"
  609. | #define PACKAGE_TARNAME "curl"
  610. | #define PACKAGE_VERSION "-"
  611. | #define PACKAGE_STRING "curl -"
  612. | #define PACKAGE_BUGREPORT "a suitable curl mailing list: https://curl.haxx.se/mail/"
  613. | #define PACKAGE_URL ""
  614. | #define PACKAGE "curl"
  615. | #define VERSION "-"
  616. | #define OS "i386-pc-aros"
  617. | /* end confdefs.h. */
  618. | #include <sys/types.h>
  619. | /* Check that off_t can represent 2**63 - 1 correctly.
  620. | We can't simply define LARGE_OFF_T to be 9223372036854775807,
  621. | since some C++ compilers masquerading as C compilers
  622. | incorrectly reject 9223372036854775807. */
  623. | #define LARGE_OFF_T (((off_t) 1 << 62) - 1 + ((off_t) 1 << 62))
  624. | int off_t_is_large[(LARGE_OFF_T % 2147483629 == 721
  625. | && LARGE_OFF_T % 2147483647 == 1)
  626. | ? 1 : -1];
  627. | int main (void)
  628. | {
  629. |
  630. | ;
  631. | return 0;
  632. | }
  633. configure:7529: /root/linux-i386/bin/linux-x86_64/tools/crosstools/i386-aros-gcc -c -m32 -march=i486 -DAROS_BUILD_TYPE=AROS_BUILD_TYPE_PERSONAL -g -DADEBUG=1 -DMDEBUG=1 -O0 -nix -D__BSD_VISIBLE=1 conftest.c >&5
  634. conftest.c:19:3: warning: left shift count >= width of type [enabled by default]
  635. conftest.c:19:3: warning: left shift count >= width of type [enabled by default]
  636. conftest.c:20:10: warning: left shift count >= width of type [enabled by default]
  637. conftest.c:20:10: warning: left shift count >= width of type [enabled by default]
  638. conftest.c:19:7: error: variably modified 'off_t_is_large' at file scope
  639. configure:7529: $? = 1
  640. configure: failed program was:
  641. | /* confdefs.h */
  642. | #define PACKAGE_NAME "curl"
  643. | #define PACKAGE_TARNAME "curl"
  644. | #define PACKAGE_VERSION "-"
  645. | #define PACKAGE_STRING "curl -"
  646. | #define PACKAGE_BUGREPORT "a suitable curl mailing list: https://curl.haxx.se/mail/"
  647. | #define PACKAGE_URL ""
  648. | #define PACKAGE "curl"
  649. | #define VERSION "-"
  650. | #define OS "i386-pc-aros"
  651. | /* end confdefs.h. */
  652. | #define _LARGE_FILES 1
  653. | #include <sys/types.h>
  654. | /* Check that off_t can represent 2**63 - 1 correctly.
  655. | We can't simply define LARGE_OFF_T to be 9223372036854775807,
  656. | since some C++ compilers masquerading as C compilers
  657. | incorrectly reject 9223372036854775807. */
  658. | #define LARGE_OFF_T (((off_t) 1 << 62) - 1 + ((off_t) 1 << 62))
  659. | int off_t_is_large[(LARGE_OFF_T % 2147483629 == 721
  660. | && LARGE_OFF_T % 2147483647 == 1)
  661. | ? 1 : -1];
  662. | int main (void)
  663. | {
  664. |
  665. | ;
  666. | return 0;
  667. | }
  668. configure:7537: result: unknown
  669. configure:7600: checking how to print strings
  670. configure:7627: result: printf
  671. configure:7648: checking for a sed that does not truncate output
  672. configure:7712: result: /bin/sed
  673. configure:7730: checking for fgrep
  674. configure:7792: result: /bin/grep -F
  675. configure:7827: checking for ld used by /root/linux-i386/bin/linux-x86_64/tools/crosstools/i386-aros-gcc
  676. configure:7894: result: /root/linux-i386/bin/linux-x86_64/tools/i386-linux-aros-ld
  677. configure:7901: checking if the linker (/root/linux-i386/bin/linux-x86_64/tools/i386-linux-aros-ld) is GNU ld
  678. configure:7916: result: yes
  679. configure:7928: checking for BSD- or MS-compatible name lister (nm)
  680. configure:7982: result: /root/linux-i386/bin/linux-x86_64/tools/crosstools/i386-aros-nm -B
  681. configure:8112: checking the name lister (/root/linux-i386/bin/linux-x86_64/tools/crosstools/i386-aros-nm -B) interface
  682. configure:8119: /root/linux-i386/bin/linux-x86_64/tools/crosstools/i386-aros-gcc -c -m32 -march=i486 -DAROS_BUILD_TYPE=AROS_BUILD_TYPE_PERSONAL -g -DADEBUG=1 -DMDEBUG=1 -O0 -nix -D__BSD_VISIBLE=1 conftest.c >&5
  683. configure:8122: /root/linux-i386/bin/linux-x86_64/tools/crosstools/i386-aros-nm -B "conftest.o"
  684. configure:8125: output
  685. 00000000 B some_variable
  686. configure:8132: result: BSD nm
  687. configure:8135: checking whether ln -s works
  688. configure:8139: result: yes
  689. configure:8147: checking the maximum length of command line arguments
  690. configure:8278: result: 1572864
  691. configure:8326: checking how to convert x86_64-pc-linux-gnu file names to i386-pc-aros format
  692. configure:8366: result: func_convert_file_noop
  693. configure:8373: checking how to convert x86_64-pc-linux-gnu file names to toolchain format
  694. configure:8393: result: func_convert_file_noop
  695. configure:8400: checking for /root/linux-i386/bin/linux-x86_64/tools/i386-linux-aros-ld option to reload object files
  696. configure:8407: result: -r
  697. configure:8441: checking for i386-aros-objdump
  698. configure:8457: found /root/linux-i386/bin/linux-x86_64/tools/crosstools/i386-aros-objdump
  699. configure:8468: result: i386-aros-objdump
  700. configure:8537: checking how to recognize dependent libraries
  701. configure:8737: result: unknown
  702. configure:8782: checking for i386-aros-dlltool
  703. configure:8812: result: no
  704. configure:8822: checking for dlltool
  705. configure:8852: result: no
  706. configure:8879: checking how to associate runtime and link libraries
  707. configure:8906: result: printf %s\n
  708. configure:8922: checking for i386-aros-ar
  709. configure:8949: result: /root/linux-i386/bin/linux-x86_64/tools/crosstools/i386-aros-ar
  710. configure:9030: checking for archiver @FILE support
  711. configure:9046: /root/linux-i386/bin/linux-x86_64/tools/crosstools/i386-aros-gcc -c -m32 -march=i486 -DAROS_BUILD_TYPE=AROS_BUILD_TYPE_PERSONAL -g -DADEBUG=1 -DMDEBUG=1 -O0 -nix -D__BSD_VISIBLE=1 conftest.c >&5
  712. configure:9046: $? = 0
  713. configure:9049: /root/linux-i386/bin/linux-x86_64/tools/crosstools/i386-aros-ar cru libconftest.a @conftest.lst >&5
  714. configure:9052: $? = 0
  715. configure:9057: /root/linux-i386/bin/linux-x86_64/tools/crosstools/i386-aros-ar cru libconftest.a @conftest.lst >&5
  716. /root/linux-i386/bin/linux-x86_64/tools/crosstools/i386-aros-ar: conftest.o: No such file or directory
  717. configure:9060: $? = 1
  718. configure:9072: result: @
  719. configure:9090: checking for i386-aros-strip
  720. configure:9117: result: /root/linux-i386/bin/linux-x86_64/tools/crosstools/i386-aros-strip
  721. configure:9189: checking for i386-aros-ranlib
  722. configure:9216: result: /root/linux-i386/bin/linux-x86_64/tools/crosstools/i386-aros-ranlib
  723. configure:9358: checking command to parse /root/linux-i386/bin/linux-x86_64/tools/crosstools/i386-aros-nm -B output from /root/linux-i386/bin/linux-x86_64/tools/crosstools/i386-aros-gcc object
  724. configure:9511: /root/linux-i386/bin/linux-x86_64/tools/crosstools/i386-aros-gcc -c -m32 -march=i486 -DAROS_BUILD_TYPE=AROS_BUILD_TYPE_PERSONAL -g -DADEBUG=1 -DMDEBUG=1 -O0 -nix -D__BSD_VISIBLE=1 conftest.c >&5
  725. configure:9514: $? = 0
  726. configure:9518: /root/linux-i386/bin/linux-x86_64/tools/crosstools/i386-aros-nm -B conftest.o \| sed -n -e 's/^.*[ ]\([ABCDGIRSTW][ABCDGIRSTW]*\)[ ][ ]*\([_A-Za-z][_A-Za-z0-9]*\)$/\1 \2 \2/p' | sed '/ __gnu_lto/d' \> conftest.nm
  727. configure:9521: $? = 0
  728. configure:9587: /root/linux-i386/bin/linux-x86_64/tools/crosstools/i386-aros-gcc -o conftest -m32 -march=i486 -DAROS_BUILD_TYPE=AROS_BUILD_TYPE_PERSONAL -g -DADEBUG=1 -DMDEBUG=1 -O0 -nix -D__BSD_VISIBLE=1 -L/root/linux-i386/bin/linux-i386/AROS/Developer/lib -nix conftest.c conftstm.o >&5
  729. configure:9590: $? = 0
  730. configure:9628: result: ok
  731. configure:9675: checking for sysroot
  732. configure:9705: result: no
  733. configure:9712: checking for a working dd
  734. configure:9750: result: /bin/dd
  735. configure:9754: checking how to truncate binary pipes
  736. configure:9769: result: /bin/dd bs=4096 count=1
  737. configure:10057: checking for i386-aros-mt
  738. configure:10087: result: no
  739. configure:10097: checking for mt
  740. configure:10113: found /bin/mt
  741. configure:10124: result: mt
  742. configure:10136: WARNING: using cross tools not prefixed with host triplet
  743. configure:10147: checking if mt is a manifest tool
  744. configure:10153: mt '-?'
  745. configure:10161: result: no
  746. configure:10832: checking for ANSI C header files
  747. configure:10851: /root/linux-i386/bin/linux-x86_64/tools/crosstools/i386-aros-gcc -c -m32 -march=i486 -DAROS_BUILD_TYPE=AROS_BUILD_TYPE_PERSONAL -g -DADEBUG=1 -DMDEBUG=1 -O0 -nix -D__BSD_VISIBLE=1 conftest.c >&5
  748. configure:10851: $? = 0
  749. configure:10935: result: yes
  750. configure:10948: checking for sys/types.h
  751. configure:10948: /root/linux-i386/bin/linux-x86_64/tools/crosstools/i386-aros-gcc -c -m32 -march=i486 -DAROS_BUILD_TYPE=AROS_BUILD_TYPE_PERSONAL -g -DADEBUG=1 -DMDEBUG=1 -O0 -nix -D__BSD_VISIBLE=1 conftest.c >&5
  752. configure:10948: $? = 0
  753. configure:10948: result: yes
  754. configure:10948: checking for sys/stat.h
  755. configure:10948: /root/linux-i386/bin/linux-x86_64/tools/crosstools/i386-aros-gcc -c -m32 -march=i486 -DAROS_BUILD_TYPE=AROS_BUILD_TYPE_PERSONAL -g -DADEBUG=1 -DMDEBUG=1 -O0 -nix -D__BSD_VISIBLE=1 conftest.c >&5
  756. configure:10948: $? = 0
  757. configure:10948: result: yes
  758. configure:10948: checking for stdlib.h
  759. configure:10948: /root/linux-i386/bin/linux-x86_64/tools/crosstools/i386-aros-gcc -c -m32 -march=i486 -DAROS_BUILD_TYPE=AROS_BUILD_TYPE_PERSONAL -g -DADEBUG=1 -DMDEBUG=1 -O0 -nix -D__BSD_VISIBLE=1 conftest.c >&5
  760. configure:10948: $? = 0
  761. configure:10948: result: yes
  762. configure:10948: checking for string.h
  763. configure:10948: /root/linux-i386/bin/linux-x86_64/tools/crosstools/i386-aros-gcc -c -m32 -march=i486 -DAROS_BUILD_TYPE=AROS_BUILD_TYPE_PERSONAL -g -DADEBUG=1 -DMDEBUG=1 -O0 -nix -D__BSD_VISIBLE=1 conftest.c >&5
  764. configure:10948: $? = 0
  765. configure:10948: result: yes
  766. configure:10948: checking for memory.h
  767. configure:10948: /root/linux-i386/bin/linux-x86_64/tools/crosstools/i386-aros-gcc -c -m32 -march=i486 -DAROS_BUILD_TYPE=AROS_BUILD_TYPE_PERSONAL -g -DADEBUG=1 -DMDEBUG=1 -O0 -nix -D__BSD_VISIBLE=1 conftest.c >&5
  768. configure:10948: $? = 0
  769. configure:10948: result: yes
  770. configure:10948: checking for strings.h
  771. configure:10948: /root/linux-i386/bin/linux-x86_64/tools/crosstools/i386-aros-gcc -c -m32 -march=i486 -DAROS_BUILD_TYPE=AROS_BUILD_TYPE_PERSONAL -g -DADEBUG=1 -DMDEBUG=1 -O0 -nix -D__BSD_VISIBLE=1 conftest.c >&5
  772. configure:10948: $? = 0
  773. configure:10948: result: yes
  774. configure:10948: checking for inttypes.h
  775. configure:10948: /root/linux-i386/bin/linux-x86_64/tools/crosstools/i386-aros-gcc -c -m32 -march=i486 -DAROS_BUILD_TYPE=AROS_BUILD_TYPE_PERSONAL -g -DADEBUG=1 -DMDEBUG=1 -O0 -nix -D__BSD_VISIBLE=1 conftest.c >&5
  776. configure:10948: $? = 0
  777. configure:10948: result: yes
  778. configure:10948: checking for stdint.h
  779. configure:10948: /root/linux-i386/bin/linux-x86_64/tools/crosstools/i386-aros-gcc -c -m32 -march=i486 -DAROS_BUILD_TYPE=AROS_BUILD_TYPE_PERSONAL -g -DADEBUG=1 -DMDEBUG=1 -O0 -nix -D__BSD_VISIBLE=1 conftest.c >&5
  780. configure:10948: $? = 0
  781. configure:10948: result: yes
  782. configure:10948: checking for unistd.h
  783. configure:10948: /root/linux-i386/bin/linux-x86_64/tools/crosstools/i386-aros-gcc -c -m32 -march=i486 -DAROS_BUILD_TYPE=AROS_BUILD_TYPE_PERSONAL -g -DADEBUG=1 -DMDEBUG=1 -O0 -nix -D__BSD_VISIBLE=1 conftest.c >&5
  784. configure:10948: $? = 0
  785. configure:10948: result: yes
  786. configure:10962: checking for dlfcn.h
  787. configure:10962: /root/linux-i386/bin/linux-x86_64/tools/crosstools/i386-aros-gcc -c -m32 -march=i486 -DAROS_BUILD_TYPE=AROS_BUILD_TYPE_PERSONAL -g -DADEBUG=1 -DMDEBUG=1 -O0 -nix -D__BSD_VISIBLE=1 conftest.c >&5
  788. conftest.c:56:19: fatal error: dlfcn.h: No such file or directory
  789. compilation terminated.
  790. configure:10962: $? = 1
  791. configure: failed program was:
  792. | /* confdefs.h */
  793. | #define PACKAGE_NAME "curl"
  794. | #define PACKAGE_TARNAME "curl"
  795. | #define PACKAGE_VERSION "-"
  796. | #define PACKAGE_STRING "curl -"
  797. | #define PACKAGE_BUGREPORT "a suitable curl mailing list: https://curl.haxx.se/mail/"
  798. | #define PACKAGE_URL ""
  799. | #define PACKAGE "curl"
  800. | #define VERSION "-"
  801. | #define OS "i386-pc-aros"
  802. | #define STDC_HEADERS 1
  803. | #define HAVE_SYS_TYPES_H 1
  804. | #define HAVE_SYS_STAT_H 1
  805. | #define HAVE_STDLIB_H 1
  806. | #define HAVE_STRING_H 1
  807. | #define HAVE_MEMORY_H 1
  808. | #define HAVE_STRINGS_H 1
  809. | #define HAVE_INTTYPES_H 1
  810. | #define HAVE_STDINT_H 1
  811. | #define HAVE_UNISTD_H 1
  812. | /* end confdefs.h. */
  813. | #include <stdio.h>
  814. | #ifdef HAVE_SYS_TYPES_H
  815. | # include <sys/types.h>
  816. | #endif
  817. | #ifdef HAVE_SYS_STAT_H
  818. | # include <sys/stat.h>
  819. | #endif
  820. | #ifdef STDC_HEADERS
  821. | # include <stdlib.h>
  822. | # include <stddef.h>
  823. | #else
  824. | # ifdef HAVE_STDLIB_H
  825. | # include <stdlib.h>
  826. | # endif
  827. | #endif
  828. | #ifdef HAVE_STRING_H
  829. | # if !defined STDC_HEADERS && defined HAVE_MEMORY_H
  830. | # include <memory.h>
  831. | # endif
  832. | # include <string.h>
  833. | #endif
  834. | #ifdef HAVE_STRINGS_H
  835. | # include <strings.h>
  836. | #endif
  837. | #ifdef HAVE_INTTYPES_H
  838. | # include <inttypes.h>
  839. | #endif
  840. | #ifdef HAVE_STDINT_H
  841. | # include <stdint.h>
  842. | #endif
  843. | #ifdef HAVE_UNISTD_H
  844. | # include <unistd.h>
  845. | #endif
  846. |
  847. | #include <dlfcn.h>
  848. configure:10962: result: no
  849. configure:11623: checking for objdir
  850. configure:11638: result: .libs
  851. configure:11902: checking if /root/linux-i386/bin/linux-x86_64/tools/crosstools/i386-aros-gcc supports -fno-rtti -fno-exceptions
  852. configure:11920: /root/linux-i386/bin/linux-x86_64/tools/crosstools/i386-aros-gcc -c -m32 -march=i486 -DAROS_BUILD_TYPE=AROS_BUILD_TYPE_PERSONAL -g -DADEBUG=1 -DMDEBUG=1 -O0 -nix -D__BSD_VISIBLE=1 -fno-rtti -fno-exceptions conftest.c >&5
  853. cc1: warning: command line option '-fno-rtti' is valid for C++/ObjC++ but not for C [enabled by default]
  854. configure:11924: $? = 0
  855. configure:11937: result: no
  856. configure:12295: checking for /root/linux-i386/bin/linux-x86_64/tools/crosstools/i386-aros-gcc option to produce PIC
  857. configure:12302: result: -fPIC -DPIC
  858. configure:12310: checking if /root/linux-i386/bin/linux-x86_64/tools/crosstools/i386-aros-gcc PIC flag -fPIC -DPIC works
  859. configure:12328: /root/linux-i386/bin/linux-x86_64/tools/crosstools/i386-aros-gcc -c -m32 -march=i486 -DAROS_BUILD_TYPE=AROS_BUILD_TYPE_PERSONAL -g -DADEBUG=1 -DMDEBUG=1 -O0 -nix -D__BSD_VISIBLE=1 -fPIC -DPIC -DPIC conftest.c >&5
  860. <command-line>:0:0: warning: "__PIC__" redefined [enabled by default]
  861. <built-in>:0:0: note: this is the location of the previous definition
  862. <command-line>:0:0: warning: "__pic__" redefined [enabled by default]
  863. <built-in>:0:0: note: this is the location of the previous definition
  864. configure:12332: $? = 0
  865. configure:12345: result: no
  866. configure:12374: checking if /root/linux-i386/bin/linux-x86_64/tools/crosstools/i386-aros-gcc static flag -static works
  867. configure:12402: result: no
  868. configure:12417: checking if /root/linux-i386/bin/linux-x86_64/tools/crosstools/i386-aros-gcc supports -c -o file.o
  869. configure:12438: /root/linux-i386/bin/linux-x86_64/tools/crosstools/i386-aros-gcc -c -m32 -march=i486 -DAROS_BUILD_TYPE=AROS_BUILD_TYPE_PERSONAL -g -DADEBUG=1 -DMDEBUG=1 -O0 -nix -D__BSD_VISIBLE=1 -o out/conftest2.o conftest.c >&5
  870. configure:12442: $? = 0
  871. configure:12464: result: yes
  872. configure:12472: checking if /root/linux-i386/bin/linux-x86_64/tools/crosstools/i386-aros-gcc supports -c -o file.o
  873. configure:12519: result: yes
  874. configure:12552: checking whether the /root/linux-i386/bin/linux-x86_64/tools/crosstools/i386-aros-gcc linker (/root/linux-i386/bin/linux-x86_64/tools/i386-linux-aros-ld) supports shared libraries
  875. configure:13813: result: yes
  876. configure:14053: checking dynamic linker characteristics
  877. configure:14882: result: no
  878. configure:15004: checking how to hardcode library paths into programs
  879. configure:15029: result: immediate
  880. configure:15562: checking whether stripping libraries is possible
  881. configure:15567: result: yes
  882. configure:15602: checking if libtool supports shared libraries
  883. configure:15604: result: no
  884. configure:15607: checking whether to build shared libraries
  885. configure:15632: result: no
  886. configure:15635: checking whether to build static libraries
  887. configure:15639: result: yes
  888. configure:15710: checking whether to build shared libraries with -version-info
  889. configure:15721: result: no
  890. configure:15728: checking whether to build shared libraries with -no-undefined
  891. configure:15741: result: no
  892. configure:15748: checking whether to build shared libraries with -mimpure-text
  893. configure:15758: result: no
  894. configure:15785: checking whether to build shared libraries with PIC
  895. configure:15787: result: no
  896. configure:15789: checking whether to build static libraries with PIC
  897. configure:15791: result: no
  898. configure:15798: checking whether to build shared libraries only
  899. configure:15806: result: no
  900. configure:15813: checking whether to build static libraries only
  901. configure:15821: result: yes
  902. configure:15911: checking for inline
  903. configure:15927: /root/linux-i386/bin/linux-x86_64/tools/crosstools/i386-aros-gcc -c -m32 -march=i486 -DAROS_BUILD_TYPE=AROS_BUILD_TYPE_PERSONAL -g -DADEBUG=1 -DMDEBUG=1 -O0 -nix -D__BSD_VISIBLE=1 conftest.c >&5
  904. configure:15927: $? = 0
  905. configure:15935: result: inline
  906. configure:15956: checking if cpp -P is needed
  907. configure:15973: result: no
  908. configure:16029: checking if compiler is DEC/Compaq/HP C
  909. configure:16053: /root/linux-i386/bin/linux-x86_64/tools/crosstools/i386-aros-gcc -E -D__BSD_VISIBLE=1 conftest.c
  910. configure:16053: $? = 0
  911. configure:16097: /root/linux-i386/bin/linux-x86_64/tools/crosstools/i386-aros-gcc -E -D__BSD_VISIBLE=1 conftest.c
  912. configure:16097: $? = 0
  913. configure:16131: result: no
  914. configure:16136: checking if compiler is HP-UX C
  915. configure:16160: /root/linux-i386/bin/linux-x86_64/tools/crosstools/i386-aros-gcc -E -D__BSD_VISIBLE=1 conftest.c
  916. configure:16160: $? = 0
  917. configure:16193: result: no
  918. configure:16198: checking if compiler is IBM C
  919. configure:16222: /root/linux-i386/bin/linux-x86_64/tools/crosstools/i386-aros-gcc -E -D__BSD_VISIBLE=1 conftest.c
  920. configure:16222: $? = 0
  921. configure:16263: result: no
  922. configure:16268: checking if compiler is Intel C
  923. configure:16292: /root/linux-i386/bin/linux-x86_64/tools/crosstools/i386-aros-gcc -E -D__BSD_VISIBLE=1 conftest.c
  924. configure:16292: $? = 0
  925. configure:16387: result: no
  926. configure:16392: checking if compiler is clang
  927. configure:16416: /root/linux-i386/bin/linux-x86_64/tools/crosstools/i386-aros-gcc -E -D__BSD_VISIBLE=1 conftest.c
  928. configure:16416: $? = 0
  929. configure:16468: result: no
  930. configure:16473: checking if compiler is GNU C
  931. configure:16497: /root/linux-i386/bin/linux-x86_64/tools/crosstools/i386-aros-gcc -E -D__BSD_VISIBLE=1 conftest.c
  932. configure:16497: $? = 0
  933. configure:16521: result: yes
  934. configure:16563: /root/linux-i386/bin/linux-x86_64/tools/crosstools/i386-aros-gcc -E -D__BSD_VISIBLE=1 conftest.c
  935. configure:16563: $? = 0
  936. configure:16591: checking if compiler is LCC
  937. configure:16615: /root/linux-i386/bin/linux-x86_64/tools/crosstools/i386-aros-gcc -E -D__BSD_VISIBLE=1 conftest.c
  938. configure:16615: $? = 0
  939. configure:16648: result: no
  940. configure:16653: checking if compiler is SGI MIPSpro C
  941. configure:16677: /root/linux-i386/bin/linux-x86_64/tools/crosstools/i386-aros-gcc -E -D__BSD_VISIBLE=1 conftest.c
  942. configure:16677: $? = 0
  943. configure:16721: /root/linux-i386/bin/linux-x86_64/tools/crosstools/i386-aros-gcc -E -D__BSD_VISIBLE=1 conftest.c
  944. configure:16721: $? = 0
  945. configure:16765: /root/linux-i386/bin/linux-x86_64/tools/crosstools/i386-aros-gcc -E -D__BSD_VISIBLE=1 conftest.c
  946. configure:16765: $? = 0
  947. configure:16800: result: no
  948. configure:16805: checking if compiler is SGI MIPS C
  949. configure:16829: /root/linux-i386/bin/linux-x86_64/tools/crosstools/i386-aros-gcc -E -D__BSD_VISIBLE=1 conftest.c
  950. configure:16829: $? = 0
  951. configure:16873: /root/linux-i386/bin/linux-x86_64/tools/crosstools/i386-aros-gcc -E -D__BSD_VISIBLE=1 conftest.c
  952. configure:16873: $? = 0
  953. configure:16908: result: no
  954. configure:16913: checking if compiler is SunPro C
  955. configure:16937: /root/linux-i386/bin/linux-x86_64/tools/crosstools/i386-aros-gcc -E -D__BSD_VISIBLE=1 conftest.c
  956. configure:16937: $? = 0
  957. configure:16970: result: no
  958. configure:16975: checking if compiler is Tiny C
  959. configure:16999: /root/linux-i386/bin/linux-x86_64/tools/crosstools/i386-aros-gcc -E -D__BSD_VISIBLE=1 conftest.c
  960. configure:16999: $? = 0
  961. configure:17032: result: no
  962. configure:17037: checking if compiler is Watcom C
  963. configure:17061: /root/linux-i386/bin/linux-x86_64/tools/crosstools/i386-aros-gcc -E -D__BSD_VISIBLE=1 conftest.c
  964. configure:17061: $? = 0
  965. configure:17148: result: no
  966. configure:17320: checking if compiler accepts some basic options
  967. configure:17344: /root/linux-i386/bin/linux-x86_64/tools/crosstools/i386-aros-gcc -c -m32 -march=i486 -DAROS_BUILD_TYPE=AROS_BUILD_TYPE_PERSONAL -g -DADEBUG=1 -DMDEBUG=1 -O0 -nix -Werror-implicit-function-declaration -D__BSD_VISIBLE=1 conftest.c >&5
  968. configure:17344: $? = 0
  969. configure:17374: /root/linux-i386/bin/linux-x86_64/tools/crosstools/i386-aros-gcc -o conftest -m32 -march=i486 -DAROS_BUILD_TYPE=AROS_BUILD_TYPE_PERSONAL -g -DADEBUG=1 -DMDEBUG=1 -O0 -nix -Werror-implicit-function-declaration -D__BSD_VISIBLE=1 -L/root/linux-i386/bin/linux-i386/AROS/Developer/lib -nix conftest.c >&5
  970. configure:17374: $? = 0
  971. configure:17435: result: yes
  972. configure:17437: compiler options added: -Werror-implicit-function-declaration
  973. configure:17504: checking if compiler accepts debug disabling options
  974. configure:17536: /root/linux-i386/bin/linux-x86_64/tools/crosstools/i386-aros-gcc -c -m32 -march=i486 -DAROS_BUILD_TYPE=AROS_BUILD_TYPE_PERSONAL -DADEBUG=1 -DMDEBUG=1 -O0 -nix -Werror-implicit-function-declaration -D__BSD_VISIBLE=1 conftest.c >&5
  975. configure:17536: $? = 0
  976. configure:17566: /root/linux-i386/bin/linux-x86_64/tools/crosstools/i386-aros-gcc -o conftest -m32 -march=i486 -DAROS_BUILD_TYPE=AROS_BUILD_TYPE_PERSONAL -DADEBUG=1 -DMDEBUG=1 -O0 -nix -Werror-implicit-function-declaration -D__BSD_VISIBLE=1 -L/root/linux-i386/bin/linux-i386/AROS/Developer/lib -nix conftest.c >&5
  977. configure:17566: $? = 0
  978. configure:17627: result: yes
  979. configure:17629: compiler options added:
  980. configure:17661: checking if compiler optimizer assumed setting might be used
  981. configure:17699: result: no
  982. configure:18177: checking if compiler accepts strict warning options
  983. configure:18201: /root/linux-i386/bin/linux-x86_64/tools/crosstools/i386-aros-gcc -c -m32 -march=i486 -DAROS_BUILD_TYPE=AROS_BUILD_TYPE_PERSONAL -DADEBUG=1 -DMDEBUG=1 -O0 -nix -Werror-implicit-function-declaration -Wno-system-headers -D__BSD_VISIBLE=1 conftest.c >&5
  984. configure:18201: $? = 0
  985. configure:18231: /root/linux-i386/bin/linux-x86_64/tools/crosstools/i386-aros-gcc -o conftest -m32 -march=i486 -DAROS_BUILD_TYPE=AROS_BUILD_TYPE_PERSONAL -DADEBUG=1 -DMDEBUG=1 -O0 -nix -Werror-implicit-function-declaration -Wno-system-headers -D__BSD_VISIBLE=1 -L/root/linux-i386/bin/linux-i386/AROS/Developer/lib -nix conftest.c >&5
  986. configure:18231: $? = 0
  987. configure:18292: result: yes
  988. configure:18294: compiler options added: -Wno-system-headers
  989. configure:18324: checking if compiler halts on compilation errors
  990. configure:18341: /root/linux-i386/bin/linux-x86_64/tools/crosstools/i386-aros-gcc -c -m32 -march=i486 -DAROS_BUILD_TYPE=AROS_BUILD_TYPE_PERSONAL -DADEBUG=1 -DMDEBUG=1 -O0 -nix -Werror-implicit-function-declaration -Wno-system-headers -D__BSD_VISIBLE=1 conftest.c >&5
  991. conftest.c: In function 'main':
  992. conftest.c:29:7: error: unknown type name 'force'
  993. conftest.c:29:25: error: expected '=', ',', ';', 'asm' or '__attribute__' before 'error'
  994. configure:18341: $? = 1
  995. configure: failed program was:
  996. | /* confdefs.h */
  997. | #define PACKAGE_NAME "curl"
  998. | #define PACKAGE_TARNAME "curl"
  999. | #define PACKAGE_VERSION "-"
  1000. | #define PACKAGE_STRING "curl -"
  1001. | #define PACKAGE_BUGREPORT "a suitable curl mailing list: https://curl.haxx.se/mail/"
  1002. | #define PACKAGE_URL ""
  1003. | #define PACKAGE "curl"
  1004. | #define VERSION "-"
  1005. | #define OS "i386-pc-aros"
  1006. | #define STDC_HEADERS 1
  1007. | #define HAVE_SYS_TYPES_H 1
  1008. | #define HAVE_SYS_STAT_H 1
  1009. | #define HAVE_STDLIB_H 1
  1010. | #define HAVE_STRING_H 1
  1011. | #define HAVE_MEMORY_H 1
  1012. | #define HAVE_STRINGS_H 1
  1013. | #define HAVE_INTTYPES_H 1
  1014. | #define HAVE_STDINT_H 1
  1015. | #define HAVE_UNISTD_H 1
  1016. | #define LT_OBJDIR ".libs/"
  1017. | /* end confdefs.h. */
  1018. |
  1019. |
  1020. |
  1021. | int main (void)
  1022. | {
  1023. |
  1024. | force compilation error
  1025. |
  1026. | ;
  1027. | return 0;
  1028. | }
  1029. |
  1030. configure:18349: result: yes
  1031. configure:18356: checking if compiler halts on negative sized arrays
  1032. configure:18374: /root/linux-i386/bin/linux-x86_64/tools/crosstools/i386-aros-gcc -c -m32 -march=i486 -DAROS_BUILD_TYPE=AROS_BUILD_TYPE_PERSONAL -DADEBUG=1 -DMDEBUG=1 -O0 -nix -Werror-implicit-function-declaration -Wno-system-headers -D__BSD_VISIBLE=1 conftest.c >&5
  1033. conftest.c:25:20: error: size of array 'bad_t' is negative
  1034. configure:18374: $? = 1
  1035. configure: failed program was:
  1036. | /* confdefs.h */
  1037. | #define PACKAGE_NAME "curl"
  1038. | #define PACKAGE_TARNAME "curl"
  1039. | #define PACKAGE_VERSION "-"
  1040. | #define PACKAGE_STRING "curl -"
  1041. | #define PACKAGE_BUGREPORT "a suitable curl mailing list: https://curl.haxx.se/mail/"
  1042. | #define PACKAGE_URL ""
  1043. | #define PACKAGE "curl"
  1044. | #define VERSION "-"
  1045. | #define OS "i386-pc-aros"
  1046. | #define STDC_HEADERS 1
  1047. | #define HAVE_SYS_TYPES_H 1
  1048. | #define HAVE_SYS_STAT_H 1
  1049. | #define HAVE_STDLIB_H 1
  1050. | #define HAVE_STRING_H 1
  1051. | #define HAVE_MEMORY_H 1
  1052. | #define HAVE_STRINGS_H 1
  1053. | #define HAVE_INTTYPES_H 1
  1054. | #define HAVE_STDINT_H 1
  1055. | #define HAVE_UNISTD_H 1
  1056. | #define LT_OBJDIR ".libs/"
  1057. | /* end confdefs.h. */
  1058. |
  1059. |
  1060. | typedef char bad_t[sizeof(char) == sizeof(int) ? -1 : -1 ];
  1061. |
  1062. | int main (void)
  1063. | {
  1064. |
  1065. | bad_t dummy;
  1066. |
  1067. | ;
  1068. | return 0;
  1069. | }
  1070. |
  1071. configure:18382: result: yes
  1072. configure:18389: checking if compiler halts on function prototype mismatch
  1073. configure:18418: /root/linux-i386/bin/linux-x86_64/tools/crosstools/i386-aros-gcc -c -m32 -march=i486 -DAROS_BUILD_TYPE=AROS_BUILD_TYPE_PERSONAL -DADEBUG=1 -DMDEBUG=1 -O0 -nix -Werror-implicit-function-declaration -Wno-system-headers -D__BSD_VISIBLE=1 conftest.c >&5
  1074. conftest.c:26:11: error: conflicting types for 'rand'
  1075. /root/linux-i386/bin/linux-i386/AROS/Developer/include/aros/stdc/stdlib.h:77:5: note: previous declaration of 'rand' was here
  1076. conftest.c:27:11: error: conflicting types for 'rand'
  1077. /root/linux-i386/bin/linux-i386/AROS/Developer/include/aros/stdc/stdlib.h:77:5: note: previous declaration of 'rand' was here
  1078. configure:18418: $? = 1
  1079. configure: failed program was:
  1080. | /* confdefs.h */
  1081. | #define PACKAGE_NAME "curl"
  1082. | #define PACKAGE_TARNAME "curl"
  1083. | #define PACKAGE_VERSION "-"
  1084. | #define PACKAGE_STRING "curl -"
  1085. | #define PACKAGE_BUGREPORT "a suitable curl mailing list: https://curl.haxx.se/mail/"
  1086. | #define PACKAGE_URL ""
  1087. | #define PACKAGE "curl"
  1088. | #define VERSION "-"
  1089. | #define OS "i386-pc-aros"
  1090. | #define STDC_HEADERS 1
  1091. | #define HAVE_SYS_TYPES_H 1
  1092. | #define HAVE_SYS_STAT_H 1
  1093. | #define HAVE_STDLIB_H 1
  1094. | #define HAVE_STRING_H 1
  1095. | #define HAVE_MEMORY_H 1
  1096. | #define HAVE_STRINGS_H 1
  1097. | #define HAVE_INTTYPES_H 1
  1098. | #define HAVE_STDINT_H 1
  1099. | #define HAVE_UNISTD_H 1
  1100. | #define LT_OBJDIR ".libs/"
  1101. | /* end confdefs.h. */
  1102. |
  1103. |
  1104. | # include <stdlib.h>
  1105. | int rand(int n);
  1106. | int rand(int n)
  1107. | {
  1108. | if(n)
  1109. | return ++n;
  1110. | else
  1111. | return n;
  1112. | }
  1113. |
  1114. | int main (void)
  1115. | {
  1116. |
  1117. | int i[2]={0,0};
  1118. | int j = rand(i[0]);
  1119. | if(j)
  1120. | return j;
  1121. |
  1122. | ;
  1123. | return 0;
  1124. | }
  1125. |
  1126. configure:18426: result: yes
  1127. configure:18433: checking if compiler supports hiding library internal symbols
  1128. configure:18527: /root/linux-i386/bin/linux-x86_64/tools/crosstools/i386-aros-gcc -c -m32 -march=i486 -DAROS_BUILD_TYPE=AROS_BUILD_TYPE_PERSONAL -DADEBUG=1 -DMDEBUG=1 -O0 -nix -Werror-implicit-function-declaration -Wno-system-headers -fvisibility=hidden -D__BSD_VISIBLE=1 conftest.c >&5
  1129. configure:18527: $? = 0
  1130. configure:18550: result: yes
  1131. configure:18654: checking for windows.h
  1132. configure:18684: /root/linux-i386/bin/linux-x86_64/tools/crosstools/i386-aros-gcc -c -m32 -march=i486 -DAROS_BUILD_TYPE=AROS_BUILD_TYPE_PERSONAL -DADEBUG=1 -DMDEBUG=1 -O0 -nix -Werror-implicit-function-declaration -Wno-system-headers -D__BSD_VISIBLE=1 conftest.c >&5
  1133. conftest.c:29:21: fatal error: windows.h: No such file or directory
  1134. compilation terminated.
  1135. configure:18684: $? = 1
  1136. configure: failed program was:
  1137. | /* confdefs.h */
  1138. | #define PACKAGE_NAME "curl"
  1139. | #define PACKAGE_TARNAME "curl"
  1140. | #define PACKAGE_VERSION "-"
  1141. | #define PACKAGE_STRING "curl -"
  1142. | #define PACKAGE_BUGREPORT "a suitable curl mailing list: https://curl.haxx.se/mail/"
  1143. | #define PACKAGE_URL ""
  1144. | #define PACKAGE "curl"
  1145. | #define VERSION "-"
  1146. | #define OS "i386-pc-aros"
  1147. | #define STDC_HEADERS 1
  1148. | #define HAVE_SYS_TYPES_H 1
  1149. | #define HAVE_SYS_STAT_H 1
  1150. | #define HAVE_STDLIB_H 1
  1151. | #define HAVE_STRING_H 1
  1152. | #define HAVE_MEMORY_H 1
  1153. | #define HAVE_STRINGS_H 1
  1154. | #define HAVE_INTTYPES_H 1
  1155. | #define HAVE_STDINT_H 1
  1156. | #define HAVE_UNISTD_H 1
  1157. | #define LT_OBJDIR ".libs/"
  1158. | /* end confdefs.h. */
  1159. |
  1160. |
  1161. | #undef inline
  1162. | #ifndef WIN32_LEAN_AND_MEAN
  1163. | #define WIN32_LEAN_AND_MEAN
  1164. | #endif
  1165. | #include <windows.h>
  1166. |
  1167. | int main (void)
  1168. | {
  1169. |
  1170. | #if defined(__CYGWIN__) || defined(__CEGCC__)
  1171. | HAVE_WINDOWS_H shall not be defined.
  1172. | #else
  1173. | int dummy=2*WINVER;
  1174. | #endif
  1175. |
  1176. | ;
  1177. | return 0;
  1178. | }
  1179. |
  1180. configure:18696: result: no
  1181. configure:18709: checking whether build target is a native Windows one
  1182. configure:18751: result: no
  1183. configure:19063: checking whether build target supports WIN32 file API
  1184. configure:19144: result: no
  1185. configure:19159: checking for good-to-use Mac CFLAGS
  1186. configure:19161: result: no
  1187. configure:19207: checking to see if the compiler supports __builtin_available()
  1188. configure:19225: /root/linux-i386/bin/linux-x86_64/tools/crosstools/i386-aros-gcc -c -m32 -march=i486 -DAROS_BUILD_TYPE=AROS_BUILD_TYPE_PERSONAL -DADEBUG=1 -DMDEBUG=1 -O0 -nix -Werror-implicit-function-declaration -Wno-system-headers -D__BSD_VISIBLE=1 conftest.c >&5
  1189. conftest.c: In function 'main':
  1190. conftest.c:30:7: error: implicit declaration of function '__builtin_available' [-Werror=implicit-function-declaration]
  1191. conftest.c:30:31: error: 'macOS' undeclared (first use in this function)
  1192. conftest.c:30:31: note: each undeclared identifier is reported only once for each function it appears in
  1193. conftest.c:30:37: error: expected ')' before numeric constant
  1194. cc1: some warnings being treated as errors
  1195. configure:19225: $? = 1
  1196. configure: failed program was:
  1197. | /* confdefs.h */
  1198. | #define PACKAGE_NAME "curl"
  1199. | #define PACKAGE_TARNAME "curl"
  1200. | #define PACKAGE_VERSION "-"
  1201. | #define PACKAGE_STRING "curl -"
  1202. | #define PACKAGE_BUGREPORT "a suitable curl mailing list: https://curl.haxx.se/mail/"
  1203. | #define PACKAGE_URL ""
  1204. | #define PACKAGE "curl"
  1205. | #define VERSION "-"
  1206. | #define OS "i386-pc-aros"
  1207. | #define STDC_HEADERS 1
  1208. | #define HAVE_SYS_TYPES_H 1
  1209. | #define HAVE_SYS_STAT_H 1
  1210. | #define HAVE_STDLIB_H 1
  1211. | #define HAVE_STRING_H 1
  1212. | #define HAVE_MEMORY_H 1
  1213. | #define HAVE_STRINGS_H 1
  1214. | #define HAVE_INTTYPES_H 1
  1215. | #define HAVE_STDINT_H 1
  1216. | #define HAVE_UNISTD_H 1
  1217. | #define LT_OBJDIR ".libs/"
  1218. | /* end confdefs.h. */
  1219. |
  1220. |
  1221. | #include <stdlib.h>
  1222. |
  1223. | int main (void)
  1224. | {
  1225. |
  1226. | if (__builtin_available(macOS 10.8, iOS 5.0, *)) {}
  1227. |
  1228. | ;
  1229. | return 0;
  1230. | }
  1231. |
  1232. configure:19237: result: no
  1233. configure:19244: checking whether to support http
  1234. configure:19271: result: yes
  1235. configure:19276: checking whether to support ftp
  1236. configure:19295: result: yes
  1237. configure:19300: checking whether to support file
  1238. configure:19319: result: yes
  1239. configure:19324: checking whether to support ldap
  1240. configure:19345: result: yes
  1241. configure:19350: checking whether to support ldaps
  1242. configure:19394: result: yes
  1243. configure:19406: checking whether to support rtsp
  1244. configure:19431: result: yes
  1245. configure:19442: checking whether to support proxies
  1246. configure:19461: result: yes
  1247. configure:19467: checking whether to support dict
  1248. configure:19486: result: yes
  1249. configure:19491: checking whether to support telnet
  1250. configure:19510: result: yes
  1251. configure:19515: checking whether to support tftp
  1252. configure:19534: result: yes
  1253. configure:19540: checking whether to support pop3
  1254. configure:19559: result: yes
  1255. configure:19566: checking whether to support imap
  1256. configure:19585: result: yes
  1257. configure:19592: checking whether to support smb
  1258. configure:19611: result: yes
  1259. configure:19617: checking whether to support smtp
  1260. configure:19636: result: yes
  1261. configure:19642: checking whether to support gopher
  1262. configure:19661: result: yes
  1263. configure:19669: checking for gethostbyname in bsdsocket.library
  1264. configure:19681: /root/linux-i386/bin/linux-x86_64/tools/crosstools/i386-aros-gcc -o conftest -m32 -march=i486 -DAROS_BUILD_TYPE=AROS_BUILD_TYPE_PERSONAL -DADEBUG=1 -DMDEBUG=1 -O0 -nix -Werror-implicit-function-declaration -Wno-system-headers -D__BSD_VISIBLE=1 -L/root/linux-i386/bin/linux-i386/AROS/Developer/lib -nix conftest.c >&5
  1265. configure:19681: $? = 0
  1266. configure:19682: result: yes
  1267. configure:19696: checking whether to provide built-in manual
  1268. configure:19711: result: yes
  1269. configure:19718: checking whether to enable generation of C code
  1270. configure:19736: result: yes
  1271. configure:19743: checking whether to use libgcc
  1272. configure:19758: result: no
  1273. configure:19765: checking if X/Open network library is required
  1274. configure:19785: /root/linux-i386/bin/linux-x86_64/tools/crosstools/i386-aros-gcc -c -m32 -march=i486 -DAROS_BUILD_TYPE=AROS_BUILD_TYPE_PERSONAL -DADEBUG=1 -DMDEBUG=1 -O0 -nix -Werror-implicit-function-declaration -Wno-system-headers -D__BSD_VISIBLE=1 conftest.c >&5
  1275. conftest.c: In function 'main':
  1276. conftest.c:33:3: error: unknown type name 'force'
  1277. conftest.c:33:21: error: expected '=', ',', ';', 'asm' or '__attribute__' before 'error'
  1278. conftest.c:35:1: error: expected declaration or statement at end of input
  1279. configure:19785: $? = 1
  1280. configure: failed program was:
  1281. | /* confdefs.h */
  1282. | #define PACKAGE_NAME "curl"
  1283. | #define PACKAGE_TARNAME "curl"
  1284. | #define PACKAGE_VERSION "-"
  1285. | #define PACKAGE_STRING "curl -"
  1286. | #define PACKAGE_BUGREPORT "a suitable curl mailing list: https://curl.haxx.se/mail/"
  1287. | #define PACKAGE_URL ""
  1288. | #define PACKAGE "curl"
  1289. | #define VERSION "-"
  1290. | #define OS "i386-pc-aros"
  1291. | #define STDC_HEADERS 1
  1292. | #define HAVE_SYS_TYPES_H 1
  1293. | #define HAVE_SYS_STAT_H 1
  1294. | #define HAVE_STDLIB_H 1
  1295. | #define HAVE_STRING_H 1
  1296. | #define HAVE_MEMORY_H 1
  1297. | #define HAVE_STRINGS_H 1
  1298. | #define HAVE_INTTYPES_H 1
  1299. | #define HAVE_STDINT_H 1
  1300. | #define HAVE_UNISTD_H 1
  1301. | #define LT_OBJDIR ".libs/"
  1302. | #define HAVE_LDAP_SSL 1
  1303. | /* end confdefs.h. */
  1304. |
  1305. |
  1306. | int main (void)
  1307. | {
  1308. | #if defined(__hpux) && defined(_XOPEN_SOURCE) && (_XOPEN_SOURCE >= 600)
  1309. | return 0;
  1310. | #elif defined(__hpux) && defined(_XOPEN_SOURCE_EXTENDED)
  1311. | return 0;
  1312. | #else
  1313. | force compilation error
  1314. | #endif
  1315. | }
  1316. |
  1317. |
  1318. configure:19792: result: no
  1319. configure:19796: checking for gethostbyname
  1320. configure:19796: /root/linux-i386/bin/linux-x86_64/tools/crosstools/i386-aros-gcc -o conftest -m32 -march=i486 -DAROS_BUILD_TYPE=AROS_BUILD_TYPE_PERSONAL -DADEBUG=1 -DMDEBUG=1 -O0 -nix -Werror-implicit-function-declaration -Wno-system-headers -D__BSD_VISIBLE=1 -L/root/linux-i386/bin/linux-i386/AROS/Developer/lib -nix conftest.c >&5
  1321. There are undefined symbols in 'conftest':
  1322. U gethostbyname
  1323. configure:19796: $? = 1
  1324. configure: failed program was:
  1325. | /* confdefs.h */
  1326. | #define PACKAGE_NAME "curl"
  1327. | #define PACKAGE_TARNAME "curl"
  1328. | #define PACKAGE_VERSION "-"
  1329. | #define PACKAGE_STRING "curl -"
  1330. | #define PACKAGE_BUGREPORT "a suitable curl mailing list: https://curl.haxx.se/mail/"
  1331. | #define PACKAGE_URL ""
  1332. | #define PACKAGE "curl"
  1333. | #define VERSION "-"
  1334. | #define OS "i386-pc-aros"
  1335. | #define STDC_HEADERS 1
  1336. | #define HAVE_SYS_TYPES_H 1
  1337. | #define HAVE_SYS_STAT_H 1
  1338. | #define HAVE_STDLIB_H 1
  1339. | #define HAVE_STRING_H 1
  1340. | #define HAVE_MEMORY_H 1
  1341. | #define HAVE_STRINGS_H 1
  1342. | #define HAVE_INTTYPES_H 1
  1343. | #define HAVE_STDINT_H 1
  1344. | #define HAVE_UNISTD_H 1
  1345. | #define LT_OBJDIR ".libs/"
  1346. | #define HAVE_LDAP_SSL 1
  1347. | /* end confdefs.h. */
  1348. |
  1349. | #define gethostbyname innocuous_gethostbyname
  1350. | #ifdef __STDC__
  1351. | # include <limits.h>
  1352. | #else
  1353. | # include <assert.h>
  1354. | #endif
  1355. | #undef gethostbyname
  1356. | #ifdef __cplusplus
  1357. | extern "C"
  1358. | #endif
  1359. | char gethostbyname ();
  1360. | #if defined __stub_gethostbyname || defined __stub___gethostbyname
  1361. | choke me
  1362. | #endif
  1363. |
  1364. | int main (void)
  1365. | {
  1366. | return gethostbyname ();
  1367. | ;
  1368. | return 0;
  1369. | }
  1370. configure:19796: result: no
  1371. configure:19801: checking for gethostbyname in -lnsl
  1372. configure:19823: /root/linux-i386/bin/linux-x86_64/tools/crosstools/i386-aros-gcc -o conftest -m32 -march=i486 -DAROS_BUILD_TYPE=AROS_BUILD_TYPE_PERSONAL -DADEBUG=1 -DMDEBUG=1 -O0 -nix -Werror-implicit-function-declaration -Wno-system-headers -D__BSD_VISIBLE=1 -L/root/linux-i386/bin/linux-i386/AROS/Developer/lib -nix conftest.c -lnsl >&5
  1373. /root/linux-i386/bin/linux-x86_64/tools/crosstools/i386-aros-ld: cannot find -lnsl
  1374. configure:19823: $? = 1
  1375. configure: failed program was:
  1376. | /* confdefs.h */
  1377. | #define PACKAGE_NAME "curl"
  1378. | #define PACKAGE_TARNAME "curl"
  1379. | #define PACKAGE_VERSION "-"
  1380. | #define PACKAGE_STRING "curl -"
  1381. | #define PACKAGE_BUGREPORT "a suitable curl mailing list: https://curl.haxx.se/mail/"
  1382. | #define PACKAGE_URL ""
  1383. | #define PACKAGE "curl"
  1384. | #define VERSION "-"
  1385. | #define OS "i386-pc-aros"
  1386. | #define STDC_HEADERS 1
  1387. | #define HAVE_SYS_TYPES_H 1
  1388. | #define HAVE_SYS_STAT_H 1
  1389. | #define HAVE_STDLIB_H 1
  1390. | #define HAVE_STRING_H 1
  1391. | #define HAVE_MEMORY_H 1
  1392. | #define HAVE_STRINGS_H 1
  1393. | #define HAVE_INTTYPES_H 1
  1394. | #define HAVE_STDINT_H 1
  1395. | #define HAVE_UNISTD_H 1
  1396. | #define LT_OBJDIR ".libs/"
  1397. | #define HAVE_LDAP_SSL 1
  1398. | /* end confdefs.h. */
  1399. |
  1400. |
  1401. | #ifdef __cplusplus
  1402. | extern "C"
  1403. | #endif
  1404. | char gethostbyname ();
  1405. | int main (void)
  1406. | {
  1407. | return gethostbyname ();
  1408. | ;
  1409. | return 0;
  1410. | }
  1411. configure:19832: result: no
  1412. configure:20222: checking for windows.h
  1413. configure:20264: result: no
  1414. configure:20277: checking for winsock.h
  1415. configure:20320: result: no
  1416. configure:20333: checking for winsock2.h
  1417. configure:20376: result: no
  1418. configure:20390: checking for connect in libraries
  1419. configure:20417: /root/linux-i386/bin/linux-x86_64/tools/crosstools/i386-aros-gcc -o conftest -m32 -march=i486 -DAROS_BUILD_TYPE=AROS_BUILD_TYPE_PERSONAL -DADEBUG=1 -DMDEBUG=1 -O0 -nix -Werror-implicit-function-declaration -Wno-system-headers -D__BSD_VISIBLE=1 -L/root/linux-i386/bin/linux-i386/AROS/Developer/lib -nix conftest.c >&5
  1420. There are undefined symbols in 'conftest':
  1421. U connect
  1422. configure:20417: $? = 1
  1423. configure: failed program was:
  1424. | /* confdefs.h */
  1425. | #define PACKAGE_NAME "curl"
  1426. | #define PACKAGE_TARNAME "curl"
  1427. | #define PACKAGE_VERSION "-"
  1428. | #define PACKAGE_STRING "curl -"
  1429. | #define PACKAGE_BUGREPORT "a suitable curl mailing list: https://curl.haxx.se/mail/"
  1430. | #define PACKAGE_URL ""
  1431. | #define PACKAGE "curl"
  1432. | #define VERSION "-"
  1433. | #define OS "i386-pc-aros"
  1434. | #define STDC_HEADERS 1
  1435. | #define HAVE_SYS_TYPES_H 1
  1436. | #define HAVE_SYS_STAT_H 1
  1437. | #define HAVE_STDLIB_H 1
  1438. | #define HAVE_STRING_H 1
  1439. | #define HAVE_MEMORY_H 1
  1440. | #define HAVE_STRINGS_H 1
  1441. | #define HAVE_INTTYPES_H 1
  1442. | #define HAVE_STDINT_H 1
  1443. | #define HAVE_UNISTD_H 1
  1444. | #define LT_OBJDIR ".libs/"
  1445. | #define HAVE_LDAP_SSL 1
  1446. | /* end confdefs.h. */
  1447. |
  1448. |
  1449. | /* includes start */
  1450. | #ifdef HAVE_WINDOWS_H
  1451. | # ifndef WIN32_LEAN_AND_MEAN
  1452. | # define WIN32_LEAN_AND_MEAN
  1453. | # endif
  1454. | # include <windows.h>
  1455. | # ifdef HAVE_WINSOCK2_H
  1456. | # include <winsock2.h>
  1457. | # else
  1458. | # ifdef HAVE_WINSOCK_H
  1459. | # include <winsock.h>
  1460. | # endif
  1461. | # endif
  1462. | #endif
  1463. | /* includes end */
  1464. | #ifndef HAVE_WINDOWS_H
  1465. | int connect(int, void*, int);
  1466. | #endif
  1467. |
  1468. | int main (void)
  1469. | {
  1470. |
  1471. | if(0 != connect(0, 0, 0))
  1472. | return 1;
  1473. |
  1474. | ;
  1475. | return 0;
  1476. | }
  1477. |
  1478. configure:20417: /root/linux-i386/bin/linux-x86_64/tools/crosstools/i386-aros-gcc -o conftest -m32 -march=i486 -DAROS_BUILD_TYPE=AROS_BUILD_TYPE_PERSONAL -DADEBUG=1 -DMDEBUG=1 -O0 -nix -Werror-implicit-function-declaration -Wno-system-headers -D__BSD_VISIBLE=1 -L/root/linux-i386/bin/linux-i386/AROS/Developer/lib -nix conftest.c -lsocket >&5
  1479. /root/linux-i386/bin/linux-x86_64/tools/crosstools/i386-aros-ld: cannot find -lsocket
  1480. configure:20417: $? = 1
  1481. configure: failed program was:
  1482. | /* confdefs.h */
  1483. | #define PACKAGE_NAME "curl"
  1484. | #define PACKAGE_TARNAME "curl"
  1485. | #define PACKAGE_VERSION "-"
  1486. | #define PACKAGE_STRING "curl -"
  1487. | #define PACKAGE_BUGREPORT "a suitable curl mailing list: https://curl.haxx.se/mail/"
  1488. | #define PACKAGE_URL ""
  1489. | #define PACKAGE "curl"
  1490. | #define VERSION "-"
  1491. | #define OS "i386-pc-aros"
  1492. | #define STDC_HEADERS 1
  1493. | #define HAVE_SYS_TYPES_H 1
  1494. | #define HAVE_SYS_STAT_H 1
  1495. | #define HAVE_STDLIB_H 1
  1496. | #define HAVE_STRING_H 1
  1497. | #define HAVE_MEMORY_H 1
  1498. | #define HAVE_STRINGS_H 1
  1499. | #define HAVE_INTTYPES_H 1
  1500. | #define HAVE_STDINT_H 1
  1501. | #define HAVE_UNISTD_H 1
  1502. | #define LT_OBJDIR ".libs/"
  1503. | #define HAVE_LDAP_SSL 1
  1504. | /* end confdefs.h. */
  1505. |
  1506. |
  1507. | /* includes start */
  1508. | #ifdef HAVE_WINDOWS_H
  1509. | # ifndef WIN32_LEAN_AND_MEAN
  1510. | # define WIN32_LEAN_AND_MEAN
  1511. | # endif
  1512. | # include <windows.h>
  1513. | # ifdef HAVE_WINSOCK2_H
  1514. | # include <winsock2.h>
  1515. | # else
  1516. | # ifdef HAVE_WINSOCK_H
  1517. | # include <winsock.h>
  1518. | # endif
  1519. | # endif
  1520. | #endif
  1521. | /* includes end */
  1522. | #ifndef HAVE_WINDOWS_H
  1523. | int connect(int, void*, int);
  1524. | #endif
  1525. |
  1526. | int main (void)
  1527. | {
  1528. |
  1529. | if(0 != connect(0, 0, 0))
  1530. | return 1;
  1531. |
  1532. | ;
  1533. | return 0;
  1534. | }
  1535. |
  1536. configure:20440: /root/linux-i386/bin/linux-x86_64/tools/crosstools/i386-aros-gcc -o conftest -m32 -march=i486 -DAROS_BUILD_TYPE=AROS_BUILD_TYPE_PERSONAL -DADEBUG=1 -DMDEBUG=1 -O0 -nix -Werror-implicit-function-declaration -Wno-system-headers -D__BSD_VISIBLE=1 -L/root/linux-i386/bin/linux-i386/AROS/Developer/lib -nix conftest.c -lssl >&5
  1537. conftest.c: In function 'main':
  1538. conftest.c:27:19: warning: 'struct sockaddr' declared inside parameter list [enabled by default]
  1539. /root/linux-i386/bin/linux-x86_64/tools/crosstools/i386-aros-ld: cannot find -lssl
  1540. configure:20440: $? = 1
  1541. configure: failed program was:
  1542. | /* confdefs.h */
  1543. | #define PACKAGE_NAME "curl"
  1544. | #define PACKAGE_TARNAME "curl"
  1545. | #define PACKAGE_VERSION "-"
  1546. | #define PACKAGE_STRING "curl -"
  1547. | #define PACKAGE_BUGREPORT "a suitable curl mailing list: https://curl.haxx.se/mail/"
  1548. | #define PACKAGE_URL ""
  1549. | #define PACKAGE "curl"
  1550. | #define VERSION "-"
  1551. | #define OS "i386-pc-aros"
  1552. | #define STDC_HEADERS 1
  1553. | #define HAVE_SYS_TYPES_H 1
  1554. | #define HAVE_SYS_STAT_H 1
  1555. | #define HAVE_STDLIB_H 1
  1556. | #define HAVE_STRING_H 1
  1557. | #define HAVE_MEMORY_H 1
  1558. | #define HAVE_STRINGS_H 1
  1559. | #define HAVE_INTTYPES_H 1
  1560. | #define HAVE_STDINT_H 1
  1561. | #define HAVE_UNISTD_H 1
  1562. | #define LT_OBJDIR ".libs/"
  1563. | #define HAVE_LDAP_SSL 1
  1564. | /* end confdefs.h. */
  1565. | #include <proto/bsdsocket.h>
  1566. | int main (void)
  1567. | {
  1568. | void *SocketBase; connect(0,0,0);
  1569. | ;
  1570. | return 0;
  1571. | }
  1572. configure:20449: result: cannot find connect
  1573. configure:20451: error: cannot find connect function in libraries.
  1574.  
  1575. ## ---------------- ##
  1576. ## Cache variables. ##
  1577. ## ---------------- ##
  1578.  
  1579. ac_cv_build=x86_64-pc-linux-gnu
  1580. ac_cv_c_compiler_gnu=yes
  1581. ac_cv_c_inline=inline
  1582. ac_cv_env_CC_set=set
  1583. ac_cv_env_CC_value=/root/linux-i386/bin/linux-x86_64/tools/crosstools/i386-aros-gcc
  1584. ac_cv_env_CFLAGS_set=set
  1585. ac_cv_env_CFLAGS_value='-m32 -march=i486 -DAROS_BUILD_TYPE=AROS_BUILD_TYPE_PERSONAL -g -DADEBUG=1 -DMDEBUG=1 -O0 -nix'
  1586. ac_cv_env_CPPFLAGS_set=set
  1587. ac_cv_env_CPPFLAGS_value=-D__BSD_VISIBLE=1
  1588. ac_cv_env_CPP_set=set
  1589. ac_cv_env_CPP_value='/root/linux-i386/bin/linux-x86_64/tools/crosstools/i386-aros-gcc -E'
  1590. ac_cv_env_LDFLAGS_set=set
  1591. ac_cv_env_LDFLAGS_value='-L/root/linux-i386/bin/linux-i386/AROS/Developer/lib -nix'
  1592. ac_cv_env_LIBS_set=
  1593. ac_cv_env_LIBS_value=
  1594. ac_cv_env_LT_SYS_LIBRARY_PATH_set=
  1595. ac_cv_env_LT_SYS_LIBRARY_PATH_value=
  1596. ac_cv_env_build_alias_set=set
  1597. ac_cv_env_build_alias_value=x86_64-linux
  1598. ac_cv_env_host_alias_set=set
  1599. ac_cv_env_host_alias_value=i386-aros
  1600. ac_cv_env_target_alias_set=set
  1601. ac_cv_env_target_alias_value=i386-aros
  1602. ac_cv_func_gethostbyname=no
  1603. ac_cv_header_dlfcn_h=no
  1604. ac_cv_header_inttypes_h=yes
  1605. ac_cv_header_memory_h=yes
  1606. ac_cv_header_stdc=yes
  1607. ac_cv_header_stdint_h=yes
  1608. ac_cv_header_stdlib_h=yes
  1609. ac_cv_header_string_h=yes
  1610. ac_cv_header_strings_h=yes
  1611. ac_cv_header_sys_stat_h=yes
  1612. ac_cv_header_sys_types_h=yes
  1613. ac_cv_header_unistd_h=yes
  1614. ac_cv_host=i386-pc-aros
  1615. ac_cv_lib_nsl_gethostbyname=no
  1616. ac_cv_objext=o
  1617. ac_cv_path_EGREP='/bin/grep -E'
  1618. ac_cv_path_FGREP='/bin/grep -F'
  1619. ac_cv_path_GREP=/bin/grep
  1620. ac_cv_path_SED=/bin/sed
  1621. ac_cv_path_install='/usr/bin/install -c'
  1622. ac_cv_path_lt_DD=/bin/dd
  1623. ac_cv_path_mkdir=/bin/mkdir
  1624. ac_cv_prog_AR=/root/linux-i386/bin/linux-x86_64/tools/crosstools/i386-aros-ar
  1625. ac_cv_prog_AWK=gawk
  1626. ac_cv_prog_CC=/root/linux-i386/bin/linux-x86_64/tools/crosstools/i386-aros-gcc
  1627. ac_cv_prog_CPP='/root/linux-i386/bin/linux-x86_64/tools/crosstools/i386-aros-gcc -E'
  1628. ac_cv_prog_OBJDUMP=i386-aros-objdump
  1629. ac_cv_prog_RANLIB=/root/linux-i386/bin/linux-x86_64/tools/crosstools/i386-aros-ranlib
  1630. ac_cv_prog_STRIP=/root/linux-i386/bin/linux-x86_64/tools/crosstools/i386-aros-strip
  1631. ac_cv_prog_ac_ct_MANIFEST_TOOL=mt
  1632. ac_cv_prog_cc_c89=
  1633. ac_cv_prog_cc_g=yes
  1634. ac_cv_prog_make_make_set=yes
  1635. ac_cv_sys_file_offset_bits=unknown
  1636. ac_cv_sys_large_files=unknown
  1637. ac_cv_sys_largefile_CC=no
  1638. am_cv_CC_dependencies_compiler_type=gcc3
  1639. am_cv_make_support_nested_variables=yes
  1640. am_cv_prog_cc_c_o=yes
  1641. curl_cv_def___GNUC__=4
  1642. curl_cv_have_def__COMPILER_VERSION=no
  1643. curl_cv_have_def__SGI_COMPILER_VERSION=no
  1644. curl_cv_have_def__WIN32=no
  1645. curl_cv_have_def___DECC=no
  1646. curl_cv_have_def___DECC_VER=no
  1647. curl_cv_have_def___GNUC__=yes
  1648. curl_cv_have_def___HP_cc=no
  1649. curl_cv_have_def___IBMC__=no
  1650. curl_cv_have_def___INTEL_COMPILER=no
  1651. curl_cv_have_def___LCC__=no
  1652. curl_cv_have_def___SUNPRO_C=no
  1653. curl_cv_have_def___TINYC__=no
  1654. curl_cv_have_def___WATCOMC__=no
  1655. curl_cv_have_def___clang__=no
  1656. curl_cv_have_def___sgi=no
  1657. curl_cv_header_winber_h=no
  1658. curl_cv_header_windows_h=no
  1659. curl_cv_header_winldap_h=no
  1660. curl_cv_header_winsock2_h=no
  1661. curl_cv_header_winsock_h=no
  1662. curl_cv_header_ws2tcpip_h=no
  1663. curl_cv_native_windows=no
  1664. lt_cv_ar_at_file=@
  1665. lt_cv_deplibs_check_method=unknown
  1666. lt_cv_file_magic_cmd='$MAGIC_CMD'
  1667. lt_cv_file_magic_test_file=
  1668. lt_cv_ld_reload_flag=-r
  1669. lt_cv_nm_interface='BSD nm'
  1670. lt_cv_objdir=.libs
  1671. lt_cv_path_LD=/root/linux-i386/bin/linux-x86_64/tools/i386-linux-aros-ld
  1672. lt_cv_path_NM='/root/linux-i386/bin/linux-x86_64/tools/crosstools/i386-aros-nm -B'
  1673. lt_cv_path_mainfest_tool=no
  1674. lt_cv_prog_compiler_c_o=yes
  1675. lt_cv_prog_compiler_pic='-fPIC -DPIC'
  1676. lt_cv_prog_compiler_pic_works=no
  1677. lt_cv_prog_compiler_rtti_exceptions=no
  1678. lt_cv_prog_compiler_static_works=no
  1679. lt_cv_prog_gnu_ld=yes
  1680. lt_cv_sharedlib_from_linklib_cmd='printf %s\n'
  1681. lt_cv_sys_global_symbol_pipe='sed -n -e '\''s/^.*[ ]\([ABCDGIRSTW][ABCDGIRSTW]*\)[ ][ ]*\([_A-Za-z][_A-Za-z0-9]*\)$/\1 \2 \2/p'\'' | sed '\''/ __gnu_lto/d'\'''
  1682. lt_cv_sys_global_symbol_to_c_name_address='sed -n -e '\''s/^: \(.*\) .*$/ {"\1", (void *) 0},/p'\'' -e '\''s/^[ABCDGIRSTW][ABCDGIRSTW]* .* \(.*\)$/ {"\1", (void *) \&\1},/p'\'''
  1683. lt_cv_sys_global_symbol_to_c_name_address_lib_prefix='sed -n -e '\''s/^: \(.*\) .*$/ {"\1", (void *) 0},/p'\'' -e '\''s/^[ABCDGIRSTW][ABCDGIRSTW]* .* \(lib.*\)$/ {"\1", (void *) \&\1},/p'\'' -e '\''s/^[ABCDGIRSTW][ABCDGIRSTW]* .* \(.*\)$/ {"lib\1", (void *) \&\1},/p'\'''
  1684. lt_cv_sys_global_symbol_to_cdecl='sed -n -e '\''s/^T .* \(.*\)$/extern int \1();/p'\'' -e '\''s/^[ABCDGIRSTW][ABCDGIRSTW]* .* \(.*\)$/extern char \1;/p'\'''
  1685. lt_cv_sys_global_symbol_to_import=
  1686. lt_cv_sys_max_cmd_len=1572864
  1687. lt_cv_to_host_file_cmd=func_convert_file_noop
  1688. lt_cv_to_tool_file_cmd=func_convert_file_noop
  1689. lt_cv_truncate_bin='/bin/dd bs=4096 count=1'
  1690.  
  1691. ## ----------------- ##
  1692. ## Output variables. ##
  1693. ## ----------------- ##
  1694.  
  1695.  
  1696.  
  1697.  
  1698.  
  1699.  
  1700.  
  1701.  
  1702.  
  1703.  
  1704.  
  1705.  
  1706.  
  1707.  
  1708. @echo "Need to reconfigure with --enable-code-coverage"
  1709. @echo "Need to reconfigure with --enable-code-coverage"
  1710. $(CODE_COVERAGE_IGNORE_PATTERN);
  1711. $(CODE_COVERAGE_OUTPUT_FILE);
  1712. #
  1713. #
  1714. # $(PACKAGE_NAME)-$(PACKAGE_VERSION)-coverage)
  1715. # $(PACKAGE_NAME)-$(PACKAGE_VERSION)-coverage.info)
  1716. # (Default: $(top_builddir))
  1717. # (Default: empty)
  1718. # Multiple directories may be specified, separated by whitespace.
  1719. # by lcov for code coverage. (Default:
  1720. # collecting lcov instance. (Default: $CODE_COVERAGE_LCOV_OPTIONS_GCOVPATH)
  1721. # genhtml instance. (Default: based on $CODE_COVERAGE_BRANCH_COVERAGE)
  1722. # instance. (Default: $CODE_COVERAGE_GENHTML_OPTIONS_DEFAULT)
  1723. # instance. (Default: $CODE_COVERAGE_LCOV_OPTIONS_DEFAULT)
  1724. # instance. (Default: $CODE_COVERAGE_LCOV_RMOPTS_DEFAULT)
  1725. # instances. (Default: $CODE_COVERAGE_LCOV_SHOPTS_DEFAULT)
  1726. # instances. (Default: based on $CODE_COVERAGE_BRANCH_COVERAGE)
  1727. # lcov instance. (Default: empty)
  1728. # reports to be created. (Default:
  1729. # set to 0 to disable it and leave empty to stay with the default.
  1730. # - CODE_COVERAGE_BRANCH_COVERAGE: Set to 1 to enforce branch coverage,
  1731. # - CODE_COVERAGE_DIRECTORY: Top-level directory for code coverage reporting.
  1732. # - CODE_COVERAGE_GENHTML_OPTIONS: Extra options to pass to the genhtml
  1733. # - CODE_COVERAGE_GENHTML_OPTIONS_DEFAULT: Extra options to pass to the
  1734. # - CODE_COVERAGE_IGNORE_PATTERN: Extra glob pattern of files to ignore
  1735. # - CODE_COVERAGE_LCOV_OPTIONS: Extra options to pass to the collecting lcov
  1736. # - CODE_COVERAGE_LCOV_OPTIONS_DEFAULT: Extra options to pass to the
  1737. # - CODE_COVERAGE_LCOV_OPTIONS_GCOVPATH: --gcov-tool pathtogcov
  1738. # - CODE_COVERAGE_LCOV_RMOPTS: Extra options to pass to the filtering lcov
  1739. # - CODE_COVERAGE_LCOV_RMOPTS_DEFAULT: Extra options to pass to the filtering
  1740. # - CODE_COVERAGE_LCOV_SHOPTS: Extra options to shared between both lcov
  1741. # - CODE_COVERAGE_LCOV_SHOPTS_DEFAULT: Extra options shared between both lcov
  1742. # - CODE_COVERAGE_OUTPUT_DIRECTORY: Directory for generated code coverage
  1743. # - CODE_COVERAGE_OUTPUT_FILE: Filename and path for the .info file generated
  1744. # $(PACKAGE_VERSION). In order to add the current git hash to the title,
  1745. # Capture code coverage data
  1746. # Code coverage
  1747. # Hook rule executed before code-coverage-capture, overridable by the user
  1748. # Optional variables
  1749. # Optional:
  1750. # The generated report will be titled using the $(PACKAGE_NAME) and
  1751. # Use recursive makes in order to ignore errors during check
  1752. # sanitizes the test-name: replaces with underscores: dashes and dots
  1753. # use the git-version-gen script, available online.
  1754. $(if $(CODE_COVERAGE_BRANCH_COVERAGE),\
  1755. '
  1756. --rc genhtml_branch_coverage=$(CODE_COVERAGE_BRANCH_COVERAGE))
  1757. --rc lcov_branch_coverage=$(CODE_COVERAGE_BRANCH_COVERAGE))
  1758. .PHONY: check-code-coverage code-coverage-capture code-coverage-capture-hook code-coverage-clean
  1759. ACLOCAL='${SHELL} /root/linux-i386/bin/linux-i386/gen/contrib/development/libs/curl/curl/missing aclocal-1.15'
  1760. AMDEPBACKSLASH='\'
  1761. AMDEP_FALSE='#'
  1762. AMDEP_TRUE=''
  1763. AMTAR='$${TAR-tar}'
  1764. AM_BACKSLASH='\'
  1765. AM_DEFAULT_V='$(AM_DEFAULT_VERBOSITY)'
  1766. AM_DEFAULT_VERBOSITY='0'
  1767. AM_DISTCHECK_CONFIGURE_FLAGS += --disable-code-coverage
  1768. AM_DISTCHECK_CONFIGURE_FLAGS ?=
  1769. AM_V='$(V)'
  1770. AR='/root/linux-i386/bin/linux-x86_64/tools/crosstools/i386-aros-ar'
  1771. AS='/root/linux-i386/bin/linux-x86_64/tools/crosstools/i386-aros-as'
  1772. AUTOCONF='${SHELL} /root/linux-i386/bin/linux-i386/gen/contrib/development/libs/curl/curl/missing autoconf'
  1773. AUTOHEADER='${SHELL} /root/linux-i386/bin/linux-i386/gen/contrib/development/libs/curl/curl/missing autoheader'
  1774. AUTOMAKE='${SHELL} /root/linux-i386/bin/linux-i386/gen/contrib/development/libs/curl/curl/missing automake-1.15'
  1775. AWK='gawk'
  1776. BLANK_AT_MAKETIME=''
  1777. BUILD_LIBHOSTNAME_FALSE=''
  1778. BUILD_LIBHOSTNAME_TRUE=''
  1779. BUILD_STUB_GSS_FALSE=''
  1780. BUILD_STUB_GSS_TRUE=''
  1781. BUILD_UNITTESTS_FALSE=''
  1782. BUILD_UNITTESTS_TRUE='#'
  1783. CC='/root/linux-i386/bin/linux-x86_64/tools/crosstools/i386-aros-gcc'
  1784. CCDEPMODE='depmode=gcc3'
  1785. CFLAGS='-m32 -march=i486 -DAROS_BUILD_TYPE=AROS_BUILD_TYPE_PERSONAL -DADEBUG=1 -DMDEBUG=1 -O0 -nix -Werror-implicit-function-declaration -Wno-system-headers'
  1786. CFLAG_CURL_SYMBOL_HIDING=''
  1787. CODE_COVERAGE_BRANCH_COVERAGE ?=
  1788. CODE_COVERAGE_CFLAGS=''
  1789. CODE_COVERAGE_CPPFLAGS=''
  1790. CODE_COVERAGE_CXXFLAGS=''
  1791. CODE_COVERAGE_DIRECTORY ?= $(top_builddir)
  1792. CODE_COVERAGE_ENABLED='no'
  1793. CODE_COVERAGE_ENABLED_FALSE=''
  1794. CODE_COVERAGE_ENABLED_TRUE='#'
  1795. CODE_COVERAGE_GENHTML_OPTIONS ?= $(CODE_COVERAGE_GENHTML_OPTIONS_DEFAULT)
  1796. CODE_COVERAGE_GENHTML_OPTIONS_DEFAULT ?=\
  1797. CODE_COVERAGE_IGNORE_PATTERN ?=
  1798. CODE_COVERAGE_LCOV_OPTIONS ?= $(CODE_COVERAGE_LCOV_OPTIONS_DEFAULT)
  1799. CODE_COVERAGE_LCOV_OPTIONS_DEFAULT ?= $(CODE_COVERAGE_LCOV_OPTIONS_GCOVPATH)
  1800. CODE_COVERAGE_LCOV_OPTIONS_GCOVPATH ?= --gcov-tool "$(GCOV)"
  1801. CODE_COVERAGE_LCOV_RMOPTS ?= $(CODE_COVERAGE_LCOV_RMOPTS_DEFAULT)
  1802. CODE_COVERAGE_LCOV_RMOPTS_DEFAULT ?=
  1803. CODE_COVERAGE_LCOV_SHOPTS ?= $(CODE_COVERAGE_LCOV_SHOPTS_DEFAULT)
  1804. CODE_COVERAGE_LCOV_SHOPTS_DEFAULT ?= $(if $(CODE_COVERAGE_BRANCH_COVERAGE),\
  1805. CODE_COVERAGE_LDFLAGS=''
  1806. CODE_COVERAGE_LIBS=''
  1807. CODE_COVERAGE_OUTPUT_DIRECTORY ?= $(PACKAGE_NAME)-$(PACKAGE_VERSION)-coverage
  1808. CODE_COVERAGE_OUTPUT_FILE ?= $(PACKAGE_NAME)-$(PACKAGE_VERSION)-coverage.info
  1809. CODE_COVERAGE_RULES='
  1810. CONFIGURE_OPTIONS='" '\''--prefix=/Developer'\'' '\''--target=i386-aros'\'' '\''--build=x86_64-linux'\'' '\''--host=i386-aros'\'' '\''--without-pic'\'' '\''--disable-nls'\'' '\''--without-x'\'' '\''--disable-shared'\'' '\''--without-random'\'' '\''--disable-threaded-resolver'\'' '\''--disable-ntlm-wb'\'' '\''--libdir=/root/linux-i386/bin/linux-i386/AROS/Developer/lib'\'' '\''build_alias=x86_64-linux'\'' '\''host_alias=i386-aros'\'' '\''target_alias=i386-aros'\'' '\''CC=/root/linux-i386/bin/linux-x86_64/tools/crosstools/i386-aros-gcc'\'' '\''CFLAGS=-m32 -march=i486 -DAROS_BUILD_TYPE=AROS_BUILD_TYPE_PERSONAL -g -DADEBUG=1 -DMDEBUG=1 -O0 -nix'\'' '\''LDFLAGS=-L/root/linux-i386/bin/linux-i386/AROS/Developer/lib -nix'\'' '\''CPPFLAGS=-D__BSD_VISIBLE=1'\'' '\''CPP=/root/linux-i386/bin/linux-x86_64/tools/crosstools/i386-aros-gcc -E'\''"'
  1811. CPP='/root/linux-i386/bin/linux-x86_64/tools/crosstools/i386-aros-gcc -E'
  1812. CPPFLAGS='-D__BSD_VISIBLE=1'
  1813. CPPFLAG_CURL_STATICLIB='-DCURL_STATICLIB'
  1814. CROSSCOMPILING_FALSE=''
  1815. CROSSCOMPILING_TRUE=''
  1816. CURLDEBUG_FALSE=''
  1817. CURLDEBUG_TRUE='#'
  1818. CURLVERSION='7.60.0'
  1819. CURL_CA_BUNDLE=''
  1820. CURL_CFLAG_EXTRAS=''
  1821. CURL_DISABLE_DICT=''
  1822. CURL_DISABLE_FILE=''
  1823. CURL_DISABLE_FTP=''
  1824. CURL_DISABLE_GOPHER=''
  1825. CURL_DISABLE_HTTP=''
  1826. CURL_DISABLE_IMAP=''
  1827. CURL_DISABLE_LDAP=''
  1828. CURL_DISABLE_LDAPS=''
  1829. CURL_DISABLE_POP3=''
  1830. CURL_DISABLE_PROXY=''
  1831. CURL_DISABLE_RTSP=''
  1832. CURL_DISABLE_SMB=''
  1833. CURL_DISABLE_SMTP=''
  1834. CURL_DISABLE_TELNET=''
  1835. CURL_DISABLE_TFTP=''
  1836. CURL_LT_SHLIB_USE_MIMPURE_TEXT_FALSE=''
  1837. CURL_LT_SHLIB_USE_MIMPURE_TEXT_TRUE='#'
  1838. CURL_LT_SHLIB_USE_NO_UNDEFINED_FALSE=''
  1839. CURL_LT_SHLIB_USE_NO_UNDEFINED_TRUE='#'
  1840. CURL_LT_SHLIB_USE_VERSIONED_SYMBOLS_FALSE=''
  1841. CURL_LT_SHLIB_USE_VERSIONED_SYMBOLS_TRUE=''
  1842. CURL_LT_SHLIB_USE_VERSION_INFO_FALSE=''
  1843. CURL_LT_SHLIB_USE_VERSION_INFO_TRUE='#'
  1844. CURL_LT_SHLIB_VERSIONED_FLAVOUR=''
  1845. CURL_NETWORK_AND_TIME_LIBS=''
  1846. CURL_NETWORK_LIBS=''
  1847. CURL_WITH_MULTI_SSL=''
  1848. CYGPATH_W='echo'
  1849. DEFAULT_SSL_BACKEND=''
  1850. DEFS=''
  1851. DEPDIR='.deps'
  1852. DLLTOOL='false'
  1853. DOING_CURL_SYMBOL_HIDING_FALSE=''
  1854. DOING_CURL_SYMBOL_HIDING_TRUE=''
  1855. DOING_NATIVE_WINDOWS_FALSE=''
  1856. DOING_NATIVE_WINDOWS_TRUE='#'
  1857. DSYMUTIL=''
  1858. DUMPBIN=''
  1859. ECHO_C=''
  1860. ECHO_N='-n'
  1861. ECHO_T=''
  1862. EGREP='/bin/grep -E'
  1863. ENABLE_SHARED=''
  1864. ENABLE_STATIC=''
  1865. EXEEXT=''
  1866. FGREP='/bin/grep -F'
  1867. GCOV=''
  1868. GENHTML=''
  1869. GITIGNOREFILES += $(CODE_COVERAGE_OUTPUT_FILE) $(CODE_COVERAGE_OUTPUT_DIRECTORY)
  1870. GITIGNOREFILES ?=
  1871. GREP='/bin/grep'
  1872. HAVE_BROTLI=''
  1873. HAVE_GNUTLS_SRP=''
  1874. HAVE_LDAP_SSL='1'
  1875. HAVE_LIBZ=''
  1876. HAVE_LIBZ_FALSE=''
  1877. HAVE_LIBZ_TRUE=''
  1878. HAVE_OPENSSL_SRP=''
  1879. IDN_ENABLED=''
  1880. INSTALL_DATA='${INSTALL} -m 644'
  1881. INSTALL_PROGRAM='${INSTALL}'
  1882. INSTALL_SCRIPT='${INSTALL}'
  1883. INSTALL_STRIP_PROGRAM='$(install_sh) -c -s'
  1884. IPV6_ENABLED=''
  1885. LCOV=''
  1886. LD='/root/linux-i386/bin/linux-x86_64/tools/i386-linux-aros-ld'
  1887. LDFLAGS='-L/root/linux-i386/bin/linux-i386/AROS/Developer/lib -nix'
  1888. LIBCURL_LIBS=''
  1889. LIBMETALINK_CPPFLAGS=''
  1890. LIBMETALINK_LDFLAGS=''
  1891. LIBMETALINK_LIBS=''
  1892. LIBOBJS=''
  1893. LIBS='-lssl '
  1894. LIBTOOL='$(SHELL) $(top_builddir)/libtool'
  1895. LIPO=''
  1896. LN_S='ln -s'
  1897. LTLIBOBJS=''
  1898. LT_SYS_LIBRARY_PATH=''
  1899. MAINT='#'
  1900. MAINTAINER_MODE_FALSE=''
  1901. MAINTAINER_MODE_TRUE='#'
  1902. MAKEINFO='${SHELL} /root/linux-i386/bin/linux-i386/gen/contrib/development/libs/curl/curl/missing makeinfo'
  1903. MANIFEST_TOOL=':'
  1904. MANOPT=''
  1905. MKDIR_P='/bin/mkdir -p'
  1906. NM='/root/linux-i386/bin/linux-x86_64/tools/crosstools/i386-aros-nm -B'
  1907. NMEDIT=''
  1908. NROFF=''
  1909. NSS_LIBS=''
  1910. OBJDUMP='i386-aros-objdump'
  1911. OBJEXT='o'
  1912. OTOOL64=''
  1913. OTOOL=''
  1914. PACKAGE='curl'
  1915. PACKAGE_BUGREPORT='a suitable curl mailing list: https://curl.haxx.se/mail/'
  1916. PACKAGE_NAME='curl'
  1917. PACKAGE_STRING='curl -'
  1918. PACKAGE_TARNAME='curl'
  1919. PACKAGE_URL=''
  1920. PACKAGE_VERSION='-'
  1921. PATH_SEPARATOR=':'
  1922. PERL=''
  1923. PKGADD_NAME='curl - a client that groks URLs'
  1924. PKGADD_PKG='HAXXcurl'
  1925. PKGADD_VENDOR='curl.haxx.se'
  1926. PKGCONFIG=''
  1927. RANDOM_FILE=''
  1928. RANLIB='/root/linux-i386/bin/linux-x86_64/tools/crosstools/i386-aros-ranlib'
  1929. REQUIRE_LIB_DEPS='yes'
  1930. SED='/bin/sed'
  1931. SET_MAKE=''
  1932. SHELL='/bin/bash'
  1933. SSL_BACKENDS=''
  1934. SSL_ENABLED=''
  1935. SSL_LIBS=''
  1936. STRIP='/root/linux-i386/bin/linux-x86_64/tools/crosstools/i386-aros-strip'
  1937. SUPPORT_FEATURES=''
  1938. SUPPORT_PROTOCOLS=''
  1939. USE_ARES=''
  1940. USE_AXTLS=''
  1941. USE_CPPFLAG_CURL_STATICLIB_FALSE='#'
  1942. USE_CPPFLAG_CURL_STATICLIB_TRUE=''
  1943. USE_CYASSL=''
  1944. USE_DARWINSSL=''
  1945. USE_EMBEDDED_ARES_FALSE=''
  1946. USE_EMBEDDED_ARES_TRUE=''
  1947. USE_EXPLICIT_LIB_DEPS_FALSE='#'
  1948. USE_EXPLICIT_LIB_DEPS_TRUE=''
  1949. USE_GNUTLS=''
  1950. USE_GNUTLS_NETTLE=''
  1951. USE_LIBPSL_FALSE=''
  1952. USE_LIBPSL_TRUE=''
  1953. USE_LIBRTMP=''
  1954. USE_LIBSSH2=''
  1955. USE_LIBSSH=''
  1956. USE_MANUAL_FALSE=''
  1957. USE_MANUAL_TRUE=''
  1958. USE_MBEDTLS=''
  1959. USE_NGHTTP2=''
  1960. USE_NSS=''
  1961. USE_OPENLDAP=''
  1962. USE_POLARSSL=''
  1963. USE_SCHANNEL=''
  1964. USE_UNIX_SOCKETS=''
  1965. USE_WINDOWS_SSPI=''
  1966. VERSION='-'
  1967. VERSIONNUM='073c00'
  1968. ZLIB_LIBS=''
  1969. ZSH_FUNCTIONS_DIR=''
  1970. ac_ct_AR=''
  1971. ac_ct_CC=''
  1972. ac_ct_DUMPBIN=''
  1973. am__EXEEXT_FALSE=''
  1974. am__EXEEXT_TRUE=''
  1975. am__fastdepCC_FALSE='#'
  1976. am__fastdepCC_TRUE=''
  1977. am__include='include'
  1978. am__isrc=''
  1979. am__leading_dot='.'
  1980. am__nodep='_no'
  1981. am__quote=''
  1982. am__tar='$${TAR-tar} chof - "$$tardir"'
  1983. am__untar='$${TAR-tar} xf -'
  1984. bindir='${exec_prefix}/bin'
  1985. build='x86_64-pc-linux-gnu'
  1986. build_alias='x86_64-linux'
  1987. build_cpu='x86_64'
  1988. build_os='linux-gnu'
  1989. build_vendor='pc'
  1990. check-code-coverage:
  1991. code-coverage-capture-hook:
  1992. code-coverage-capture: code-coverage-capture-hook
  1993. code_coverage_quiet = $(code_coverage_quiet_$(V))
  1994. code_coverage_quiet_ = $(code_coverage_quiet_$(AM_DEFAULT_VERBOSITY))
  1995. code_coverage_quiet_0 = --quiet
  1996. code_coverage_sanitize = $(subst -,_,$(subst .,_,$(1)))
  1997. code_coverage_v_genhtml = $(code_coverage_v_genhtml_$(V))
  1998. code_coverage_v_genhtml_ = $(code_coverage_v_genhtml_$(AM_DEFAULT_VERBOSITY))
  1999. code_coverage_v_genhtml_0 = @echo " GEN " $(CODE_COVERAGE_OUTPUT_DIRECTORY);
  2000. code_coverage_v_lcov_cap = $(code_coverage_v_lcov_cap_$(V))
  2001. code_coverage_v_lcov_cap_ = $(code_coverage_v_lcov_cap_$(AM_DEFAULT_VERBOSITY))
  2002. code_coverage_v_lcov_cap_0 = @echo " LCOV --capture"\
  2003. code_coverage_v_lcov_ign = $(code_coverage_v_lcov_ign_$(V))
  2004. code_coverage_v_lcov_ign_ = $(code_coverage_v_lcov_ign_$(AM_DEFAULT_VERBOSITY))
  2005. code_coverage_v_lcov_ign_0 = @echo " LCOV --remove /tmp/*"\
  2006. datadir='${datarootdir}'
  2007. datarootdir='${prefix}/share'
  2008. docdir='${datarootdir}/doc/${PACKAGE_TARNAME}'
  2009. dvidir='${docdir}'
  2010. exec_prefix='NONE'
  2011. host='i386-pc-aros'
  2012. host_alias='i386-aros'
  2013. host_cpu='i386'
  2014. host_os='aros'
  2015. host_vendor='pc'
  2016. htmldir='${docdir}'
  2017. includedir='${prefix}/include'
  2018. infodir='${datarootdir}/info'
  2019. install_sh='${SHELL} /root/linux-i386/bin/linux-i386/gen/contrib/development/libs/curl/curl/install-sh'
  2020. libdir='/root/linux-i386/bin/linux-i386/AROS/Developer/lib'
  2021. libexecdir='${exec_prefix}/libexec'
  2022. libext='a'
  2023. localedir='${datarootdir}/locale'
  2024. localstatedir='${prefix}/var'
  2025. mandir='${datarootdir}/man'
  2026. mkdir_p='$(MKDIR_P)'
  2027. oldincludedir='/usr/include'
  2028. pdfdir='${docdir}'
  2029. prefix='/Developer'
  2030. program_transform_name='s,x,x,'
  2031. psdir='${docdir}'
  2032. sbindir='${exec_prefix}/sbin'
  2033. sharedstatedir='${prefix}/com'
  2034. subdirs=''
  2035. sysconfdir='${prefix}/etc'
  2036. target_alias='i386-aros'
  2037.  
  2038. ## ----------- ##
  2039. ## confdefs.h. ##
  2040. ## ----------- ##
  2041.  
  2042. /* confdefs.h */
  2043. #define PACKAGE_NAME "curl"
  2044. #define PACKAGE_TARNAME "curl"
  2045. #define PACKAGE_VERSION "-"
  2046. #define PACKAGE_STRING "curl -"
  2047. #define PACKAGE_BUGREPORT "a suitable curl mailing list: https://curl.haxx.se/mail/"
  2048. #define PACKAGE_URL ""
  2049. #define PACKAGE "curl"
  2050. #define VERSION "-"
  2051. #define OS "i386-pc-aros"
  2052. #define STDC_HEADERS 1
  2053. #define HAVE_SYS_TYPES_H 1
  2054. #define HAVE_SYS_STAT_H 1
  2055. #define HAVE_STDLIB_H 1
  2056. #define HAVE_STRING_H 1
  2057. #define HAVE_MEMORY_H 1
  2058. #define HAVE_STRINGS_H 1
  2059. #define HAVE_INTTYPES_H 1
  2060. #define HAVE_STDINT_H 1
  2061. #define HAVE_UNISTD_H 1
  2062. #define LT_OBJDIR ".libs/"
  2063. #define HAVE_LDAP_SSL 1
  2064.  
  2065. configure: exit 1
Advertisement
Add Comment
Please, Sign In to add comment