Advertisement
Suubi7

TRUNK-5208 ERROR LOG

Feb 19th, 2021
74
0
Never
Not a member of Pastebin yet? Sign Up, it unlocks many cool features!
text 75.17 KB | None | 0 0
  1.  
  2. C:\Users\Suubi-Joshua>cd trunk-4168
  3. The system cannot find the path specified.
  4.  
  5. C:\Users\Suubi-Joshua>cd trunk-4618
  6. The system cannot find the path specified.
  7.  
  8. C:\Users\Suubi-Joshua>cd trunk-4681
  9.  
  10. C:\Users\Suubi-Joshua\TRUNK-4681>cd openmrs-core
  11.  
  12. C:\Users\Suubi-Joshua\TRUNK-4681\openmrs-core>git status
  13. On branch TRUNK-5208
  14. Untracked files:
  15. (use "git add <file>..." to include in what will be committed)
  16. openmrs-core/
  17.  
  18. nothing added to commit but untracked files present (use "git add" to track)
  19.  
  20. C:\Users\Suubi-Joshua\TRUNK-4681\openmrs-core>git branch
  21. TRUNK-4681
  22. * TRUNK-5208
  23. delete
  24. master
  25.  
  26. C:\Users\Suubi-Joshua\TRUNK-4681\openmrs-core>git add .
  27. warning: adding embedded git repository: openmrs-core
  28. hint: You've added another git repository inside your current repository.
  29. hint: Clones of the outer repository will not contain the contents of
  30. hint: the embedded repository and will not know how to obtain it.
  31. hint: If you meant to add a submodule, use:
  32. hint:
  33. hint: git submodule add <url> openmrs-core
  34. hint:
  35. hint: If you added this path by mistake, you can remove it from the
  36. hint: index with:
  37. hint:
  38. hint: git rm --cached openmrs-core
  39. hint:
  40. hint: See "git help submodule" for more information.
  41.  
  42. C:\Users\Suubi-Joshua\TRUNK-4681\openmrs-core>git --cached openmrs-core
  43. unknown option: --cached
  44. usage: git [--version] [--help] [-C <path>] [-c <name>=<value>]
  45. [--exec-path[=<path>]] [--html-path] [--man-path] [--info-path]
  46. [-p | --paginate | -P | --no-pager] [--no-replace-objects] [--bare]
  47. [--git-dir=<path>] [--work-tree=<path>] [--namespace=<name>]
  48. <command> [<args>]
  49.  
  50. C:\Users\Suubi-Joshua\TRUNK-4681\openmrs-core>git rm --cached openmrs-core
  51. error: the following file has staged content different from both the
  52. file and the HEAD:
  53. openmrs-core
  54. (use -f to force removal)
  55.  
  56. C:\Users\Suubi-Joshua\TRUNK-4681\openmrs-core>git rm --cached openmrs-core -f
  57. rm 'openmrs-core'
  58.  
  59. C:\Users\Suubi-Joshua\TRUNK-4681\openmrs-core>git status
  60. On branch TRUNK-5208
  61. Changes to be committed:
  62. (use "git restore --staged <file>..." to unstage)
  63. modified: api/src/test/java/org/openmrs/module/ModuleUtilIT.java
  64. modified: api/src/test/java/org/openmrs/module/ModuleUtilTest.java
  65.  
  66. Untracked files:
  67. (use "git add <file>..." to include in what will be committed)
  68. openmrs-core/
  69.  
  70.  
  71. C:\Users\Suubi-Joshua\TRUNK-4681\openmrs-core>git add .
  72. warning: adding embedded git repository: openmrs-core
  73. hint: You've added another git repository inside your current repository.
  74. hint: Clones of the outer repository will not contain the contents of
  75. hint: the embedded repository and will not know how to obtain it.
  76. hint: If you meant to add a submodule, use:
  77. hint:
  78. hint: git submodule add <url> openmrs-core
  79. hint:
  80. hint: If you added this path by mistake, you can remove it from the
  81. hint: index with:
  82. hint:
  83. hint: git rm --cached openmrs-core
  84. hint:
  85. hint: See "git help submodule" for more information.
  86.  
  87. C:\Users\Suubi-Joshua\TRUNK-4681\openmrs-core>git status
  88. On branch TRUNK-5208
  89. Changes to be committed:
  90. (use "git restore --staged <file>..." to unstage)
  91. modified: api/src/test/java/org/openmrs/module/ModuleUtilIT.java
  92. modified: api/src/test/java/org/openmrs/module/ModuleUtilTest.java
  93. new file: openmrs-core
  94.  
  95.  
  96. C:\Users\Suubi-Joshua\TRUNK-4681\openmrs-core>git checkout master
  97. Switched to branch 'master'
  98. M api/src/test/java/org/openmrs/module/ModuleUtilIT.java
  99. M api/src/test/java/org/openmrs/module/ModuleUtilTest.java
  100. A openmrs-core
  101. Your branch is ahead of 'origin/master' by 3 commits.
  102. (use "git push" to publish your local commits)
  103.  
  104. C:\Users\Suubi-Joshua\TRUNK-4681\openmrs-core>git branch
  105. TRUNK-4681
  106. TRUNK-5208
  107. delete
  108. * master
  109.  
  110. C:\Users\Suubi-Joshua\TRUNK-4681\openmrs-core>git branch -d Ttunk-5208
  111. error: branch 'Ttunk-5208' not found.
  112.  
  113. C:\Users\Suubi-Joshua\TRUNK-4681\openmrs-core>git branch -d TRUNK-5208
  114. Deleted branch TRUNK-5208 (was f16846a6b).
  115.  
  116. C:\Users\Suubi-Joshua\TRUNK-4681\openmrs-core>git branch -d delete
  117. Deleted branch delete (was f16846a6b).
  118.  
  119. C:\Users\Suubi-Joshua\TRUNK-4681\openmrs-core>git branch
  120. TRUNK-4681
  121. * master
  122.  
  123. C:\Users\Suubi-Joshua\TRUNK-4681\openmrs-core>git status
  124. On branch master
  125. Your branch is ahead of 'origin/master' by 3 commits.
  126. (use "git push" to publish your local commits)
  127.  
  128. Changes to be committed:
  129. (use "git restore --staged <file>..." to unstage)
  130. modified: api/src/test/java/org/openmrs/module/ModuleUtilIT.java
  131. modified: api/src/test/java/org/openmrs/module/ModuleUtilTest.java
  132. new file: openmrs-core
  133.  
  134.  
  135. C:\Users\Suubi-Joshua\TRUNK-4681\openmrs-core>git restore --staged
  136. fatal: you must specify path(s) to restore
  137.  
  138. C:\Users\Suubi-Joshua\TRUNK-4681\openmrs-core>git checkout TRUNK-5208
  139. error: pathspec 'TRUNK-5208' did not match any file(s) known to git
  140.  
  141. C:\Users\Suubi-Joshua\TRUNK-4681\openmrs-core>git branch TRUNK-5208
  142.  
  143. C:\Users\Suubi-Joshua\TRUNK-4681\openmrs-core>git checkout TRUNK-5208
  144. Switched to branch 'TRUNK-5208'
  145. M api/src/test/java/org/openmrs/module/ModuleUtilIT.java
  146. M api/src/test/java/org/openmrs/module/ModuleUtilTest.java
  147. A openmrs-core
  148.  
  149. C:\Users\Suubi-Joshua\TRUNK-4681\openmrs-core>GIT STATUS
  150. fatal: cannot handle STATUS as a builtin
  151.  
  152. C:\Users\Suubi-Joshua\TRUNK-4681\openmrs-core>git status
  153. On branch TRUNK-5208
  154. Changes to be committed:
  155. (use "git restore --staged <file>..." to unstage)
  156. modified: api/src/test/java/org/openmrs/module/ModuleUtilIT.java
  157. modified: api/src/test/java/org/openmrs/module/ModuleUtilTest.java
  158. new file: openmrs-core
  159.  
  160.  
  161. C:\Users\Suubi-Joshua\TRUNK-4681\openmrs-core>git add .
  162.  
  163. C:\Users\Suubi-Joshua\TRUNK-4681\openmrs-core>git status
  164. On branch TRUNK-5208
  165. Changes to be committed:
  166. (use "git restore --staged <file>..." to unstage)
  167. modified: api/src/test/java/org/openmrs/module/ModuleUtilIT.java
  168. modified: api/src/test/java/org/openmrs/module/ModuleUtilTest.java
  169. new file: openmrs-core
  170.  
  171.  
  172. C:\Users\Suubi-Joshua\TRUNK-4681\openmrs-core>mvn clean package
  173. Java HotSpot(TM) 64-Bit Server VM warning: ignoring option MaxPermSize=512m; support was removed in 8.0
  174. [INFO] Scanning for projects...
  175. Downloading from openmrs-repo: http://mavenrepo.openmrs.org/nexus/content/repositories/public/javax/annotation/javax.annotation-api/maven-metadata.xml
  176. Downloading from openmrs-bintray-repo: https://dl.bintray.com/openmrs/maven/javax/annotation/javax.annotation-api/maven-metadata.xml
  177. Downloaded from openmrs-repo: http://mavenrepo.openmrs.org/nexus/content/repositories/public/javax/annotation/javax.annotation-api/maven-metadata.xml (612 B at 129 B/s)
  178. [INFO] ------------------------------------------------------------------------
  179. [INFO] Reactor Build Order:
  180. [INFO]
  181. [INFO] OpenMRS [pom]
  182. [INFO] openmrs-tools [jar]
  183. [INFO] openmrs-test [pom]
  184. [INFO] openmrs-api [jar]
  185. [INFO] openmrs-web [jar]
  186. [INFO] openmrs-webapp [war]
  187. [INFO] openmrs-liquibase [jar]
  188. [INFO]
  189. [INFO] ------------------------< org.openmrs:openmrs >-------------------------
  190. [INFO] Building OpenMRS 2.5.0-SNAPSHOT [1/7]
  191. [INFO] --------------------------------[ pom ]---------------------------------
  192. [INFO]
  193. [INFO] --- maven-clean-plugin:2.5:clean (default-clean) @ openmrs ---
  194. [INFO] Deleting C:\Users\Suubi-Joshua\TRUNK-4681\openmrs-core\target
  195. [INFO]
  196. [INFO] --- buildnumber-maven-plugin:1.4:create (default) @ openmrs ---
  197. [INFO] ShortRevision tag detected. The value is '6'.
  198. [INFO] Executing: cmd.exe /X /C "git rev-parse --verify --short=6 HEAD"
  199. [INFO] Working directory: C:\Users\Suubi-Joshua\TRUNK-4681\openmrs-core
  200. [INFO] Storing buildNumber: f16846 at timestamp: 1613722827043
  201. [INFO] Storing buildScmBranch: TRUNK-5208
  202. [INFO]
  203. [INFO] --- build-helper-maven-plugin:3.2.0:parse-version (parse-version) @ openmrs ---
  204. [INFO]
  205. [INFO] --- maven-jar-plugin:3.2.0:test-jar (default) @ openmrs ---
  206. [WARNING] JAR will be empty - no content was marked for inclusion!
  207. [INFO] Building jar: C:\Users\Suubi-Joshua\TRUNK-4681\openmrs-core\target\openmrs-2.5.0-SNAPSHOT-tests.jar
  208. [INFO]
  209. [INFO] ------------------< org.openmrs.tools:openmrs-tools >-------------------
  210. [INFO] Building openmrs-tools 2.5.0-SNAPSHOT [2/7]
  211. [INFO] --------------------------------[ jar ]---------------------------------
  212. [INFO]
  213. [INFO] --- maven-clean-plugin:2.5:clean (default-clean) @ openmrs-tools ---
  214. [INFO] Deleting C:\Users\Suubi-Joshua\TRUNK-4681\openmrs-core\tools\target
  215. [INFO]
  216. [INFO] --- buildnumber-maven-plugin:1.4:create (default) @ openmrs-tools ---
  217. [INFO]
  218. [INFO] --- build-helper-maven-plugin:3.2.0:parse-version (parse-version) @ openmrs-tools ---
  219. [INFO]
  220. [INFO] --- maven-resources-plugin:3.2.0:resources (default-resources) @ openmrs-tools ---
  221. [INFO] Using 'UTF-8' encoding to copy filtered resources.
  222. [INFO] Using 'UTF-8' encoding to copy filtered properties files.
  223. [INFO] Copying 4 resources
  224. [INFO]
  225. [INFO] --- maven-compiler-plugin:3.8.1:compile (default-compile) @ openmrs-tools ---
  226. [INFO] No sources to compile
  227. [INFO]
  228. [INFO] --- maven-resources-plugin:3.2.0:testResources (default-testResources) @ openmrs-tools ---
  229. [INFO] Using 'UTF-8' encoding to copy filtered resources.
  230. [INFO] Using 'UTF-8' encoding to copy filtered properties files.
  231. [INFO] skip non existing resourceDirectory C:\Users\Suubi-Joshua\TRUNK-4681\openmrs-core\tools\src\test\resources
  232. [INFO]
  233. [INFO] --- maven-compiler-plugin:3.8.1:testCompile (default-testCompile) @ openmrs-tools ---
  234. [INFO] No sources to compile
  235. [INFO]
  236. [INFO] --- maven-surefire-plugin:2.22.2:test (default-test) @ openmrs-tools ---
  237. [INFO] No tests to run.
  238. [INFO]
  239. [INFO] --- maven-jar-plugin:3.2.0:jar (default-jar) @ openmrs-tools ---
  240. [INFO] Building jar: C:\Users\Suubi-Joshua\TRUNK-4681\openmrs-core\tools\target\openmrs-tools-2.5.0-SNAPSHOT.jar
  241. [INFO]
  242. [INFO] --- maven-jar-plugin:3.2.0:test-jar (default) @ openmrs-tools ---
  243. [WARNING] JAR will be empty - no content was marked for inclusion!
  244. [INFO] Building jar: C:\Users\Suubi-Joshua\TRUNK-4681\openmrs-core\tools\target\openmrs-tools-2.5.0-SNAPSHOT-tests.jar
  245. [INFO]
  246. [INFO] -------------------< org.openmrs.test:openmrs-test >--------------------
  247. [INFO] Building openmrs-test 2.5.0-SNAPSHOT [3/7]
  248. [INFO] --------------------------------[ pom ]---------------------------------
  249. [INFO]
  250. [INFO] --- maven-clean-plugin:2.5:clean (default-clean) @ openmrs-test ---
  251. [INFO] Deleting C:\Users\Suubi-Joshua\TRUNK-4681\openmrs-core\test\target
  252. [INFO]
  253. [INFO] --- buildnumber-maven-plugin:1.4:create (default) @ openmrs-test ---
  254. [INFO]
  255. [INFO] --- build-helper-maven-plugin:3.2.0:parse-version (parse-version) @ openmrs-test ---
  256. [INFO]
  257. [INFO] --- maven-jar-plugin:3.2.0:test-jar (default) @ openmrs-test ---
  258. [WARNING] JAR will be empty - no content was marked for inclusion!
  259. [INFO] Building jar: C:\Users\Suubi-Joshua\TRUNK-4681\openmrs-core\test\target\openmrs-test-2.5.0-SNAPSHOT-tests.jar
  260. [INFO]
  261. [INFO] --------------------< org.openmrs.api:openmrs-api >---------------------
  262. [INFO] Building openmrs-api 2.5.0-SNAPSHOT [4/7]
  263. [INFO] --------------------------------[ jar ]---------------------------------
  264. [INFO]
  265. [INFO] --- maven-clean-plugin:2.5:clean (default-clean) @ openmrs-api ---
  266. [INFO] Deleting C:\Users\Suubi-Joshua\TRUNK-4681\openmrs-core\api\target
  267. [INFO]
  268. [INFO] --- buildnumber-maven-plugin:1.4:create (default) @ openmrs-api ---
  269. [INFO]
  270. [INFO] --- build-helper-maven-plugin:3.2.0:parse-version (parse-version) @ openmrs-api ---
  271. [INFO]
  272. [INFO] --- jacoco-maven-plugin:0.8.6:prepare-agent (prepare-agent) @ openmrs-api ---
  273. [INFO] argLine set to -javaagent:C:\\Users\\Suubi-Joshua\\.m2\\repository\\org\\jacoco\\org.jacoco.agent\\0.8.6\\org.jacoco.agent-0.8.6-runtime.jar=destfile=C:\\Users\\Suubi-Joshua\\TRUNK-4681\\openmrs-core\\api\\target\\jacoco.exec,includes=org/openmrs/** -Duser.language=en -Duser.region=US -Xmx2g -Djava.locale.providers=COMPAT
  274. [INFO]
  275. [INFO] --- maven-java-formatter-plugin:0.3:format (default) @ openmrs-api ---
  276. [INFO] Using 'UTF-8' encoding to format source files.
  277. [INFO] Number of files to be formatted: 1083
  278. [INFO] Successfully formatted: 0 file(s)
  279. [INFO] Fail to format : 0 file(s)
  280. [INFO] Skipped : 1083 file(s)
  281. [INFO] Approximate time taken: 13s
  282. [INFO]
  283. [INFO] --- maven-resources-plugin:3.2.0:resources (default-resources) @ openmrs-api ---
  284. [INFO] Using 'UTF-8' encoding to copy filtered resources.
  285. [INFO] Using 'UTF-8' encoding to copy filtered properties files.
  286. [INFO] Copying 1 resource
  287. [INFO] Copying 149 resources
  288. [INFO] The encoding used to copy filtered properties files have not been set. This means that the same encoding will be used to copy filtered properties files as when copying other filtered resources. This might not be what you want! Run your build with --debug to see which files might be affected. Read more at https://maven.apache.org/plugins/maven-resources-plugin/examples/filtering-properties-files.html
  289. [INFO]
  290. [INFO] --- maven-compiler-plugin:3.8.1:compile (default-compile) @ openmrs-api ---
  291. [INFO] Changes detected - recompiling the module!
  292. [INFO] Compiling 724 source files to C:\Users\Suubi-Joshua\TRUNK-4681\openmrs-core\api\target\classes
  293. [INFO] /C:/Users/Suubi-Joshua/TRUNK-4681/openmrs-core/api/src/main/java/org/openmrs/PersonAttribute.java: Some input files use or override a deprecated API.
  294. [INFO] /C:/Users/Suubi-Joshua/TRUNK-4681/openmrs-core/api/src/main/java/org/openmrs/PersonAttribute.java: Recompile with -Xlint:deprecation for details.
  295. [INFO] /C:/Users/Suubi-Joshua/TRUNK-4681/openmrs-core/api/src/main/java/org/openmrs/BaseCustomizableMetadata.java: Some input files use unchecked or unsafe operations.
  296. [INFO] /C:/Users/Suubi-Joshua/TRUNK-4681/openmrs-core/api/src/main/java/org/openmrs/BaseCustomizableMetadata.java: Recompile with -Xlint:unchecked for details.
  297. [INFO]
  298. [INFO] --- maven-resources-plugin:3.2.0:testResources (default-testResources) @ openmrs-api ---
  299. [INFO] Using 'UTF-8' encoding to copy filtered resources.
  300. [INFO] Using 'UTF-8' encoding to copy filtered properties files.
  301. [INFO] Copying 147 resources
  302. [INFO]
  303. [INFO] --- maven-compiler-plugin:3.8.1:testCompile (default-testCompile) @ openmrs-api ---
  304. [INFO] Changes detected - recompiling the module!
  305. [INFO] Compiling 359 source files to C:\Users\Suubi-Joshua\TRUNK-4681\openmrs-core\api\target\test-classes
  306. [INFO] /C:/Users/Suubi-Joshua/TRUNK-4681/openmrs-core/api/src/test/java/org/openmrs/test/jupiter/BaseContextSensitiveTest.java: Some input files use or override a deprecated API.
  307. [INFO] /C:/Users/Suubi-Joshua/TRUNK-4681/openmrs-core/api/src/test/java/org/openmrs/test/jupiter/BaseContextSensitiveTest.java: Recompile with -Xlint:deprecation for details.
  308. [INFO] /C:/Users/Suubi-Joshua/TRUNK-4681/openmrs-core/api/src/test/java/org/openmrs/api/db/hibernate/PersonAttributeHelper.java: Some input files use unchecked or unsafe operations.
  309. [INFO] /C:/Users/Suubi-Joshua/TRUNK-4681/openmrs-core/api/src/test/java/org/openmrs/api/db/hibernate/PersonAttributeHelper.java: Recompile with -Xlint:unchecked for details.
  310. [INFO]
  311. [INFO] --- maven-surefire-plugin:2.22.2:test (default-test) @ openmrs-api ---
  312. [INFO]
  313. [INFO] -------------------------------------------------------
  314. [INFO] T E S T S
  315. [INFO] -------------------------------------------------------
  316. [INFO] Running liquibase.ext.change.core.InsertWithUuidDataChangeTest
  317. [INFO] Tests run: 2, Failures: 0, Errors: 0, Skipped: 0, Time elapsed: 0.606 s - in liquibase.ext.change.core.InsertWithUuidDataChangeTest
  318. [INFO] Running liquibase.ext.datatype.core.MySQLBooleanTypeTest
  319. [INFO] Tests run: 3, Failures: 0, Errors: 0, Skipped: 0, Time elapsed: 0.942 s - in liquibase.ext.datatype.core.MySQLBooleanTypeTest
  320. [INFO] Running liquibase.ext.sqlgenerator.core.ModifyColumnChangeTest
  321. [INFO] Tests run: 2, Failures: 0, Errors: 0, Skipped: 0, Time elapsed: 0.055 s - in liquibase.ext.sqlgenerator.core.ModifyColumnChangeTest
  322. [INFO] Running liquibase.ext.sqlgenerator.core.ModifyColumnGeneratorTest
  323. [INFO] Tests run: 8, Failures: 0, Errors: 0, Skipped: 0, Time elapsed: 2.342 s - in liquibase.ext.sqlgenerator.core.ModifyColumnGeneratorTest
  324. [INFO] Running org.openmrs.AllergenTest
  325. [INFO] Tests run: 6, Failures: 0, Errors: 0, Skipped: 0, Time elapsed: 57.217 s - in org.openmrs.AllergenTest
  326. [INFO] Running org.openmrs.AllergiesTest
  327. [INFO] Tests run: 26, Failures: 0, Errors: 0, Skipped: 0, Time elapsed: 4.52 s - in org.openmrs.AllergiesTest
  328. [INFO] Running org.openmrs.annotation.OpenmrsProfileExcludeFilterTest
  329. [WARNING] Tests run: 8, Failures: 0, Errors: 0, Skipped: 2, Time elapsed: 0.343 s - in org.openmrs.annotation.OpenmrsProfileExcludeFilterTest
  330. [INFO] Running org.openmrs.annotation.OpenmrsProfileExcludeFilterWithModulesTest
  331. [INFO] Tests run: 1, Failures: 0, Errors: 0, Skipped: 0, Time elapsed: 4.567 s - in org.openmrs.annotation.OpenmrsProfileExcludeFilterWithModulesTest
  332. [INFO] Running org.openmrs.annotation.OpenmrsProfileIncludeFilterTest
  333. [INFO] Tests run: 2, Failures: 0, Errors: 0, Skipped: 0, Time elapsed: 4.294 s - in org.openmrs.annotation.OpenmrsProfileIncludeFilterTest
  334. [INFO] Running org.openmrs.annotation.StartModuleAnnotationReuseTest
  335. [INFO] Tests run: 1, Failures: 0, Errors: 0, Skipped: 0, Time elapsed: 5.235 s - in org.openmrs.annotation.StartModuleAnnotationReuseTest
  336. [INFO] Running org.openmrs.annotation.StartModuleAnnotationTest
  337. [INFO] Tests run: 1, Failures: 0, Errors: 0, Skipped: 0, Time elapsed: 6.256 s - in org.openmrs.annotation.StartModuleAnnotationTest
  338. [INFO] Running org.openmrs.aop.AuthorizationAdviceTest
  339. [INFO] Tests run: 2, Failures: 0, Errors: 0, Skipped: 0, Time elapsed: 3.707 s - in org.openmrs.aop.AuthorizationAdviceTest
  340. [INFO] Running org.openmrs.aop.RequiredDataAdviceTest
  341. [INFO] Tests run: 26, Failures: 0, Errors: 0, Skipped: 0, Time elapsed: 1.513 s - in org.openmrs.aop.RequiredDataAdviceTest
  342. [INFO] Running org.openmrs.api.AdministrationServiceTest
  343. [WARNING] Tests run: 57, Failures: 0, Errors: 0, Skipped: 4, Time elapsed: 6.734 s - in org.openmrs.api.AdministrationServiceTest
  344. [INFO] Running org.openmrs.api.AdministrationServiceUnitTest
  345. [INFO] Tests run: 5, Failures: 0, Errors: 0, Skipped: 0, Time elapsed: 0.016 s - in org.openmrs.api.AdministrationServiceUnitTest
  346. [INFO] Running org.openmrs.api.cache.CachePropertiesUtilTest
  347. [INFO] Tests run: 1, Failures: 0, Errors: 0, Skipped: 0, Time elapsed: 0.524 s - in org.openmrs.api.cache.CachePropertiesUtilTest
  348. [INFO] Running org.openmrs.api.cache.OpenmrsCacheManagerFactoryBeanTest
  349. [INFO] Tests run: 1, Failures: 0, Errors: 0, Skipped: 0, Time elapsed: 3.544 s - in org.openmrs.api.cache.OpenmrsCacheManagerFactoryBeanTest
  350. [INFO] Running org.openmrs.api.CohortServiceTest
  351. [INFO] Tests run: 39, Failures: 0, Errors: 0, Skipped: 0, Time elapsed: 9.357 s - in org.openmrs.api.CohortServiceTest
  352. [INFO] Running org.openmrs.api.ConceptServiceTest
  353. [WARNING] Tests run: 245, Failures: 0, Errors: 0, Skipped: 1, Time elapsed: 266.383 s - in org.openmrs.api.ConceptServiceTest
  354. [INFO] Running org.openmrs.api.context.ContextTest
  355. [INFO] Tests run: 17, Failures: 0, Errors: 0, Skipped: 0, Time elapsed: 2.62 s - in org.openmrs.api.context.ContextTest
  356. [INFO] Running org.openmrs.api.context.ContextWithModuleTest
  357. [INFO] Tests run: 1, Failures: 0, Errors: 0, Skipped: 0, Time elapsed: 2.376 s - in org.openmrs.api.context.ContextWithModuleTest
  358. [INFO] Running org.openmrs.api.context.DaemonTest
  359. [INFO] Tests run: 10, Failures: 0, Errors: 0, Skipped: 0, Time elapsed: 3.052 s - in org.openmrs.api.context.DaemonTest
  360. [INFO] Running org.openmrs.api.DatatypeServiceTest
  361. [INFO] Tests run: 2, Failures: 0, Errors: 0, Skipped: 0, Time elapsed: 2.18 s - in org.openmrs.api.DatatypeServiceTest
  362. [INFO] Running org.openmrs.api.db.ConceptDAOTest
  363. [WARNING] Tests run: 13, Failures: 0, Errors: 0, Skipped: 2, Time elapsed: 3.415 s - in org.openmrs.api.db.ConceptDAOTest
  364. [INFO] Running org.openmrs.api.db.ContextDAOTest
  365. [INFO] Tests run: 24, Failures: 0, Errors: 0, Skipped: 0, Time elapsed: 3.509 s - in org.openmrs.api.db.ContextDAOTest
  366. [INFO] Running org.openmrs.api.db.EncounterDAOTest
  367. [INFO] Tests run: 4, Failures: 0, Errors: 0, Skipped: 0, Time elapsed: 3.202 s - in org.openmrs.api.db.EncounterDAOTest
  368. [INFO] Running org.openmrs.api.db.hibernate.AuditableInterceptorTest
  369. Security framework of XStream not explicitly initialized, using predefined black list on your own risk.
  370. [INFO] Tests run: 15, Failures: 0, Errors: 0, Skipped: 0, Time elapsed: 2.656 s - in org.openmrs.api.db.hibernate.AuditableInterceptorTest
  371. [INFO] Running org.openmrs.api.db.hibernate.DropMillisecondsHibernateInterceptorTest
  372. [INFO] Tests run: 4, Failures: 0, Errors: 0, Skipped: 0, Time elapsed: 2.309 s - in org.openmrs.api.db.hibernate.DropMillisecondsHibernateInterceptorTest
  373. [INFO] Running org.openmrs.api.db.hibernate.HibernateAdministrationDAOTest
  374. [INFO] Tests run: 4, Failures: 0, Errors: 0, Skipped: 0, Time elapsed: 2.603 s - in org.openmrs.api.db.hibernate.HibernateAdministrationDAOTest
  375. [INFO] Running org.openmrs.api.db.hibernate.HibernateConceptDAOTest
  376. [INFO] Tests run: 11, Failures: 0, Errors: 0, Skipped: 0, Time elapsed: 12.606 s - in org.openmrs.api.db.hibernate.HibernateConceptDAOTest
  377. [INFO] Running org.openmrs.api.db.hibernate.HibernateConditionDAOTest
  378. [INFO] Tests run: 6, Failures: 0, Errors: 0, Skipped: 0, Time elapsed: 6.618 s - in org.openmrs.api.db.hibernate.HibernateConditionDAOTest
  379. [INFO] Running org.openmrs.api.db.hibernate.HibernateDiagnosisDAOTest
  380. [INFO] Tests run: 9, Failures: 0, Errors: 0, Skipped: 0, Time elapsed: 2.99 s - in org.openmrs.api.db.hibernate.HibernateDiagnosisDAOTest
  381. [INFO] Running org.openmrs.api.db.hibernate.HibernateFormDAOTest
  382. [INFO] Tests run: 1, Failures: 0, Errors: 0, Skipped: 0, Time elapsed: 2.594 s - in org.openmrs.api.db.hibernate.HibernateFormDAOTest
  383. [INFO] Running org.openmrs.api.db.hibernate.HibernateLocationDAOTest
  384. [INFO] Tests run: 3, Failures: 0, Errors: 0, Skipped: 0, Time elapsed: 2.889 s - in org.openmrs.api.db.hibernate.HibernateLocationDAOTest
  385. [INFO] Running org.openmrs.api.db.hibernate.HibernateObsDAOTest
  386. [INFO] Tests run: 1, Failures: 0, Errors: 0, Skipped: 0, Time elapsed: 3.077 s - in org.openmrs.api.db.hibernate.HibernateObsDAOTest
  387. [INFO] Running org.openmrs.api.db.hibernate.HibernateOrderDAOTest
  388. [INFO] Tests run: 10, Failures: 0, Errors: 0, Skipped: 0, Time elapsed: 4.146 s - in org.openmrs.api.db.hibernate.HibernateOrderDAOTest
  389. [INFO] Running org.openmrs.api.db.hibernate.HibernatePatientDAOTest
  390. [INFO] Tests run: 2, Failures: 0, Errors: 0, Skipped: 0, Time elapsed: 3.642 s - in org.openmrs.api.db.hibernate.HibernatePatientDAOTest
  391. [INFO] Running org.openmrs.api.db.hibernate.HibernatePersonDAOTest
  392. [INFO] Tests run: 41, Failures: 0, Errors: 0, Skipped: 0, Time elapsed: 43.695 s - in org.openmrs.api.db.hibernate.HibernatePersonDAOTest
  393. [INFO] Running org.openmrs.api.db.hibernate.HibernateProviderDAOTest
  394. [INFO] Tests run: 3, Failures: 0, Errors: 0, Skipped: 0, Time elapsed: 2.381 s - in org.openmrs.api.db.hibernate.HibernateProviderDAOTest
  395. [INFO] Running org.openmrs.api.db.hibernate.ImmutableEntityInterceptorTest
  396. [INFO] Tests run: 4, Failures: 0, Errors: 0, Skipped: 0, Time elapsed: 2.055 s - in org.openmrs.api.db.hibernate.ImmutableEntityInterceptorTest
  397. [INFO] Running org.openmrs.api.db.hibernate.PatientSearchCriteriaTest
  398. [INFO] Tests run: 18, Failures: 0, Errors: 0, Skipped: 0, Time elapsed: 2.259 s - in org.openmrs.api.db.hibernate.PatientSearchCriteriaTest
  399. [INFO] Running org.openmrs.api.db.hibernate.PersonAttributeHelperTest
  400. [INFO] Tests run: 5, Failures: 0, Errors: 0, Skipped: 0, Time elapsed: 2.575 s - in org.openmrs.api.db.hibernate.PersonAttributeHelperTest
  401. [INFO] Running org.openmrs.api.db.hibernate.ProviderDAOTest
  402. [INFO] Tests run: 3, Failures: 0, Errors: 0, Skipped: 0, Time elapsed: 2.301 s - in org.openmrs.api.db.hibernate.ProviderDAOTest
  403. [INFO] Running org.openmrs.api.db.PatientDAOTest
  404. [WARNING] Tests run: 159, Failures: 0, Errors: 0, Skipped: 1, Time elapsed: 196.887 s - in org.openmrs.api.db.PatientDAOTest
  405. [INFO] Running org.openmrs.api.db.PersonDAOTest
  406. [INFO] Tests run: 3, Failures: 0, Errors: 0, Skipped: 0, Time elapsed: 2.408 s - in org.openmrs.api.db.PersonDAOTest
  407. [INFO] Running org.openmrs.api.db.ProgramWorkflowDAOTest
  408. [INFO] Tests run: 5, Failures: 0, Errors: 0, Skipped: 0, Time elapsed: 2.411 s - in org.openmrs.api.db.ProgramWorkflowDAOTest
  409. [INFO] Running org.openmrs.api.db.SerializedObjectDAOTest
  410. [WARNING] Tests run: 1, Failures: 0, Errors: 0, Skipped: 1, Time elapsed: 0.006 s - in org.openmrs.api.db.SerializedObjectDAOTest
  411. [INFO] Running org.openmrs.api.db.UserDAOTest
  412. [INFO] Tests run: 8, Failures: 0, Errors: 0, Skipped: 0, Time elapsed: 2.793 s - in org.openmrs.api.db.UserDAOTest
  413. [INFO] Running org.openmrs.api.db.VisitDAOTest
  414. [INFO] Tests run: 3, Failures: 0, Errors: 0, Skipped: 0, Time elapsed: 3.015 s - in org.openmrs.api.db.VisitDAOTest
  415. [INFO] Running org.openmrs.api.EncounterServiceTest
  416. [WARNING] Tests run: 144, Failures: 0, Errors: 0, Skipped: 2, Time elapsed: 60.002 s - in org.openmrs.api.EncounterServiceTest
  417. [INFO] Running org.openmrs.api.FormServiceTest
  418. [INFO] Tests run: 48, Failures: 0, Errors: 0, Skipped: 0, Time elapsed: 3.621 s - in org.openmrs.api.FormServiceTest
  419. [INFO] Running org.openmrs.api.handler.BaseRetireHandlerTest
  420. [INFO] Tests run: 8, Failures: 0, Errors: 0, Skipped: 0, Time elapsed: 0.002 s - in org.openmrs.api.handler.BaseRetireHandlerTest
  421. [INFO] Running org.openmrs.api.handler.BaseUnretireHandlerTest
  422. [INFO] Tests run: 6, Failures: 0, Errors: 0, Skipped: 0, Time elapsed: 0.006 s - in org.openmrs.api.handler.BaseUnretireHandlerTest
  423. [INFO] Running org.openmrs.api.handler.BaseUnvoidHandlerTest
  424. [INFO] Tests run: 6, Failures: 0, Errors: 0, Skipped: 0, Time elapsed: 0.003 s - in org.openmrs.api.handler.BaseUnvoidHandlerTest
  425. [INFO] Running org.openmrs.api.handler.BaseVoidHandlerTest
  426. [INFO] Tests run: 8, Failures: 0, Errors: 0, Skipped: 0, Time elapsed: 0.002 s - in org.openmrs.api.handler.BaseVoidHandlerTest
  427. [INFO] Running org.openmrs.api.handler.ConceptNameSaveHandlerTest
  428. [INFO] Tests run: 4, Failures: 0, Errors: 0, Skipped: 0, Time elapsed: 3.957 s - in org.openmrs.api.handler.ConceptNameSaveHandlerTest
  429. [INFO] Running org.openmrs.api.handler.ExistingOrNewVisitAssignmentHandlerTest
  430. [INFO] Tests run: 5, Failures: 0, Errors: 0, Skipped: 0, Time elapsed: 6.744 s - in org.openmrs.api.handler.ExistingOrNewVisitAssignmentHandlerTest
  431. [INFO] Running org.openmrs.api.handler.ExistingVisitAssignmentHandlerTest
  432. [INFO] Tests run: 3, Failures: 0, Errors: 0, Skipped: 0, Time elapsed: 3.906 s - in org.openmrs.api.handler.ExistingVisitAssignmentHandlerTest
  433. [INFO] Running org.openmrs.api.handler.OpenmrsMetadataSaveHandlerTest
  434. [INFO] Tests run: 2, Failures: 0, Errors: 0, Skipped: 0, Time elapsed: 0.004 s - in org.openmrs.api.handler.OpenmrsMetadataSaveHandlerTest
  435. [INFO] Running org.openmrs.api.handler.OpenmrsObjectSaveHandlerTest
  436. [INFO] Tests run: 5, Failures: 0, Errors: 0, Skipped: 0, Time elapsed: 0.004 s - in org.openmrs.api.handler.OpenmrsObjectSaveHandlerTest
  437. [INFO] Running org.openmrs.api.handler.PatientDataUnvoidHandlerTest
  438. [INFO] Tests run: 3, Failures: 0, Errors: 0, Skipped: 0, Time elapsed: 5.097 s - in org.openmrs.api.handler.PatientDataUnvoidHandlerTest
  439. [INFO] Running org.openmrs.api.handler.PatientDataVoidHandlerTest
  440. [INFO] Tests run: 2, Failures: 0, Errors: 0, Skipped: 0, Time elapsed: 2.795 s - in org.openmrs.api.handler.PatientDataVoidHandlerTest
  441. [INFO] Running org.openmrs.api.handler.PersonSaveHandlerTest
  442. [INFO] Tests run: 1, Failures: 0, Errors: 0, Skipped: 0, Time elapsed: 2.332 s - in org.openmrs.api.handler.PersonSaveHandlerTest
  443. [INFO] Running org.openmrs.api.handler.PersonUnvoidHandlerTest
  444. [INFO] Tests run: 6, Failures: 0, Errors: 0, Skipped: 0, Time elapsed: 0.003 s - in org.openmrs.api.handler.PersonUnvoidHandlerTest
  445. [INFO] Running org.openmrs.api.handler.PersonVoidHandlerTest
  446. [INFO] Tests run: 8, Failures: 0, Errors: 0, Skipped: 0, Time elapsed: 2.866 s - in org.openmrs.api.handler.PersonVoidHandlerTest
  447. [INFO] Running org.openmrs.api.handler.RequiredReasonVoidSaveHandlerTest
  448. [INFO] Tests run: 5, Failures: 0, Errors: 0, Skipped: 0, Time elapsed: 2.574 s - in org.openmrs.api.handler.RequiredReasonVoidSaveHandlerTest
  449. [INFO] Running org.openmrs.api.handler.RequireVoidReasonVoidHandlerTest
  450. [INFO] Tests run: 5, Failures: 0, Errors: 0, Skipped: 0, Time elapsed: 2.638 s - in org.openmrs.api.handler.RequireVoidReasonVoidHandlerTest
  451. [INFO] Running org.openmrs.api.impl.ConceptServiceImplTest
  452. [INFO] Tests run: 63, Failures: 0, Errors: 0, Skipped: 0, Time elapsed: 4.179 s - in org.openmrs.api.impl.ConceptServiceImplTest
  453. [INFO] Running org.openmrs.api.impl.ConditionServiceImplTest
  454. [INFO] Tests run: 12, Failures: 0, Errors: 0, Skipped: 0, Time elapsed: 3.596 s - in org.openmrs.api.impl.ConditionServiceImplTest
  455. [INFO] Running org.openmrs.api.impl.DiagnosisServiceImplTest
  456. [INFO] Tests run: 11, Failures: 0, Errors: 0, Skipped: 0, Time elapsed: 3.444 s - in org.openmrs.api.impl.DiagnosisServiceImplTest
  457. [INFO] Running org.openmrs.api.impl.GlobalLocaleListTest
  458. [INFO] Tests run: 2, Failures: 0, Errors: 0, Skipped: 0, Time elapsed: 0.023 s - in org.openmrs.api.impl.GlobalLocaleListTest
  459. [INFO] Running org.openmrs.api.impl.PatientServiceImplTest
  460. [INFO] Tests run: 14, Failures: 0, Errors: 0, Skipped: 0, Time elapsed: 1.92 s - in org.openmrs.api.impl.PatientServiceImplTest
  461. [INFO] Running org.openmrs.api.impl.SerializationServiceImplTest
  462. [INFO] Tests run: 1, Failures: 0, Errors: 0, Skipped: 0, Time elapsed: 0.005 s - in org.openmrs.api.impl.SerializationServiceImplTest
  463. [INFO] Running org.openmrs.api.LocationServiceTest
  464. [INFO] Tests run: 70, Failures: 0, Errors: 0, Skipped: 0, Time elapsed: 8.719 s - in org.openmrs.api.LocationServiceTest
  465. [INFO] Running org.openmrs.api.ObsServiceTest
  466. [INFO] Tests run: 80, Failures: 0, Errors: 0, Skipped: 0, Time elapsed: 13.789 s - in org.openmrs.api.ObsServiceTest
  467. [INFO] Running org.openmrs.api.OpenmrsServiceTest
  468. [WARNING] Tests run: 1, Failures: 0, Errors: 0, Skipped: 1, Time elapsed: 0.268 s - in org.openmrs.api.OpenmrsServiceTest
  469. [INFO] Running org.openmrs.api.OrderServiceTest
  470. [WARNING] Tests run: 204, Failures: 0, Errors: 0, Skipped: 3, Time elapsed: 24.542 s - in org.openmrs.api.OrderServiceTest
  471. [INFO] Running org.openmrs.api.OrderSetServiceTest
  472. [INFO] Tests run: 21, Failures: 0, Errors: 0, Skipped: 0, Time elapsed: 4.543 s - in org.openmrs.api.OrderSetServiceTest
  473. [INFO] Running org.openmrs.api.PatientServiceAllergyTest
  474. [INFO] Tests run: 16, Failures: 0, Errors: 0, Skipped: 0, Time elapsed: 4.866 s - in org.openmrs.api.PatientServiceAllergyTest
  475. [INFO] Running org.openmrs.api.PatientServiceTest
  476. [WARNING] Tests run: 169, Failures: 0, Errors: 0, Skipped: 1, Time elapsed: 161.559 s - in org.openmrs.api.PatientServiceTest
  477. [INFO] Running org.openmrs.api.PersonServiceTest
  478. [INFO] Tests run: 148, Failures: 0, Errors: 0, Skipped: 0, Time elapsed: 14.392 s - in org.openmrs.api.PersonServiceTest
  479. [INFO] Running org.openmrs.api.ProgramWorkflowServiceTest
  480. [INFO] Tests run: 63, Failures: 0, Errors: 0, Skipped: 0, Time elapsed: 13.576 s - in org.openmrs.api.ProgramWorkflowServiceTest
  481. [INFO] Running org.openmrs.api.ProgramWorkflowServiceUnitTest
  482. [INFO] Tests run: 12, Failures: 0, Errors: 0, Skipped: 0, Time elapsed: 0.032 s - in org.openmrs.api.ProgramWorkflowServiceUnitTest
  483. [INFO] Running org.openmrs.api.ProviderServiceTest
  484. [INFO] Tests run: 40, Failures: 0, Errors: 0, Skipped: 0, Time elapsed: 6.498 s - in org.openmrs.api.ProviderServiceTest
  485. [INFO] Running org.openmrs.api.UserServiceTest
  486. [WARNING] Tests run: 109, Failures: 0, Errors: 0, Skipped: 1, Time elapsed: 25.275 s - in org.openmrs.api.UserServiceTest
  487. [INFO] Running org.openmrs.api.VisitServiceTest
  488. [INFO] Tests run: 68, Failures: 0, Errors: 0, Skipped: 0, Time elapsed: 5.503 s - in org.openmrs.api.VisitServiceTest
  489. [INFO] Running org.openmrs.attribute.AttributeIntegrationTest
  490. [INFO] Tests run: 1, Failures: 0, Errors: 0, Skipped: 0, Time elapsed: 2.315 s - in org.openmrs.attribute.AttributeIntegrationTest
  491. [INFO] Running org.openmrs.BaseCustomizableMetadataTest
  492. [INFO] Tests run: 2, Failures: 0, Errors: 0, Skipped: 0, Time elapsed: 2.472 s - in org.openmrs.BaseCustomizableMetadataTest
  493. [INFO] Running org.openmrs.BaseFormRecordableOpenmrsDataTest
  494. [INFO] Tests run: 10, Failures: 0, Errors: 0, Skipped: 0, Time elapsed: 0.004 s - in org.openmrs.BaseFormRecordableOpenmrsDataTest
  495. [INFO] Running org.openmrs.BaseOpenmrsObjectTest
  496. [INFO] Tests run: 20, Failures: 0, Errors: 0, Skipped: 0, Time elapsed: 2.483 s - in org.openmrs.BaseOpenmrsObjectTest
  497. [INFO] Running org.openmrs.CohortMembershipTest
  498. [INFO] Tests run: 21, Failures: 0, Errors: 0, Skipped: 0, Time elapsed: 0.006 s - in org.openmrs.CohortMembershipTest
  499. [INFO] Running org.openmrs.CohortTest
  500. [INFO] Tests run: 15, Failures: 0, Errors: 0, Skipped: 0, Time elapsed: 0.428 s - in org.openmrs.CohortTest
  501. [INFO] Running org.openmrs.comparator.PatientIdentifierTypeDefaultComparatorTest
  502. [INFO] Tests run: 1, Failures: 0, Errors: 0, Skipped: 0, Time elapsed: 0.006 s - in org.openmrs.comparator.PatientIdentifierTypeDefaultComparatorTest
  503. [INFO] Running org.openmrs.ConceptComponentTest
  504. [INFO] Tests run: 1, Failures: 0, Errors: 0, Skipped: 0, Time elapsed: 2.302 s - in org.openmrs.ConceptComponentTest
  505. [INFO] Running org.openmrs.ConceptNumericTest
  506. [INFO] Tests run: 8, Failures: 0, Errors: 0, Skipped: 0, Time elapsed: 2.435 s - in org.openmrs.ConceptNumericTest
  507. [INFO] Running org.openmrs.ConceptReferenceTermTest
  508. [INFO] Tests run: 3, Failures: 0, Errors: 0, Skipped: 0, Time elapsed: 0.011 s - in org.openmrs.ConceptReferenceTermTest
  509. [INFO] Running org.openmrs.ConceptTest
  510. [INFO] Tests run: 73, Failures: 0, Errors: 0, Skipped: 0, Time elapsed: 3.164 s - in org.openmrs.ConceptTest
  511. [INFO] Running org.openmrs.customdatatype.CustomDatatypeUtilTest
  512. [INFO] Tests run: 1, Failures: 0, Errors: 0, Skipped: 0, Time elapsed: 2.44 s - in org.openmrs.customdatatype.CustomDatatypeUtilTest
  513. [INFO] Running org.openmrs.customdatatype.datatype.BaseMetadataDatatypeTest
  514. [INFO] Tests run: 1, Failures: 0, Errors: 0, Skipped: 0, Time elapsed: 0.01 s - in org.openmrs.customdatatype.datatype.BaseMetadataDatatypeTest
  515. [INFO] Running org.openmrs.customdatatype.datatype.BaseOpenmrsDatatypeTest
  516. [INFO] Tests run: 1, Failures: 0, Errors: 0, Skipped: 0, Time elapsed: 0.005 s - in org.openmrs.customdatatype.datatype.BaseOpenmrsDatatypeTest
  517. [INFO] Running org.openmrs.customdatatype.datatype.DateDatatypeTest
  518. [INFO] Tests run: 2, Failures: 0, Errors: 0, Skipped: 0, Time elapsed: 0.007 s - in org.openmrs.customdatatype.datatype.DateDatatypeTest
  519. [INFO] Running org.openmrs.customdatatype.datatype.RegexValidatedTextTest
  520. [INFO] Tests run: 3, Failures: 0, Errors: 0, Skipped: 0, Time elapsed: 0.015 s - in org.openmrs.customdatatype.datatype.RegexValidatedTextTest
  521. [INFO] Running org.openmrs.DrugOrderTest
  522. [INFO] Tests run: 22, Failures: 0, Errors: 0, Skipped: 0, Time elapsed: 0.209 s - in org.openmrs.DrugOrderTest
  523. [INFO] Running org.openmrs.DrugTest
  524. [INFO] Tests run: 2, Failures: 0, Errors: 0, Skipped: 0, Time elapsed: 2.299 s - in org.openmrs.DrugTest
  525. [INFO] Running org.openmrs.DurationTest
  526. [INFO] Tests run: 11, Failures: 0, Errors: 0, Skipped: 0, Time elapsed: 2.355 s - in org.openmrs.DurationTest
  527. [INFO] Running org.openmrs.EncounterProviderTest
  528. [INFO] Tests run: 1, Failures: 0, Errors: 0, Skipped: 0, Time elapsed: 0.01 s - in org.openmrs.EncounterProviderTest
  529. [INFO] Running org.openmrs.EncounterRoleTest
  530. [INFO] Tests run: 1, Failures: 0, Errors: 0, Skipped: 0, Time elapsed: 0.005 s - in org.openmrs.EncounterRoleTest
  531. [INFO] Running org.openmrs.EncounterTest
  532. [INFO] Tests run: 66, Failures: 0, Errors: 0, Skipped: 0, Time elapsed: 0.239 s - in org.openmrs.EncounterTest
  533. [INFO] Running org.openmrs.EncounterTypeTest
  534. [INFO] Tests run: 1, Failures: 0, Errors: 0, Skipped: 0, Time elapsed: 0.007 s - in org.openmrs.EncounterTypeTest
  535. [INFO] Running org.openmrs.FormTest
  536. [INFO] Tests run: 1, Failures: 0, Errors: 0, Skipped: 0, Time elapsed: 0.002 s - in org.openmrs.FormTest
  537. [INFO] Running org.openmrs.hl7.handler.ORUR01HandlerTest
  538. [INFO] Tests run: 39, Failures: 0, Errors: 0, Skipped: 0, Time elapsed: 16.312 s - in org.openmrs.hl7.handler.ORUR01HandlerTest
  539. [INFO] Running org.openmrs.hl7.HL7ServiceTest
  540. [WARNING] Tests run: 29, Failures: 0, Errors: 0, Skipped: 2, Time elapsed: 5.757 s - in org.openmrs.hl7.HL7ServiceTest
  541. [INFO] Running org.openmrs.hl7.HL7UtilTest
  542. [INFO] Tests run: 5, Failures: 0, Errors: 0, Skipped: 0, Time elapsed: 0.005 s - in org.openmrs.hl7.HL7UtilTest
  543. [INFO] Running org.openmrs.layout.name.NameTemplateTest
  544. [INFO] Tests run: 2, Failures: 0, Errors: 0, Skipped: 0, Time elapsed: 2.386 s - in org.openmrs.layout.name.NameTemplateTest
  545. [INFO] Running org.openmrs.liquibase.ChangeLogDetectiveTest
  546. [INFO] Tests run: 11, Failures: 0, Errors: 0, Skipped: 0, Time elapsed: 0.164 s - in org.openmrs.liquibase.ChangeLogDetectiveTest
  547. [INFO] Running org.openmrs.liquibase.ChangeLogVersionFinderTest
  548. [INFO] Tests run: 15, Failures: 0, Errors: 0, Skipped: 0, Time elapsed: 0.044 s - in org.openmrs.liquibase.ChangeLogVersionFinderTest
  549. [INFO] Running org.openmrs.liquibase.ChangeLogVersionsTest
  550. [INFO] Tests run: 3, Failures: 0, Errors: 0, Skipped: 0, Time elapsed: 1.057 s - in org.openmrs.liquibase.ChangeLogVersionsTest
  551. [INFO] Running org.openmrs.LocationTest
  552. [INFO] Tests run: 3, Failures: 0, Errors: 0, Skipped: 0, Time elapsed: 0.003 s - in org.openmrs.LocationTest
  553. [INFO] Running org.openmrs.logic.result.EmptyResultTest
  554. [INFO] Tests run: 2, Failures: 0, Errors: 0, Skipped: 0, Time elapsed: 0.007 s - in org.openmrs.logic.result.EmptyResultTest
  555. [INFO] Running org.openmrs.logic.result.ResultTest
  556. [INFO] Tests run: 17, Failures: 0, Errors: 0, Skipped: 0, Time elapsed: 0.003 s - in org.openmrs.logic.result.ResultTest
  557. [INFO] Running org.openmrs.messagesource.impl.CachedMessageSourceTest
  558. [INFO] Tests run: 2, Failures: 0, Errors: 0, Skipped: 0, Time elapsed: 0.008 s - in org.openmrs.messagesource.impl.CachedMessageSourceTest
  559. [INFO] Running org.openmrs.messagesource.impl.DefaultMessageSourceServiceImplTest
  560. [INFO] Tests run: 1, Failures: 0, Errors: 0, Skipped: 0, Time elapsed: 0.009 s - in org.openmrs.messagesource.impl.DefaultMessageSourceServiceImplTest
  561. [INFO] Running org.openmrs.messagesource.MessageSourceServiceTest
  562. [INFO] Tests run: 1, Failures: 0, Errors: 0, Skipped: 0, Time elapsed: 2.311 s - in org.openmrs.messagesource.MessageSourceServiceTest
  563. [INFO] Running org.openmrs.messagesource.PresentationMessageMapTest
  564. [INFO] Tests run: 2, Failures: 0, Errors: 0, Skipped: 0, Time elapsed: 0.013 s - in org.openmrs.messagesource.PresentationMessageMapTest
  565. [INFO] Running org.openmrs.module.ModuleActivatorTest
  566. [INFO] Tests run: 11, Failures: 0, Errors: 0, Skipped: 0, Time elapsed: 5.561 s - in org.openmrs.module.ModuleActivatorTest
  567. [INFO] Running org.openmrs.module.ModuleClassLoaderTest
  568. [INFO] Tests run: 10, Failures: 0, Errors: 0, Skipped: 0, Time elapsed: 2.647 s - in org.openmrs.module.ModuleClassLoaderTest
  569. [INFO] Running org.openmrs.module.ModuleExtensionsTest
  570. [INFO] Tests run: 10, Failures: 0, Errors: 0, Skipped: 0, Time elapsed: 0.071 s - in org.openmrs.module.ModuleExtensionsTest
  571. [INFO] Running org.openmrs.module.ModuleFactoryTest
  572. [INFO] Tests run: 9, Failures: 0, Errors: 0, Skipped: 0, Time elapsed: 3.241 s - in org.openmrs.module.ModuleFactoryTest
  573. [INFO] Running org.openmrs.module.ModuleFileParserTest
  574. [INFO] Tests run: 6, Failures: 0, Errors: 0, Skipped: 0, Time elapsed: 2.685 s - in org.openmrs.module.ModuleFileParserTest
  575. [INFO] Running org.openmrs.module.ModuleFileParserUnitTest
  576. [Fatal Error] :1:67: XML document structures must start and end within the same entity.
  577. [Fatal Error] :-1:-1: Premature end of file.
  578. [INFO] Tests run: 73, Failures: 0, Errors: 0, Skipped: 0, Time elapsed: 1.264 s - in org.openmrs.module.ModuleFileParserUnitTest
  579. [INFO] Running org.openmrs.module.ModuleInteroperabilityTest
  580. [INFO] Tests run: 1, Failures: 0, Errors: 0, Skipped: 0, Time elapsed: 2.011 s - in org.openmrs.module.ModuleInteroperabilityTest
  581. [INFO] Running org.openmrs.module.ModuleTest
  582. [INFO] Tests run: 9, Failures: 0, Errors: 0, Skipped: 0, Time elapsed: 0.008 s - in org.openmrs.module.ModuleTest
  583. [INFO] Running org.openmrs.module.ModuleUtilTest
  584. [ERROR] Tests run: 56, Failures: 1, Errors: 0, Skipped: 0, Time elapsed: 3.397 s <<< FAILURE! - in org.openmrs.module.ModuleUtilTest
  585. [ERROR] compareVersion_shouldTreatSNAPSHOTAsEarliestVersion Time elapsed: 0.013 s <<< FAILURE!
  586. org.opentest4j.AssertionFailedError: expected: <true> but was: <false>
  587. at org.openmrs.module.ModuleUtilTest.compareVersion_shouldTreatSNAPSHOTAsEarliestVersion(ModuleUtilTest.java:505)
  588.  
  589. [INFO] Running org.openmrs.module.UpdateFileParserTest
  590. [INFO] Tests run: 3, Failures: 0, Errors: 0, Skipped: 0, Time elapsed: 0.009 s - in org.openmrs.module.UpdateFileParserTest
  591. [INFO] Running org.openmrs.module.VersionComparatorTest
  592. [INFO] Tests run: 1, Failures: 0, Errors: 0, Skipped: 0, Time elapsed: 0.003 s - in org.openmrs.module.VersionComparatorTest
  593. [INFO] Running org.openmrs.notification.AlertServiceTest
  594. [INFO] Tests run: 3, Failures: 0, Errors: 0, Skipped: 0, Time elapsed: 2.232 s - in org.openmrs.notification.AlertServiceTest
  595. [INFO] Running org.openmrs.notification.db.hibernate.HibernateAlertDAOTest
  596. [INFO] Tests run: 5, Failures: 0, Errors: 0, Skipped: 0, Time elapsed: 3.55 s - in org.openmrs.notification.db.hibernate.HibernateAlertDAOTest
  597. [INFO] Running org.openmrs.notification.MessageTest
  598. [INFO] Tests run: 4, Failures: 0, Errors: 0, Skipped: 0, Time elapsed: 0.004 s - in org.openmrs.notification.MessageTest
  599. [INFO] Running org.openmrs.obs.AbstractHandlerTest
  600. [INFO] Tests run: 4, Failures: 0, Errors: 0, Skipped: 0, Time elapsed: 3.242 s - in org.openmrs.obs.AbstractHandlerTest
  601. [INFO] Running org.openmrs.obs.BinaryDataHandlerTest
  602. [INFO] Tests run: 4, Failures: 0, Errors: 0, Skipped: 0, Time elapsed: 3.555 s - in org.openmrs.obs.BinaryDataHandlerTest
  603. [INFO] Running org.openmrs.obs.BinaryStreamHandlerTest
  604. [WARNING] Tests run: 4, Failures: 0, Errors: 0, Skipped: 1, Time elapsed: 3.578 s - in org.openmrs.obs.BinaryStreamHandlerTest
  605. [INFO] Running org.openmrs.obs.ImageHandlerTest
  606. [INFO] Tests run: 5, Failures: 0, Errors: 0, Skipped: 0, Time elapsed: 4.001 s - in org.openmrs.obs.ImageHandlerTest
  607. [INFO] Running org.openmrs.obs.MediaHandlerTest
  608. [WARNING] Tests run: 4, Failures: 0, Errors: 0, Skipped: 1, Time elapsed: 3.251 s - in org.openmrs.obs.MediaHandlerTest
  609. [INFO] Running org.openmrs.obs.TextHandlerTest
  610. [INFO] Tests run: 4, Failures: 0, Errors: 0, Skipped: 0, Time elapsed: 2.804 s - in org.openmrs.obs.TextHandlerTest
  611. [INFO] Running org.openmrs.ObsBehaviorTest
  612. [WARNING] Tests run: 3, Failures: 0, Errors: 0, Skipped: 1, Time elapsed: 2.441 s - in org.openmrs.ObsBehaviorTest
  613. [INFO] Running org.openmrs.ObsTest
  614. [INFO] Tests run: 48, Failures: 0, Errors: 0, Skipped: 0, Time elapsed: 0.041 s - in org.openmrs.ObsTest
  615. [INFO] Running org.openmrs.OpenmrsTestAnnotationsTest
  616. [INFO] Tests run: 2, Failures: 0, Errors: 0, Skipped: 0, Time elapsed: 3.192 s - in org.openmrs.OpenmrsTestAnnotationsTest
  617. [INFO] Running org.openmrs.OpenmrsTestsTest
  618. [INFO] Tests run: 5, Failures: 0, Errors: 0, Skipped: 0, Time elapsed: 0.669 s - in org.openmrs.OpenmrsTestsTest
  619. [INFO] Running org.openmrs.order.OrderUtilTest
  620. [INFO] Tests run: 15, Failures: 0, Errors: 0, Skipped: 0, Time elapsed: 0.005 s - in org.openmrs.order.OrderUtilTest
  621. [INFO] Running org.openmrs.OrderEntryIntegrationTest
  622. [INFO] Tests run: 15, Failures: 0, Errors: 0, Skipped: 0, Time elapsed: 4.998 s - in org.openmrs.OrderEntryIntegrationTest
  623. [INFO] Running org.openmrs.OrderGroupTest
  624. [INFO] Tests run: 3, Failures: 0, Errors: 0, Skipped: 0, Time elapsed: 0.007 s - in org.openmrs.OrderGroupTest
  625. [INFO] Running org.openmrs.OrderTest
  626. [INFO] Tests run: 64, Failures: 0, Errors: 0, Skipped: 0, Time elapsed: 3.454 s - in org.openmrs.OrderTest
  627. [INFO] Running org.openmrs.OrderTypeTest
  628. [INFO] Tests run: 3, Failures: 0, Errors: 0, Skipped: 0, Time elapsed: 0.008 s - in org.openmrs.OrderTypeTest
  629. [INFO] Running org.openmrs.patient.impl.LuhnIdentifierValidatorTest
  630. [INFO] Tests run: 3, Failures: 0, Errors: 0, Skipped: 0, Time elapsed: 0.01 s - in org.openmrs.patient.impl.LuhnIdentifierValidatorTest
  631. [INFO] Running org.openmrs.patient.impl.VerhoeffIdentifierValidatorTest
  632. [INFO] Tests run: 8, Failures: 0, Errors: 0, Skipped: 0, Time elapsed: 0.046 s - in org.openmrs.patient.impl.VerhoeffIdentifierValidatorTest
  633. [INFO] Running org.openmrs.PatientProgramTest
  634. [INFO] Tests run: 5, Failures: 0, Errors: 0, Skipped: 0, Time elapsed: 0.003 s - in org.openmrs.PatientProgramTest
  635. [INFO] Running org.openmrs.PatientStateTest
  636. [INFO] Tests run: 13, Failures: 0, Errors: 0, Skipped: 0, Time elapsed: 0.01 s - in org.openmrs.PatientStateTest
  637. [INFO] Running org.openmrs.PatientTest
  638. [INFO] Tests run: 9, Failures: 0, Errors: 0, Skipped: 0, Time elapsed: 0.007 s - in org.openmrs.PatientTest
  639. [INFO] Running org.openmrs.PersonAddressTest
  640. [INFO] Tests run: 15, Failures: 0, Errors: 0, Skipped: 0, Time elapsed: 0.024 s - in org.openmrs.PersonAddressTest
  641. [INFO] Running org.openmrs.PersonAttributeTest
  642. [INFO] Tests run: 6, Failures: 0, Errors: 0, Skipped: 0, Time elapsed: 3.717 s - in org.openmrs.PersonAttributeTest
  643. [INFO] Running org.openmrs.PersonNameTest
  644. [INFO] Tests run: 19, Failures: 0, Errors: 0, Skipped: 0, Time elapsed: 0.003 s - in org.openmrs.PersonNameTest
  645. [INFO] Running org.openmrs.PersonTest
  646. [INFO] Tests run: 36, Failures: 0, Errors: 0, Skipped: 0, Time elapsed: 2.844 s - in org.openmrs.PersonTest
  647. [INFO] Running org.openmrs.propertyeditor.CohortEditorTest
  648. [INFO] Tests run: 8, Failures: 0, Errors: 0, Skipped: 0, Time elapsed: 3.345 s - in org.openmrs.propertyeditor.CohortEditorTest
  649. [INFO] Running org.openmrs.propertyeditor.ConceptAnswerEditorTest
  650. [INFO] Tests run: 8, Failures: 0, Errors: 0, Skipped: 0, Time elapsed: 2.709 s - in org.openmrs.propertyeditor.ConceptAnswerEditorTest
  651. [INFO] Running org.openmrs.propertyeditor.ConceptAnswersEditorTest
  652. [INFO] Tests run: 1, Failures: 0, Errors: 0, Skipped: 0, Time elapsed: 2.643 s - in org.openmrs.propertyeditor.ConceptAnswersEditorTest
  653. [INFO] Running org.openmrs.propertyeditor.ConceptAttributeTypeEditorTest
  654. [INFO] Tests run: 8, Failures: 0, Errors: 0, Skipped: 0, Time elapsed: 2.775 s - in org.openmrs.propertyeditor.ConceptAttributeTypeEditorTest
  655. [INFO] Running org.openmrs.propertyeditor.ConceptClassEditorTest
  656. [INFO] Tests run: 8, Failures: 0, Errors: 0, Skipped: 0, Time elapsed: 2.388 s - in org.openmrs.propertyeditor.ConceptClassEditorTest
  657. [INFO] Running org.openmrs.propertyeditor.ConceptDatatypeEditorTest
  658. [INFO] Tests run: 8, Failures: 0, Errors: 0, Skipped: 0, Time elapsed: 2.311 s - in org.openmrs.propertyeditor.ConceptDatatypeEditorTest
  659. [INFO] Running org.openmrs.propertyeditor.ConceptEditorTest
  660. [INFO] Tests run: 8, Failures: 0, Errors: 0, Skipped: 0, Time elapsed: 2.407 s - in org.openmrs.propertyeditor.ConceptEditorTest
  661. [INFO] Running org.openmrs.propertyeditor.ConceptMapTypeEditorTest
  662. [INFO] Tests run: 8, Failures: 0, Errors: 0, Skipped: 0, Time elapsed: 2.6 s - in org.openmrs.propertyeditor.ConceptMapTypeEditorTest
  663. [INFO] Running org.openmrs.propertyeditor.ConceptNameEditorTest
  664. [INFO] Tests run: 8, Failures: 0, Errors: 0, Skipped: 0, Time elapsed: 2.451 s - in org.openmrs.propertyeditor.ConceptNameEditorTest
  665. [INFO] Running org.openmrs.propertyeditor.ConceptNumericEditorTest
  666. [INFO] Tests run: 8, Failures: 0, Errors: 0, Skipped: 0, Time elapsed: 2.288 s - in org.openmrs.propertyeditor.ConceptNumericEditorTest
  667. [INFO] Running org.openmrs.propertyeditor.ConceptReferenceTermEditorTest
  668. [INFO] Tests run: 8, Failures: 0, Errors: 0, Skipped: 0, Time elapsed: 2.677 s - in org.openmrs.propertyeditor.ConceptReferenceTermEditorTest
  669. [INFO] Running org.openmrs.propertyeditor.ConceptSourceEditorTest
  670. [INFO] Tests run: 8, Failures: 0, Errors: 0, Skipped: 0, Time elapsed: 5.432 s - in org.openmrs.propertyeditor.ConceptSourceEditorTest
  671. [INFO] Running org.openmrs.propertyeditor.DateOrDatetimeEditorTest
  672. [INFO] Tests run: 6, Failures: 0, Errors: 0, Skipped: 0, Time elapsed: 0.004 s - in org.openmrs.propertyeditor.DateOrDatetimeEditorTest
  673. [INFO] Running org.openmrs.propertyeditor.DrugEditorTest
  674. [INFO] Tests run: 8, Failures: 0, Errors: 0, Skipped: 0, Time elapsed: 2.654 s - in org.openmrs.propertyeditor.DrugEditorTest
  675. [INFO] Running org.openmrs.propertyeditor.EncounterEditorTest
  676. [INFO] Tests run: 8, Failures: 0, Errors: 0, Skipped: 0, Time elapsed: 2.417 s - in org.openmrs.propertyeditor.EncounterEditorTest
  677. [INFO] Running org.openmrs.propertyeditor.EncounterTypeEditorTest
  678. [INFO] Tests run: 8, Failures: 0, Errors: 0, Skipped: 0, Time elapsed: 2.422 s - in org.openmrs.propertyeditor.EncounterTypeEditorTest
  679. [INFO] Running org.openmrs.propertyeditor.FormEditorTest
  680. [INFO] Tests run: 8, Failures: 0, Errors: 0, Skipped: 0, Time elapsed: 2.813 s - in org.openmrs.propertyeditor.FormEditorTest
  681. [INFO] Running org.openmrs.propertyeditor.LocationAttributeTypeEditorTest
  682. [INFO] Tests run: 8, Failures: 0, Errors: 0, Skipped: 0, Time elapsed: 2.705 s - in org.openmrs.propertyeditor.LocationAttributeTypeEditorTest
  683. [INFO] Running org.openmrs.propertyeditor.LocationEditorTest
  684. [INFO] Tests run: 8, Failures: 0, Errors: 0, Skipped: 0, Time elapsed: 2.387 s - in org.openmrs.propertyeditor.LocationEditorTest
  685. [INFO] Running org.openmrs.propertyeditor.LocationTagEditorTest
  686. [INFO] Tests run: 8, Failures: 0, Errors: 0, Skipped: 0, Time elapsed: 3.43 s - in org.openmrs.propertyeditor.LocationTagEditorTest
  687. [INFO] Running org.openmrs.propertyeditor.OrderEditorTest
  688. [INFO] Tests run: 8, Failures: 0, Errors: 0, Skipped: 0, Time elapsed: 2.164 s - in org.openmrs.propertyeditor.OrderEditorTest
  689. [INFO] Running org.openmrs.propertyeditor.PatientEditorTest
  690. [INFO] Tests run: 8, Failures: 0, Errors: 0, Skipped: 0, Time elapsed: 2.361 s - in org.openmrs.propertyeditor.PatientEditorTest
  691. [INFO] Running org.openmrs.propertyeditor.PatientIdentifierTypeEditorTest
  692. [INFO] Tests run: 8, Failures: 0, Errors: 0, Skipped: 0, Time elapsed: 2.43 s - in org.openmrs.propertyeditor.PatientIdentifierTypeEditorTest
  693. [INFO] Running org.openmrs.propertyeditor.PersonAttributeEditorTest
  694. [INFO] Tests run: 8, Failures: 0, Errors: 0, Skipped: 0, Time elapsed: 2.431 s - in org.openmrs.propertyeditor.PersonAttributeEditorTest
  695. [INFO] Running org.openmrs.propertyeditor.PersonAttributeTypeEditorTest
  696. [INFO] Tests run: 8, Failures: 0, Errors: 0, Skipped: 0, Time elapsed: 2.418 s - in org.openmrs.propertyeditor.PersonAttributeTypeEditorTest
  697. [INFO] Running org.openmrs.propertyeditor.PersonEditorTest
  698. [INFO] Tests run: 8, Failures: 0, Errors: 0, Skipped: 0, Time elapsed: 2.398 s - in org.openmrs.propertyeditor.PersonEditorTest
  699. [INFO] Running org.openmrs.propertyeditor.PrivilegeEditorTest
  700. [INFO] Tests run: 2, Failures: 0, Errors: 0, Skipped: 0, Time elapsed: 2.959 s - in org.openmrs.propertyeditor.PrivilegeEditorTest
  701. [INFO] Running org.openmrs.propertyeditor.ProgramEditorTest
  702. [INFO] Tests run: 4, Failures: 0, Errors: 0, Skipped: 0, Time elapsed: 2.322 s - in org.openmrs.propertyeditor.ProgramEditorTest
  703. [INFO] Running org.openmrs.propertyeditor.ProgramWorkflowEditorTest
  704. [INFO] Tests run: 8, Failures: 0, Errors: 0, Skipped: 0, Time elapsed: 2.469 s - in org.openmrs.propertyeditor.ProgramWorkflowEditorTest
  705. [INFO] Running org.openmrs.propertyeditor.ProgramWorkflowStateEditorTest
  706. [INFO] Tests run: 8, Failures: 0, Errors: 0, Skipped: 0, Time elapsed: 2.428 s - in org.openmrs.propertyeditor.ProgramWorkflowStateEditorTest
  707. [INFO] Running org.openmrs.propertyeditor.ProviderEditorTest
  708. [WARNING] Tests run: 8, Failures: 0, Errors: 0, Skipped: 1, Time elapsed: 2.293 s - in org.openmrs.propertyeditor.ProviderEditorTest
  709. [INFO] Running org.openmrs.propertyeditor.RoleEditorTest
  710. [INFO] Tests run: 2, Failures: 0, Errors: 0, Skipped: 0, Time elapsed: 2.585 s - in org.openmrs.propertyeditor.RoleEditorTest
  711. [INFO] Running org.openmrs.propertyeditor.UserEditorTest
  712. [INFO] Tests run: 8, Failures: 0, Errors: 0, Skipped: 0, Time elapsed: 2.561 s - in org.openmrs.propertyeditor.UserEditorTest
  713. [INFO] Running org.openmrs.propertyeditor.VisitEditorTest
  714. [INFO] Tests run: 8, Failures: 0, Errors: 0, Skipped: 0, Time elapsed: 2.312 s - in org.openmrs.propertyeditor.VisitEditorTest
  715. [INFO] Running org.openmrs.propertyeditor.VisitTypeEditorTest
  716. [INFO] Tests run: 8, Failures: 0, Errors: 0, Skipped: 0, Time elapsed: 4.243 s - in org.openmrs.propertyeditor.VisitTypeEditorTest
  717. [INFO] Running org.openmrs.propertyeditor.WorkflowCollectionEditorTest
  718. [INFO] Tests run: 1, Failures: 0, Errors: 0, Skipped: 0, Time elapsed: 3.414 s - in org.openmrs.propertyeditor.WorkflowCollectionEditorTest
  719. [INFO] Running org.openmrs.ProviderTest
  720. [INFO] Tests run: 2, Failures: 0, Errors: 0, Skipped: 0, Time elapsed: 0.009 s - in org.openmrs.ProviderTest
  721. [INFO] Running org.openmrs.RoleTest
  722. [INFO] Tests run: 8, Failures: 0, Errors: 0, Skipped: 0, Time elapsed: 0.002 s - in org.openmrs.RoleTest
  723. [INFO] Running org.openmrs.scheduler.SchedulerServiceTest
  724. [WARNING] Tests run: 1, Failures: 0, Errors: 0, Skipped: 1, Time elapsed: 0.004 s - in org.openmrs.scheduler.SchedulerServiceTest
  725. [INFO] Running org.openmrs.scheduler.SchedulerUtilTest
  726. [INFO] Tests run: 1, Failures: 0, Errors: 0, Skipped: 0, Time elapsed: 0.01 s - in org.openmrs.scheduler.SchedulerUtilTest
  727. [INFO] Running org.openmrs.scheduler.timer.TimerSchedulerServiceImplTest
  728. [INFO] Tests run: 1, Failures: 0, Errors: 0, Skipped: 0, Time elapsed: 2.155 s - in org.openmrs.scheduler.timer.TimerSchedulerServiceImplTest
  729. [INFO] Running org.openmrs.serialization.JavaSerializationTest
  730. [INFO] Tests run: 2, Failures: 0, Errors: 0, Skipped: 0, Time elapsed: 0.024 s - in org.openmrs.serialization.JavaSerializationTest
  731. [INFO] Running org.openmrs.serialization.SimpleXStreamSerializerTest
  732. Security framework of XStream not explicitly initialized, using predefined black list on your own risk.
  733. Security framework of XStream not explicitly initialized, using predefined black list on your own risk.
  734. Security framework of XStream not explicitly initialized, using predefined black list on your own risk.
  735. [INFO] Tests run: 5, Failures: 0, Errors: 0, Skipped: 0, Time elapsed: 0.051 s - in org.openmrs.serialization.SimpleXStreamSerializerTest
  736. [INFO] Running org.openmrs.SimpleDosingInstructionsTest
  737. [INFO] Tests run: 10, Failures: 0, Errors: 0, Skipped: 0, Time elapsed: 2.488 s - in org.openmrs.SimpleDosingInstructionsTest
  738. [INFO] Running org.openmrs.test.matchers.HasFieldErrorsTest
  739. [INFO] Tests run: 13, Failures: 0, Errors: 0, Skipped: 0, Time elapsed: 0.007 s - in org.openmrs.test.matchers.HasFieldErrorsTest
  740. [INFO] Running org.openmrs.test.matchers.HasGlobalErrorsTest
  741. [INFO] Tests run: 7, Failures: 0, Errors: 0, Skipped: 0, Time elapsed: 0.007 s - in org.openmrs.test.matchers.HasGlobalErrorsTest
  742. [INFO] Running org.openmrs.TestOrderTest
  743. [INFO] Tests run: 4, Failures: 0, Errors: 0, Skipped: 0, Time elapsed: 0.014 s - in org.openmrs.TestOrderTest
  744. [INFO] Running org.openmrs.UserTest
  745. [INFO] Tests run: 9, Failures: 0, Errors: 0, Skipped: 0, Time elapsed: 0.004 s - in org.openmrs.UserTest
  746. [INFO] Running org.openmrs.util.databasechange.ClassLoaderFileOpenerTest
  747. [INFO] Tests run: 3, Failures: 0, Errors: 0, Skipped: 0, Time elapsed: 0.019 s - in org.openmrs.util.databasechange.ClassLoaderFileOpenerTest
  748. [INFO] Running org.openmrs.util.DatabaseUpdaterTest
  749. [INFO] Tests run: 5, Failures: 0, Errors: 0, Skipped: 0, Time elapsed: 14.246 s - in org.openmrs.util.DatabaseUpdaterTest
  750. [INFO] Running org.openmrs.util.DateUtilTest
  751. [INFO] Tests run: 1, Failures: 0, Errors: 0, Skipped: 0, Time elapsed: 0.007 s - in org.openmrs.util.DateUtilTest
  752. [INFO] Running org.openmrs.util.DoubleRangeTest
  753. [INFO] Tests run: 28, Failures: 0, Errors: 0, Skipped: 0, Time elapsed: 0.009 s - in org.openmrs.util.DoubleRangeTest
  754. [INFO] Running org.openmrs.util.DrugsByNameComparatorTest
  755. [INFO] Tests run: 4, Failures: 0, Errors: 0, Skipped: 0, Time elapsed: 0.008 s - in org.openmrs.util.DrugsByNameComparatorTest
  756. [INFO] Running org.openmrs.util.ExceptionUtilTest
  757. [INFO] Tests run: 1, Failures: 0, Errors: 0, Skipped: 0, Time elapsed: 0.005 s - in org.openmrs.util.ExceptionUtilTest
  758. [INFO] Running org.openmrs.util.FormatTest
  759. [INFO] Tests run: 8, Failures: 0, Errors: 0, Skipped: 0, Time elapsed: 0.006 s - in org.openmrs.util.FormatTest
  760. [INFO] Running org.openmrs.util.GraphTest
  761. [INFO] Tests run: 2, Failures: 0, Errors: 0, Skipped: 0, Time elapsed: 0.003 s - in org.openmrs.util.GraphTest
  762. [INFO] Running org.openmrs.util.HandlerUtilTest
  763. [INFO] Tests run: 6, Failures: 0, Errors: 0, Skipped: 0, Time elapsed: 2.373 s - in org.openmrs.util.HandlerUtilTest
  764. [INFO] Running org.openmrs.util.HttpClientTest
  765. [INFO] Tests run: 1, Failures: 0, Errors: 0, Skipped: 0, Time elapsed: 0.115 s - in org.openmrs.util.HttpClientTest
  766. [INFO] Running org.openmrs.util.HttpUrlTest
  767. [INFO] Tests run: 6, Failures: 0, Errors: 0, Skipped: 0, Time elapsed: 0.005 s - in org.openmrs.util.HttpUrlTest
  768. [INFO] Running org.openmrs.util.JavaVersionTest
  769. [INFO] Tests run: 1, Failures: 0, Errors: 0, Skipped: 0, Time elapsed: 0.004 s - in org.openmrs.util.JavaVersionTest
  770. [INFO] Running org.openmrs.util.LocaleUtilityTest
  771. [INFO] Tests run: 21, Failures: 0, Errors: 0, Skipped: 0, Time elapsed: 3.162 s - in org.openmrs.util.LocaleUtilityTest
  772. [INFO] Running org.openmrs.util.LocationUtilityTest
  773. [INFO] Tests run: 2, Failures: 0, Errors: 0, Skipped: 0, Time elapsed: 2.432 s - in org.openmrs.util.LocationUtilityTest
  774. [INFO] Running org.openmrs.util.Log4JCompatibilityTest
  775. [INFO] Tests run: 1, Failures: 0, Errors: 0, Skipped: 0, Time elapsed: 0.115 s - in org.openmrs.util.Log4JCompatibilityTest
  776. [INFO] Running org.openmrs.util.MemoryAppenderTest
  777. [INFO] Tests run: 3, Failures: 0, Errors: 0, Skipped: 0, Time elapsed: 0.033 s - in org.openmrs.util.MemoryAppenderTest
  778. [INFO] Running org.openmrs.util.NaturalStringsTest
  779. [INFO] Tests run: 40, Failures: 0, Errors: 0, Skipped: 0, Time elapsed: 0.006 s - in org.openmrs.util.NaturalStringsTest
  780. [INFO] Running org.openmrs.util.OpenmrsSecurityManagerTest
  781. [INFO] Tests run: 2, Failures: 0, Errors: 0, Skipped: 0, Time elapsed: 0.008 s - in org.openmrs.util.OpenmrsSecurityManagerTest
  782. [INFO] Running org.openmrs.util.OpenmrsUtilTest
  783. DEBUG - LoggingAdvice.invoke(115) |2021-02-19T11:44:39,564| In method AdministrationService.getGlobalProperty. Arguments: String=log.level, String=,
  784. DEBUG - LoggingAdvice.invoke(115) |2021-02-19T11:44:39,569| In method AdministrationService.getGlobalProperty. Arguments: String=log.level,
  785. DEBUG - LoggingAdvice.invoke(155) |2021-02-19T11:44:39,570| Exiting method getGlobalProperty. execution time: 2 ms
  786. DEBUG - LoggingAdvice.invoke(155) |2021-02-19T11:44:39,571| Exiting method getGlobalProperty. execution time: 8 ms
  787. WARN - OpenmrsUtil.applyLogLevel(637) |2021-02-19T11:44:41,081| Log level invalid string is invalid. Valid values are trace, debug, info, warn, error or fatal
  788. DEBUG - LoggingAdvice.invoke(115) |2021-02-19T11:44:43,323| In method AdministrationService.getGlobalProperty. Arguments: String=log.level, String=,
  789. DEBUG - LoggingAdvice.invoke(115) |2021-02-19T11:44:43,324| In method AdministrationService.getGlobalProperty. Arguments: String=log.level,
  790. DEBUG - LoggingAdvice.invoke(155) |2021-02-19T11:44:43,326| Exiting method getGlobalProperty. execution time: 1 ms
  791. DEBUG - LoggingAdvice.invoke(155) |2021-02-19T11:44:43,326| Exiting method getGlobalProperty. execution time: 4 ms
  792. [INFO] Tests run: 57, Failures: 0, Errors: 0, Skipped: 0, Time elapsed: 8.39 s - in org.openmrs.util.OpenmrsUtilTest
  793. [INFO] Running org.openmrs.util.OpenmrsUtilUnitTest
  794. [INFO] Tests run: 49, Failures: 0, Errors: 0, Skipped: 0, Time elapsed: 0.01 s - in org.openmrs.util.OpenmrsUtilUnitTest
  795. [INFO] Running org.openmrs.util.PersonByNameComparatorTest
  796. [INFO] Tests run: 4, Failures: 0, Errors: 0, Skipped: 0, Time elapsed: 0.004 s - in org.openmrs.util.PersonByNameComparatorTest
  797. [INFO] Running org.openmrs.util.ProviderByPersonNameComparatorTest
  798. [INFO] Tests run: 6, Failures: 0, Errors: 0, Skipped: 0, Time elapsed: 0.006 s - in org.openmrs.util.ProviderByPersonNameComparatorTest
  799. [INFO] Running org.openmrs.util.ReflectTest
  800. [INFO] Tests run: 18, Failures: 0, Errors: 0, Skipped: 0, Time elapsed: 0.003 s - in org.openmrs.util.ReflectTest
  801. [INFO] Running org.openmrs.util.SecurityTest
  802. [INFO] Tests run: 7, Failures: 0, Errors: 0, Skipped: 0, Time elapsed: 0.511 s - in org.openmrs.util.SecurityTest
  803. [INFO] Running org.openmrs.util.UpgradeUtilTest
  804. [INFO] Tests run: 2, Failures: 0, Errors: 0, Skipped: 0, Time elapsed: 2.419 s - in org.openmrs.util.UpgradeUtilTest
  805. [INFO] Running org.openmrs.util.UserByNameComparatorTest
  806. [INFO] Tests run: 1, Failures: 0, Errors: 0, Skipped: 0, Time elapsed: 0.005 s - in org.openmrs.util.UserByNameComparatorTest
  807. [INFO] Running org.openmrs.validator.AlertValidatorTest
  808. [INFO] Tests run: 5, Failures: 0, Errors: 0, Skipped: 0, Time elapsed: 2.304 s - in org.openmrs.validator.AlertValidatorTest
  809. [INFO] Running org.openmrs.validator.AllergyValidatorTest
  810. [INFO] Tests run: 9, Failures: 0, Errors: 0, Skipped: 0, Time elapsed: 0.307 s - in org.openmrs.validator.AllergyValidatorTest
  811. [INFO] Running org.openmrs.validator.BaseAttributeTypeValidatorTest
  812. [INFO] Tests run: 16, Failures: 0, Errors: 0, Skipped: 0, Time elapsed: 6.761 s - in org.openmrs.validator.BaseAttributeTypeValidatorTest
  813. [INFO] Running org.openmrs.validator.CohortValidatorTest
  814. [INFO] Tests run: 7, Failures: 0, Errors: 0, Skipped: 0, Time elapsed: 3.084 s - in org.openmrs.validator.CohortValidatorTest
  815. [INFO] Running org.openmrs.validator.ConceptAttributeTypeValidatorTest
  816. [INFO] Tests run: 8, Failures: 0, Errors: 0, Skipped: 0, Time elapsed: 4.587 s - in org.openmrs.validator.ConceptAttributeTypeValidatorTest
  817. [INFO] Running org.openmrs.validator.ConceptClassValidatorTest
  818. [INFO] Tests run: 6, Failures: 0, Errors: 0, Skipped: 0, Time elapsed: 3.082 s - in org.openmrs.validator.ConceptClassValidatorTest
  819. [INFO] Running org.openmrs.validator.ConceptDatatypeValidatorTest
  820. [INFO] Tests run: 5, Failures: 0, Errors: 0, Skipped: 0, Time elapsed: 2.251 s - in org.openmrs.validator.ConceptDatatypeValidatorTest
  821. [INFO] Running org.openmrs.validator.ConceptDrugValidatorTest
  822. [INFO] Tests run: 3, Failures: 0, Errors: 0, Skipped: 0, Time elapsed: 0.004 s - in org.openmrs.validator.ConceptDrugValidatorTest
  823. [INFO] Running org.openmrs.validator.ConceptMapTypeValidatorTest
  824. [INFO] Tests run: 8, Failures: 0, Errors: 0, Skipped: 0, Time elapsed: 2.812 s - in org.openmrs.validator.ConceptMapTypeValidatorTest
  825. [INFO] Running org.openmrs.validator.ConceptNameTagValidatorTest
  826. [INFO] Tests run: 7, Failures: 0, Errors: 0, Skipped: 0, Time elapsed: 2.477 s - in org.openmrs.validator.ConceptNameTagValidatorTest
  827. [INFO] Running org.openmrs.validator.ConceptReferenceTermValidatorTest
  828. [Field error in object 'term' on field 'conceptReferenceTermMaps[1].termB': rejected value [weight term(WGT234)]; codes [ConceptReferenceTerm.termToTerm.alreadyMapped.term.conceptReferenceTermMaps[1].termB,ConceptReferenceTerm.termToTerm.alreadyMapped.term.conceptReferenceTermMaps.termB,ConceptReferenceTerm.termToTerm.alreadyMapped.conceptReferenceTermMaps[1].termB,ConceptReferenceTerm.termToTerm.alreadyMapped.conceptReferenceTermMaps.termB,ConceptReferenceTerm.termToTerm.alreadyMapped.termB,ConceptReferenceTerm.termToTerm.alreadyMapped.org.openmrs.ConceptReferenceTerm,ConceptReferenceTerm.termToTerm.alreadyMapped]; arguments []; default message [Cannot map a reference term multiple times to the same concept reference term]]
  829. [WARNING] Tests run: 18, Failures: 0, Errors: 0, Skipped: 3, Time elapsed: 3.295 s - in org.openmrs.validator.ConceptReferenceTermValidatorTest
  830. [INFO] Running org.openmrs.validator.ConceptSourceValidatorTest
  831. [INFO] Tests run: 6, Failures: 0, Errors: 0, Skipped: 0, Time elapsed: 3.083 s - in org.openmrs.validator.ConceptSourceValidatorTest
  832. [INFO] Running org.openmrs.validator.ConceptValidatorTest
  833. [INFO] Tests run: 31, Failures: 0, Errors: 0, Skipped: 0, Time elapsed: 3.808 s - in org.openmrs.validator.ConceptValidatorTest
  834. [INFO] Running org.openmrs.validator.ConditionValidatorTest
  835. [INFO] Tests run: 4, Failures: 0, Errors: 0, Skipped: 0, Time elapsed: 0.004 s - in org.openmrs.validator.ConditionValidatorTest
  836. [INFO] Running org.openmrs.validator.DiagnosisValidatorTest
  837. [INFO] Tests run: 6, Failures: 0, Errors: 0, Skipped: 0, Time elapsed: 3.186 s - in org.openmrs.validator.DiagnosisValidatorTest
  838. [INFO] Running org.openmrs.validator.DrugOrderValidatorTest
  839. [INFO] Tests run: 37, Failures: 0, Errors: 0, Skipped: 0, Time elapsed: 6.02 s - in org.openmrs.validator.DrugOrderValidatorTest
  840. [INFO] Running org.openmrs.validator.DrugValidatorTest
  841. [INFO] Tests run: 9, Failures: 0, Errors: 0, Skipped: 0, Time elapsed: 2.826 s - in org.openmrs.validator.DrugValidatorTest
  842. [INFO] Running org.openmrs.validator.EncounterRoleValidatorTest
  843. [INFO] Tests run: 5, Failures: 0, Errors: 0, Skipped: 0, Time elapsed: 2.259 s - in org.openmrs.validator.EncounterRoleValidatorTest
  844. [INFO] Running org.openmrs.validator.EncounterTypeValidatorTest
  845. [INFO] Tests run: 7, Failures: 0, Errors: 0, Skipped: 0, Time elapsed: 2.39 s - in org.openmrs.validator.EncounterTypeValidatorTest
  846. [INFO] Running org.openmrs.validator.EncounterValidatorTest
  847. [INFO] Tests run: 12, Failures: 0, Errors: 0, Skipped: 0, Time elapsed: 2.388 s - in org.openmrs.validator.EncounterValidatorTest
  848. [INFO] Running org.openmrs.validator.FieldTypeValidatorTest
  849. [INFO] Tests run: 5, Failures: 0, Errors: 0, Skipped: 0, Time elapsed: 2.523 s - in org.openmrs.validator.FieldTypeValidatorTest
  850. [INFO] Running org.openmrs.validator.FieldValidatorTest
  851. [INFO] Tests run: 8, Failures: 0, Errors: 0, Skipped: 0, Time elapsed: 2.364 s - in org.openmrs.validator.FieldValidatorTest
  852. [INFO] Running org.openmrs.validator.FormValidatorTest
  853. [INFO] Tests run: 8, Failures: 0, Errors: 0, Skipped: 0, Time elapsed: 2.801 s - in org.openmrs.validator.FormValidatorTest
  854. [INFO] Running org.openmrs.validator.HL7SourceValidatorTest
  855. [INFO] Tests run: 2, Failures: 0, Errors: 0, Skipped: 0, Time elapsed: 2.222 s - in org.openmrs.validator.HL7SourceValidatorTest
  856. [INFO] Running org.openmrs.validator.ImplementationIdValidatorTest
  857. [INFO] Tests run: 8, Failures: 0, Errors: 0, Skipped: 0, Time elapsed: 3 s - in org.openmrs.validator.ImplementationIdValidatorTest
  858. [INFO] Running org.openmrs.validator.LocationAttributeTypeValidatorTest
  859. [INFO] Tests run: 6, Failures: 0, Errors: 0, Skipped: 0, Time elapsed: 3.348 s - in org.openmrs.validator.LocationAttributeTypeValidatorTest
  860. [INFO] Running org.openmrs.validator.LocationTagValidatorTest
  861. [INFO] Tests run: 2, Failures: 0, Errors: 0, Skipped: 0, Time elapsed: 4.64 s - in org.openmrs.validator.LocationTagValidatorTest
  862. [INFO] Running org.openmrs.validator.LocationValidatorTest
  863. [INFO] Tests run: 9, Failures: 0, Errors: 0, Skipped: 0, Time elapsed: 2.4 s - in org.openmrs.validator.LocationValidatorTest
  864. [INFO] Running org.openmrs.validator.ObsValidatorTest
  865. [INFO] Tests run: 22, Failures: 0, Errors: 0, Skipped: 0, Time elapsed: 2.541 s - in org.openmrs.validator.ObsValidatorTest
  866. [INFO] Running org.openmrs.validator.OrderFrequencyValidatorTest
  867. [INFO] Tests run: 9, Failures: 0, Errors: 0, Skipped: 0, Time elapsed: 3.143 s - in org.openmrs.validator.OrderFrequencyValidatorTest
  868. [INFO] Running org.openmrs.validator.OrderTypeValidatorTest
  869. [INFO] Tests run: 14, Failures: 0, Errors: 0, Skipped: 0, Time elapsed: 2.691 s - in org.openmrs.validator.OrderTypeValidatorTest
  870. [INFO] Running org.openmrs.validator.OrderValidatorTest
  871. [INFO] Tests run: 22, Failures: 0, Errors: 0, Skipped: 0, Time elapsed: 3.12 s - in org.openmrs.validator.OrderValidatorTest
  872. [INFO] Running org.openmrs.validator.PatientIdentifierTypeValidatorTest
  873. [INFO] Tests run: 9, Failures: 0, Errors: 0, Skipped: 0, Time elapsed: 2.235 s - in org.openmrs.validator.PatientIdentifierTypeValidatorTest
  874. [INFO] Running org.openmrs.validator.PatientIdentifierValidatorTest
  875. [INFO] Tests run: 20, Failures: 0, Errors: 0, Skipped: 0, Time elapsed: 2.401 s - in org.openmrs.validator.PatientIdentifierValidatorTest
  876. [INFO] Running org.openmrs.validator.PatientProgramValidatorTest
  877. [INFO] Tests run: 22, Failures: 0, Errors: 0, Skipped: 0, Time elapsed: 2.355 s - in org.openmrs.validator.PatientProgramValidatorTest
  878. [INFO] Running org.openmrs.validator.PatientValidatorTest
  879. [INFO] Tests run: 17, Failures: 0, Errors: 0, Skipped: 0, Time elapsed: 2.101 s - in org.openmrs.validator.PatientValidatorTest
  880. [INFO] Running org.openmrs.validator.PersonAddressValidatorTest
  881. [INFO] Tests run: 10, Failures: 0, Errors: 0, Skipped: 0, Time elapsed: 2.261 s - in org.openmrs.validator.PersonAddressValidatorTest
  882. [INFO] Running org.openmrs.validator.PersonAttributeTypeValidatorTest
  883. [INFO] Tests run: 7, Failures: 0, Errors: 0, Skipped: 0, Time elapsed: 2.187 s - in org.openmrs.validator.PersonAttributeTypeValidatorTest
  884. [INFO] Running org.openmrs.validator.PersonMergeLogValidatorTest
  885. [INFO] Tests run: 6, Failures: 0, Errors: 0, Skipped: 0, Time elapsed: 2.138 s - in org.openmrs.validator.PersonMergeLogValidatorTest
  886. [INFO] Running org.openmrs.validator.PersonNameValidatorTest
  887. [WARNING] Tests run: 59, Failures: 0, Errors: 0, Skipped: 8, Time elapsed: 3.121 s - in org.openmrs.validator.PersonNameValidatorTest
  888. [INFO] Running org.openmrs.validator.PersonValidatorTest
  889. [INFO] Tests run: 13, Failures: 0, Errors: 0, Skipped: 0, Time elapsed: 2.203 s - in org.openmrs.validator.PersonValidatorTest
  890. [INFO] Running org.openmrs.validator.PrivilegeValidatorTest
  891. [INFO] Tests run: 5, Failures: 0, Errors: 0, Skipped: 0, Time elapsed: 2.165 s - in org.openmrs.validator.PrivilegeValidatorTest
  892. [INFO] Running org.openmrs.validator.ProgramValidatorTest
  893. [INFO] Tests run: 8, Failures: 0, Errors: 0, Skipped: 0, Time elapsed: 2.17 s - in org.openmrs.validator.ProgramValidatorTest
  894. [INFO] Running org.openmrs.validator.ProviderAttributeTypeValidatorTest
  895. [INFO] Tests run: 2, Failures: 0, Errors: 0, Skipped: 0, Time elapsed: 2.236 s - in org.openmrs.validator.ProviderAttributeTypeValidatorTest
  896. [INFO] Running org.openmrs.validator.ProviderValidatorTest
  897. [INFO] Tests run: 13, Failures: 0, Errors: 0, Skipped: 0, Time elapsed: 2.533 s - in org.openmrs.validator.ProviderValidatorTest
  898. [INFO] Running org.openmrs.validator.RelationshipTypeValidatorTest
  899. [INFO] Tests run: 7, Failures: 0, Errors: 0, Skipped: 0, Time elapsed: 2.145 s - in org.openmrs.validator.RelationshipTypeValidatorTest
  900. [INFO] Running org.openmrs.validator.RelationshipValidatorTest
  901. [INFO] Tests run: 7, Failures: 0, Errors: 0, Skipped: 0, Time elapsed: 2.925 s - in org.openmrs.validator.RelationshipValidatorTest
  902. [INFO] Running org.openmrs.validator.RequireNameValidatorTest
  903. [INFO] Tests run: 2, Failures: 0, Errors: 0, Skipped: 0, Time elapsed: 0.008 s - in org.openmrs.validator.RequireNameValidatorTest
  904. [INFO] Running org.openmrs.validator.RoleValidatorTest
  905. [INFO] Tests run: 6, Failures: 0, Errors: 0, Skipped: 0, Time elapsed: 2.247 s - in org.openmrs.validator.RoleValidatorTest
  906. [INFO] Running org.openmrs.validator.SchedulerFormValidatorTest
  907. [INFO] Tests run: 10, Failures: 0, Errors: 0, Skipped: 0, Time elapsed: 2.302 s - in org.openmrs.validator.SchedulerFormValidatorTest
  908. [INFO] Running org.openmrs.validator.StateConversionValidatorTest
  909. [INFO] Tests run: 4, Failures: 0, Errors: 0, Skipped: 0, Time elapsed: 3.34 s - in org.openmrs.validator.StateConversionValidatorTest
  910. [INFO] Running org.openmrs.validator.TestOrderValidatorTest
  911. [INFO] Tests run: 2, Failures: 0, Errors: 0, Skipped: 0, Time elapsed: 2.942 s - in org.openmrs.validator.TestOrderValidatorTest
  912. [INFO] Running org.openmrs.validator.UserValidatorTest
  913. [INFO] Tests run: 23, Failures: 0, Errors: 0, Skipped: 0, Time elapsed: 2.403 s - in org.openmrs.validator.UserValidatorTest
  914. [INFO] Running org.openmrs.validator.ValidateUtilTest
  915. [INFO] Tests run: 9, Failures: 0, Errors: 0, Skipped: 0, Time elapsed: 2.187 s - in org.openmrs.validator.ValidateUtilTest
  916. [INFO] Running org.openmrs.validator.VisitAttributeTypeValidatorTest
  917. [INFO] Tests run: 2, Failures: 0, Errors: 0, Skipped: 0, Time elapsed: 2.145 s - in org.openmrs.validator.VisitAttributeTypeValidatorTest
  918. [INFO] Running org.openmrs.validator.VisitTypeValidatorTest
  919. [INFO] Tests run: 2, Failures: 0, Errors: 0, Skipped: 0, Time elapsed: 2.189 s - in org.openmrs.validator.VisitTypeValidatorTest
  920. [INFO] Running org.openmrs.validator.VisitValidatorTest
  921. [WARNING] Tests run: 27, Failures: 0, Errors: 0, Skipped: 1, Time elapsed: 4.135 s - in org.openmrs.validator.VisitValidatorTest
  922. [INFO] Running org.openmrs.annotation.OpenmrsProfileExcludeFilterWithModulesJUnit4Test
  923. [INFO] Tests run: 1, Failures: 0, Errors: 0, Skipped: 0, Time elapsed: 3.982 s - in org.openmrs.annotation.OpenmrsProfileExcludeFilterWithModulesJUnit4Test
  924. [INFO] Running org.openmrs.annotation.StartModuleAnnotationJUnit4Test
  925. [INFO] Tests run: 1, Failures: 0, Errors: 0, Skipped: 0, Time elapsed: 3.882 s - in org.openmrs.annotation.StartModuleAnnotationJUnit4Test
  926. [INFO] Running org.openmrs.annotation.StartModuleAnnotationReuseJUnit4Test
  927. [INFO] Tests run: 1, Failures: 0, Errors: 0, Skipped: 0, Time elapsed: 3.354 s - in org.openmrs.annotation.StartModuleAnnotationReuseJUnit4Test
  928. [INFO] Running org.openmrs.util.ThreadSafeCircularFifoQueueTest
  929. [INFO] Tests run: 36, Failures: 0, Errors: 0, Skipped: 0, Time elapsed: 0.044 s - in org.openmrs.util.ThreadSafeCircularFifoQueueTest
  930. [INFO]
  931. [INFO] Results:
  932. [INFO]
  933. [ERROR] Failures:
  934. [ERROR] ModuleUtilTest.compareVersion_shouldTreatSNAPSHOTAsEarliestVersion:505 expected: <true> but was: <false>
  935. [INFO]
  936. [ERROR] Tests run: 4350, Failures: 1, Errors: 0, Skipped: 38
  937. [INFO]
  938. [INFO] ------------------------------------------------------------------------
  939. [INFO] Reactor Summary for OpenMRS 2.5.0-SNAPSHOT:
  940. [INFO]
  941. [INFO] OpenMRS ............................................ SUCCESS [ 3.344 s]
  942. [INFO] openmrs-tools ...................................... SUCCESS [ 1.823 s]
  943. [INFO] openmrs-test ....................................... SUCCESS [ 0.421 s]
  944. [INFO] openmrs-api ........................................ FAILURE [27:02 min]
  945. [INFO] openmrs-web ........................................ SKIPPED
  946. [INFO] openmrs-webapp ..................................... SKIPPED
  947. [INFO] openmrs-liquibase .................................. SKIPPED
  948. [INFO] ------------------------------------------------------------------------
  949. [INFO] BUILD FAILURE
  950. [INFO] ------------------------------------------------------------------------
  951. [INFO] Total time: 27:15 min
  952. [INFO] Finished at: 2021-02-19T11:47:33+03:00
  953. [INFO] ------------------------------------------------------------------------
  954. [ERROR] Failed to execute goal org.apache.maven.plugins:maven-surefire-plugin:2.22.2:test (default-test) on project openmrs-api: There are test failures.
  955. [ERROR]
  956. [ERROR] Please refer to C:\Users\Suubi-Joshua\TRUNK-4681\openmrs-core\api\target\surefire-reports for the individual test results.
  957. [ERROR] Please refer to dump files (if any exist) [date].dump, [date]-jvmRun[N].dump and [date].dumpstream.
  958. [ERROR] -> [Help 1]
  959. [ERROR]
  960. [ERROR] To see the full stack trace of the errors, re-run Maven with the -e switch.
  961. [ERROR] Re-run Maven using the -X switch to enable full debug logging.
  962. [ERROR]
  963. [ERROR] For more information about the errors and possible solutions, please read the following articles:
  964. [ERROR] [Help 1] http://cwiki.apache.org/confluence/display/MAVEN/MojoFailureException
  965. [ERROR]
  966. [ERROR] After correcting the problems, you can resume the build with the command
  967. [ERROR] mvn <args> -rf :openmrs-api
  968.  
  969. C:\Users\Suubi-Joshua\TRUNK-4681\openmrs-core>
Advertisement
Add Comment
Please, Sign In to add comment
Advertisement