Not a member of Pastebin yet?
Sign Up,
it unlocks many cool features!
- [ 2%] Building CXX object common/CMakeFiles/common.dir/eqg_model_loader.cpp.o
- /home/mike/projects/zone-utilities/common/eqg_model_loader.cpp: In member function ‘bool EQEmu::EQGModelLoader::Load(EQEmu::PFS::Archive&, std::string, std::shared_ptr<EQEmu::EQG::Geometry>)’:
- /home/mike/projects/zone-utilities/common/eqg_model_loader.cpp:15:72: error: no matching function for call to ‘transform(std::basic_string<char>::iterator, std::basic_string<char>::iterator, std::basic_string<char>::iterator, <unresolved overloaded function type>)’
- std::transform(model.begin(), model.end(), model.begin(), std::tolower);
- ^
- /home/mike/projects/zone-utilities/common/eqg_model_loader.cpp:15:72: note: candidates are:
- In file included from /usr/lib/gcc/x86_64-pc-linux-gnu/4.8.2/include/g++-v4/algorithm:62:0,
- from /home/mike/projects/zone-utilities/common/eqg_model_loader.cpp:4:
- /usr/lib/gcc/x86_64-pc-linux-gnu/4.8.2/include/g++-v4/bits/stl_algo.h:4915:5: note: template<class _IIter, class _OIter, class _UnaryOperation> _OIter std::transform(_IIter, _IIter, _OIter, _UnaryOperation)
- transform(_InputIterator __first, _InputIterator __last,
- ^
- /usr/lib/gcc/x86_64-pc-linux-gnu/4.8.2/include/g++-v4/bits/stl_algo.h:4915:5: note: template argument deduction/substitution failed:
- /home/mike/projects/zone-utilities/common/eqg_model_loader.cpp:15:72: note: couldn't deduce template parameter ‘_UnaryOperation’
- std::transform(model.begin(), model.end(), model.begin(), std::tolower);
- ^
- In file included from /usr/lib/gcc/x86_64-pc-linux-gnu/4.8.2/include/g++-v4/algorithm:62:0,
- from /home/mike/projects/zone-utilities/common/eqg_model_loader.cpp:4:
- /usr/lib/gcc/x86_64-pc-linux-gnu/4.8.2/include/g++-v4/bits/stl_algo.h:4952:5: note: template<class _IIter1, class _IIter2, class _OIter, class _BinaryOperation> _OIter std::transform(_IIter1, _IIter1, _IIter2, _OIter, _BinaryOperation)
- transform(_InputIterator1 __first1, _InputIterator1 __last1,
- ^
- /usr/lib/gcc/x86_64-pc-linux-gnu/4.8.2/include/g++-v4/bits/stl_algo.h:4952:5: note: template argument deduction/substitution failed:
- /home/mike/projects/zone-utilities/common/eqg_model_loader.cpp:15:72: note: candidate expects 5 arguments, 4 provided
- std::transform(model.begin(), model.end(), model.begin(), std::tolower);
- ^
- common/CMakeFiles/common.dir/build.make:103: recipe for target 'common/CMakeFiles/common.dir/eqg_model_loader.cpp.o' failed
- make[2]: *** [common/CMakeFiles/common.dir/eqg_model_loader.cpp.o] Error 1
- CMakeFiles/Makefile2:78: recipe for target 'common/CMakeFiles/common.dir/all' failed
- make[1]: *** [common/CMakeFiles/common.dir/all] Error 2
- Makefile:116: recipe for target 'all' failed
- make: *** [all] Error 2
Advertisement
Add Comment
Please, Sign In to add comment