Guest User

Untitled

a guest
May 7th, 2011
99
Never
Not a member of Pastebin yet? Sign Up, it unlocks many cool features!
  1. ../../doltcompile gcc -DHAVE_CONFIG_H -I. -I../.. -I../.. -I../../mono -I../../libgc/include -I../../eglib/src -I../../eglib/src -no-cpp-precomp -D_THREAD_SAFE -DGC_MACOSX_THREADS -DPLATFORM_MACOSX -DUSE_MMAP -DUSE_MUNMAP -DGetCurrentProcess=MonoGetCurrentProcess -DGetCurrentThread=MonoGetCurrentThread -DCreateEvent=MonoCreateEvent -arch i386 -D_XOPEN_SOURCE -mmacosx-version-min=10.5 -D__default_codegen__ -D__ARM_EABI__ -DARM_FPU_NONE=1 -DNO_UNALIGNED_ACCESS -arch i386 -D_XOPEN_SOURCE -mmacosx-version-min=10.5 -fno-strict-aliasing -g -Wall -Wunused -Wmissing-prototypes -Wmissing-declarations -Wstrict-prototypes -Wmissing-prototypes -Wnested-externs -Wpointer-arith -Wno-cast-qual -Wwrite-strings -MT mach-support-arm.lo -MD -MP -MF .deps/mach-support-arm.Tpo -c -o mach-support-arm.lo mach-support-arm.c
  2. mach-support-arm.c: In function ‘mono_mach_arch_get_ip’:
  3. mach-support-arm.c:22: error: ‘arm_thread_state_t’ undeclared (first use in this function)
  4. mach-support-arm.c:22: error: (Each undeclared identifier is reported only once
  5. mach-support-arm.c:22: error: for each function it appears in.)
  6. mach-support-arm.c:22: error: ‘arch_state’ undeclared (first use in this function)
  7. mach-support-arm.c:22: error: expected expression before ‘)’ token
  8. mach-support-arm.c:25: warning: control reaches end of non-void function
  9. mach-support-arm.c: In function ‘mono_mach_arch_get_sp’:
  10. mach-support-arm.c:30: error: ‘arm_thread_state_t’ undeclared (first use in this function)
  11. mach-support-arm.c:30: error: ‘arch_state’ undeclared (first use in this function)
  12. mach-support-arm.c:30: error: expected expression before ‘)’ token
  13. mach-support-arm.c:33: warning: control reaches end of non-void function
  14. mach-support-arm.c: In function ‘mono_mach_arch_get_mcontext_size’:
  15. mach-support-arm.c:38: error: invalid application of ‘sizeof’ to incomplete type ‘struct __darwin_mcontext’
  16. mach-support-arm.c: In function ‘mono_mach_arch_thread_state_to_mcontext’:
  17. mach-support-arm.c:44: error: ‘arm_thread_state_t’ undeclared (first use in this function)
  18. mach-support-arm.c:44: error: ‘arch_state’ undeclared (first use in this function)
  19. mach-support-arm.c:44: error: expected expression before ‘)’ token
  20. mach-support-arm.c:47: error: dereferencing pointer to incomplete type
  21. mach-support-arm.c: In function ‘mono_mach_arch_mcontext_to_thread_state’:
  22. mach-support-arm.c:53: error: ‘arm_thread_state_t’ undeclared (first use in this function)
  23. mach-support-arm.c:53: error: ‘arch_state’ undeclared (first use in this function)
  24. mach-support-arm.c:53: error: expected expression before ‘)’ token
  25. mach-support-arm.c:56: error: dereferencing pointer to incomplete type
  26. mach-support-arm.c: In function ‘mono_mach_arch_get_thread_state_size’:
  27. mach-support-arm.c:62: error: ‘arm_thread_state_t’ undeclared (first use in this function)
  28. mach-support-arm.c:63: warning: control reaches end of non-void function
  29. mach-support-arm.c: In function ‘mono_mach_arch_get_thread_state’:
  30. mach-support-arm.c:68: error: ‘arm_thread_state_t’ undeclared (first use in this function)
  31. mach-support-arm.c:68: error: ‘arch_state’ undeclared (first use in this function)
  32. mach-support-arm.c:68: error: expected expression before ‘)’ token
  33. mach-support-arm.c:71: error: ‘ARM_THREAD_STATE_COUNT’ undeclared (first use in this function)
  34. mach-support-arm.c: In function ‘mono_mach_arch_set_thread_state’:
  35. mach-support-arm.c:81: error: ‘ARM_THREAD_STATE_COUNT’ undeclared (first use in this function)
  36. make[4]: *** [mach-support-arm.lo] Error 1
RAW Paste Data