Advertisement
Guest User

Untitled

a guest
Apr 7th, 2017
90
Never
Not a member of Pastebin yet? Sign Up, it unlocks many cool features!
text 114.49 KB | None
  1. ➜ ~ cd /www/openmrs
  2. ➜ openmrs git clone https://github.com/openmrs/openmrs-core
  3. Cloning into 'openmrs-core'...
  4. remote: Counting objects: 200215, done.
  5. remote: Compressing objects: 100% (140/140), done.
  6. remote: Total 200215 (delta 50), reused 0 (delta 0), pack-reused 200046
  7. Receiving objects: 100% (200215/200215), 218.94 MiB | 8.85 MiB/s, done.
  8. Resolving deltas: 100% (113439/113439), done.
  9. ➜ openmrs cd openmrs-core
  10. ➜ openmrs-core git:(master) mvn clean install
  11. [INFO] Scanning for projects...
  12. [INFO] ------------------------------------------------------------------------
  13. [INFO] Reactor Build Order:
  14. [INFO]
  15. [INFO] OpenMRS
  16. [INFO] openmrs-tools
  17. [INFO] openmrs-test
  18. [INFO] openmrs-api
  19. [INFO] openmrs-web
  20. [INFO] openmrs-webapp
  21. [INFO]
  22. [INFO] ------------------------------------------------------------------------
  23. [INFO] Building OpenMRS 2.2.0-SNAPSHOT
  24. [INFO] ------------------------------------------------------------------------
  25. [INFO]
  26. [INFO] --- maven-clean-plugin:2.5:clean (default-clean) @ openmrs ---
  27. [INFO]
  28. [INFO] --- buildnumber-maven-plugin:1.1:create (default) @ openmrs ---
  29. [INFO] Checking for local modifications: skipped.
  30. [INFO] Updating project files from SCM: skipped.
  31. [INFO] ShortRevision tag detected. The value is '6'.
  32. [INFO] Executing: /bin/sh -c cd /www/openmrs/openmrs-core && git rev-parse --verify --short=6 HEAD
  33. [INFO] Working directory: /www/openmrs/openmrs-core
  34. [INFO] Storing buildNumber: 0d7fbf at timestamp: 1491551110255
  35. [INFO] ShortRevision tag detected. The value is '6'.
  36. [INFO] Executing: /bin/sh -c cd /www/openmrs/openmrs-core && git rev-parse --verify --short=6 HEAD
  37. [INFO] Working directory: /www/openmrs/openmrs-core
  38. [INFO] Storing buildScmBranch: UNKNOWN
  39. [INFO]
  40. [INFO] --- build-helper-maven-plugin:1.5:parse-version (parse-version) @ openmrs ---
  41. [INFO]
  42. [INFO] --- maven-jar-plugin:2.3.2:test-jar (default) @ openmrs ---
  43. [WARNING] JAR will be empty - no content was marked for inclusion!
  44. [INFO] Building jar: /www/openmrs/openmrs-core/target/openmrs-2.2.0-SNAPSHOT-tests.jar
  45. [INFO]
  46. [INFO] --- license-maven-plugin:2.6:check (default) @ openmrs ---
  47. [INFO] Checking licenses...
  48. [INFO]
  49. [INFO] --- maven-install-plugin:2.4:install (default-install) @ openmrs ---
  50. [INFO] Installing /www/openmrs/openmrs-core/pom.xml to /Users/kostya/.m2/repository/org/openmrs/openmrs/2.2.0-SNAPSHOT/openmrs-2.2.0-SNAPSHOT.pom
  51. [INFO] Installing /www/openmrs/openmrs-core/target/openmrs-2.2.0-SNAPSHOT-tests.jar to /Users/kostya/.m2/repository/org/openmrs/openmrs/2.2.0-SNAPSHOT/openmrs-2.2.0-SNAPSHOT-tests.jar
  52. [INFO]
  53. [INFO] ------------------------------------------------------------------------
  54. [INFO] Building openmrs-tools 2.2.0-SNAPSHOT
  55. [INFO] ------------------------------------------------------------------------
  56. [INFO]
  57. [INFO] --- maven-clean-plugin:2.5:clean (default-clean) @ openmrs-tools ---
  58. [INFO]
  59. [INFO] --- buildnumber-maven-plugin:1.1:create (default) @ openmrs-tools ---
  60. [INFO]
  61. [INFO] --- build-helper-maven-plugin:1.5:parse-version (parse-version) @ openmrs-tools ---
  62. [INFO]
  63. [INFO] --- maven-resources-plugin:2.4:resources (default-resources) @ openmrs-tools ---
  64. [INFO] Using 'UTF-8' encoding to copy filtered resources.
  65. [INFO] Copying 4 resources
  66. [INFO]
  67. [INFO] --- maven-compiler-plugin:2.1:compile (default-compile) @ openmrs-tools ---
  68. [INFO] Compiling 1 source file to /www/openmrs/openmrs-core/tools/target/classes
  69. [INFO]
  70. [INFO] --- maven-resources-plugin:2.4:testResources (default-testResources) @ openmrs-tools ---
  71. [INFO] Using 'UTF-8' encoding to copy filtered resources.
  72. [INFO] skip non existing resourceDirectory /www/openmrs/openmrs-core/tools/src/test/resources
  73. [INFO]
  74. [INFO] --- maven-compiler-plugin:2.1:testCompile (default-testCompile) @ openmrs-tools ---
  75. [INFO] No sources to compile
  76. [INFO]
  77. [INFO] --- maven-surefire-plugin:2.18.1:test (default-test) @ openmrs-tools ---
  78. [INFO] No tests to run.
  79. [INFO]
  80. [INFO] --- maven-jar-plugin:2.3.2:jar (default-jar) @ openmrs-tools ---
  81. [INFO] Building jar: /www/openmrs/openmrs-core/tools/target/openmrs-tools-2.2.0-SNAPSHOT.jar
  82. [INFO]
  83. [INFO] --- maven-jar-plugin:2.3.2:test-jar (default) @ openmrs-tools ---
  84. [WARNING] JAR will be empty - no content was marked for inclusion!
  85. [INFO] Building jar: /www/openmrs/openmrs-core/tools/target/openmrs-tools-2.2.0-SNAPSHOT-tests.jar
  86. [INFO]
  87. [INFO] --- license-maven-plugin:2.6:check (default) @ openmrs-tools ---
  88. [INFO] Checking licenses...
  89. [INFO]
  90. [INFO] --- maven-install-plugin:2.4:install (default-install) @ openmrs-tools ---
  91. [INFO] Installing /www/openmrs/openmrs-core/tools/target/openmrs-tools-2.2.0-SNAPSHOT.jar to /Users/kostya/.m2/repository/org/openmrs/tools/openmrs-tools/2.2.0-SNAPSHOT/openmrs-tools-2.2.0-SNAPSHOT.jar
  92. [INFO] Installing /www/openmrs/openmrs-core/tools/pom.xml to /Users/kostya/.m2/repository/org/openmrs/tools/openmrs-tools/2.2.0-SNAPSHOT/openmrs-tools-2.2.0-SNAPSHOT.pom
  93. [INFO] Installing /www/openmrs/openmrs-core/tools/target/openmrs-tools-2.2.0-SNAPSHOT-tests.jar to /Users/kostya/.m2/repository/org/openmrs/tools/openmrs-tools/2.2.0-SNAPSHOT/openmrs-tools-2.2.0-SNAPSHOT-tests.jar
  94. [INFO]
  95. [INFO] ------------------------------------------------------------------------
  96. [INFO] Building openmrs-test 2.2.0-SNAPSHOT
  97. [INFO] ------------------------------------------------------------------------
  98. [INFO]
  99. [INFO] --- maven-clean-plugin:2.5:clean (default-clean) @ openmrs-test ---
  100. [INFO]
  101. [INFO] --- buildnumber-maven-plugin:1.1:create (default) @ openmrs-test ---
  102. [INFO]
  103. [INFO] --- build-helper-maven-plugin:1.5:parse-version (parse-version) @ openmrs-test ---
  104. [INFO]
  105. [INFO] --- maven-jar-plugin:2.3.2:test-jar (default) @ openmrs-test ---
  106. [WARNING] JAR will be empty - no content was marked for inclusion!
  107. [INFO] Building jar: /www/openmrs/openmrs-core/test/target/openmrs-test-2.2.0-SNAPSHOT-tests.jar
  108. [INFO]
  109. [INFO] --- license-maven-plugin:2.6:check (default) @ openmrs-test ---
  110. [INFO] Checking licenses...
  111. [INFO]
  112. [INFO] --- maven-install-plugin:2.4:install (default-install) @ openmrs-test ---
  113. [INFO] Installing /www/openmrs/openmrs-core/test/pom.xml to /Users/kostya/.m2/repository/org/openmrs/test/openmrs-test/2.2.0-SNAPSHOT/openmrs-test-2.2.0-SNAPSHOT.pom
  114. [INFO] Installing /www/openmrs/openmrs-core/test/target/openmrs-test-2.2.0-SNAPSHOT-tests.jar to /Users/kostya/.m2/repository/org/openmrs/test/openmrs-test/2.2.0-SNAPSHOT/openmrs-test-2.2.0-SNAPSHOT-tests.jar
  115. [INFO]
  116. [INFO] ------------------------------------------------------------------------
  117. [INFO] Building openmrs-api 2.2.0-SNAPSHOT
  118. [INFO] ------------------------------------------------------------------------
  119. [INFO]
  120. [INFO] --- maven-clean-plugin:2.5:clean (default-clean) @ openmrs-api ---
  121. [INFO]
  122. [INFO] --- buildnumber-maven-plugin:1.1:create (default) @ openmrs-api ---
  123. [INFO]
  124. [INFO] --- build-helper-maven-plugin:1.5:parse-version (parse-version) @ openmrs-api ---
  125. [INFO]
  126. [INFO] --- jacoco-maven-plugin:0.7.4.201502262128:prepare-agent (prepare-agent) @ openmrs-api ---
  127. [INFO] argLine set to -javaagent:/Users/kostya/.m2/repository/org/jacoco/org.jacoco.agent/0.7.4.201502262128/org.jacoco.agent-0.7.4.201502262128-runtime.jar=destfile=/www/openmrs/openmrs-core/api/target/jacoco.exec,includes=org/openmrs/** -Duser.language=en -Duser.region=US -Xmx2g
  128. [INFO]
  129. [INFO] --- maven-java-formatter-plugin:0.3:format (default) @ openmrs-api ---
  130. [INFO] Using 'UTF-8' encoding to format source files.
  131. [INFO] Number of files to be formatted: 969
  132. [INFO] Successfully formatted: 0 file(s)
  133. [INFO] Fail to format : 0 file(s)
  134. [INFO] Skipped : 969 file(s)
  135. [INFO] Approximate time taken: 2s
  136. [INFO]
  137. [INFO] --- maven-resources-plugin:2.4:resources (default-resources) @ openmrs-api ---
  138. [INFO] Using 'UTF-8' encoding to copy filtered resources.
  139. [INFO] Copying 1 resource
  140. [INFO] Copying 132 resources
  141. [INFO]
  142. [INFO] --- maven-compiler-plugin:2.1:compile (default-compile) @ openmrs-api ---
  143. [INFO] Compiling 662 source files to /www/openmrs/openmrs-core/api/target/classes
  144. [WARNING] /www/openmrs/openmrs-core/api/src/main/java/org/openmrs/util/MemoryLeakUtil.java:[18,23] KeepAliveCache is internal proprietary API and may be removed in a future release
  145.  
  146. [WARNING] /www/openmrs/openmrs-core/api/src/main/java/org/openmrs/util/MemoryLeakUtil.java:[67,32] KeepAliveCache is internal proprietary API and may be removed in a future release
  147.  
  148. [INFO]
  149. [INFO] --- maven-resources-plugin:2.4:testResources (default-testResources) @ openmrs-api ---
  150. [INFO] Using 'UTF-8' encoding to copy filtered resources.
  151. [INFO] Copying 132 resources
  152. [INFO]
  153. [INFO] --- maven-compiler-plugin:2.1:testCompile (default-testCompile) @ openmrs-api ---
  154. [INFO] Compiling 307 source files to /www/openmrs/openmrs-core/api/target/test-classes
  155. [INFO]
  156. [INFO] --- maven-surefire-plugin:2.18.1:test (default-test) @ openmrs-api ---
  157. [INFO] Surefire report directory: /www/openmrs/openmrs-core/api/target/surefire-reports
  158.  
  159. -------------------------------------------------------
  160. T E S T S
  161. -------------------------------------------------------
  162. objc[4137]: Class JavaLaunchHelper is implemented in both /Library/Java/JavaVirtualMachines/jdk1.8.0_77.jdk/Contents/Home/jre/bin/java (0x1011dd4c0) and /Library/Java/JavaVirtualMachines/jdk1.8.0_77.jdk/Contents/Home/jre/lib/libinstrument.dylib (0x1013904e0). One of the two will be used. Which one is undefined.
  163. Running org.openmrs.AllergenTest
  164. Tests run: 6, Failures: 0, Errors: 0, Skipped: 0, Time elapsed: 7.88 sec - in org.openmrs.AllergenTest
  165. Running org.openmrs.AllergiesTest
  166. Tests run: 26, Failures: 0, Errors: 0, Skipped: 0, Time elapsed: 0.483 sec - in org.openmrs.AllergiesTest
  167. Running org.openmrs.annotation.OpenmrsProfileExcludeFilterTest
  168. Tests run: 7, Failures: 0, Errors: 0, Skipped: 2, Time elapsed: 0.088 sec - in org.openmrs.annotation.OpenmrsProfileExcludeFilterTest
  169. Running org.openmrs.annotation.OpenmrsProfileIncludeFilterTest
  170. Tests run: 2, Failures: 0, Errors: 0, Skipped: 0, Time elapsed: 0.035 sec - in org.openmrs.annotation.OpenmrsProfileIncludeFilterTest
  171. Running org.openmrs.aop.AuthorizationAdviceTest
  172. Tests run: 2, Failures: 0, Errors: 0, Skipped: 0, Time elapsed: 0.142 sec - in org.openmrs.aop.AuthorizationAdviceTest
  173. Running org.openmrs.aop.RequiredDataAdviceTest
  174. Tests run: 26, Failures: 0, Errors: 0, Skipped: 0, Time elapsed: 0.678 sec - in org.openmrs.aop.RequiredDataAdviceTest
  175. Running org.openmrs.api.AdministrationServiceTest
  176. Tests run: 55, Failures: 0, Errors: 0, Skipped: 4, Time elapsed: 0.816 sec - in org.openmrs.api.AdministrationServiceTest
  177. Running org.openmrs.api.cache.CachePropertiesUtilTest
  178. Tests run: 1, Failures: 0, Errors: 0, Skipped: 0, Time elapsed: 0.001 sec - in org.openmrs.api.cache.CachePropertiesUtilTest
  179. Running org.openmrs.api.cache.OpenmrsCacheManagerFactoryBeanTest
  180. Tests run: 1, Failures: 0, Errors: 0, Skipped: 0, Time elapsed: 0.022 sec - in org.openmrs.api.cache.OpenmrsCacheManagerFactoryBeanTest
  181. Running org.openmrs.api.CohortServiceTest
  182. Tests run: 29, Failures: 0, Errors: 0, Skipped: 0, Time elapsed: 0.616 sec - in org.openmrs.api.CohortServiceTest
  183. Running org.openmrs.api.ConceptServiceTest
  184. Tests run: 244, Failures: 0, Errors: 0, Skipped: 1, Time elapsed: 18.92 sec - in org.openmrs.api.ConceptServiceTest
  185. Running org.openmrs.api.context.ContextTest
  186. Tests run: 17, Failures: 0, Errors: 0, Skipped: 0, Time elapsed: 0.108 sec - in org.openmrs.api.context.ContextTest
  187. Running org.openmrs.api.context.ContextWithModuleTest
  188. Tests run: 1, Failures: 0, Errors: 0, Skipped: 0, Time elapsed: 0.093 sec - in org.openmrs.api.context.ContextWithModuleTest
  189. Running org.openmrs.api.context.DaemonTest
  190. Tests run: 7, Failures: 0, Errors: 0, Skipped: 0, Time elapsed: 0.045 sec - in org.openmrs.api.context.DaemonTest
  191. Running org.openmrs.api.DatatypeServiceTest
  192. Tests run: 2, Failures: 0, Errors: 0, Skipped: 0, Time elapsed: 0.021 sec - in org.openmrs.api.DatatypeServiceTest
  193. Running org.openmrs.api.db.ConceptDAOTest
  194. Tests run: 13, Failures: 0, Errors: 0, Skipped: 2, Time elapsed: 0.119 sec - in org.openmrs.api.db.ConceptDAOTest
  195. Running org.openmrs.api.db.ContextDAOTest
  196. ERROR - HibernateContextDAO.authenticate(185) |2017-04-07 09:45:56,760| Unable to convert the global property security.allowedFailedLoginsBeforeLockoutto a valid integer. Using default value of 7
  197. ERROR - HibernateContextDAO.authenticate(185) |2017-04-07 09:45:56,773| Unable to convert the global property security.allowedFailedLoginsBeforeLockoutto a valid integer. Using default value of 7
  198. ERROR - HibernateContextDAO.authenticate(185) |2017-04-07 09:45:56,775| Unable to convert the global property security.allowedFailedLoginsBeforeLockoutto a valid integer. Using default value of 7
  199. ERROR - HibernateContextDAO.authenticate(185) |2017-04-07 09:45:56,776| Unable to convert the global property security.allowedFailedLoginsBeforeLockoutto a valid integer. Using default value of 7
  200. ERROR - HibernateContextDAO.authenticate(185) |2017-04-07 09:45:56,777| Unable to convert the global property security.allowedFailedLoginsBeforeLockoutto a valid integer. Using default value of 7
  201. ERROR - HibernateContextDAO.authenticate(185) |2017-04-07 09:45:56,778| Unable to convert the global property security.allowedFailedLoginsBeforeLockoutto a valid integer. Using default value of 7
  202. ERROR - HibernateContextDAO.authenticate(185) |2017-04-07 09:45:56,779| Unable to convert the global property security.allowedFailedLoginsBeforeLockoutto a valid integer. Using default value of 7
  203. ERROR - HibernateContextDAO.authenticate(185) |2017-04-07 09:45:56,780| Unable to convert the global property security.allowedFailedLoginsBeforeLockoutto a valid integer. Using default value of 7
  204. ERROR - HibernateContextDAO.authenticate(185) |2017-04-07 09:45:56,781| Unable to convert the global property security.allowedFailedLoginsBeforeLockoutto a valid integer. Using default value of 7
  205. ERROR - HibernateContextDAO.authenticate(185) |2017-04-07 09:45:56,782| Unable to convert the global property security.allowedFailedLoginsBeforeLockoutto a valid integer. Using default value of 7
  206. ERROR - HibernateContextDAO.authenticate(185) |2017-04-07 09:45:56,793| Unable to convert the global property security.allowedFailedLoginsBeforeLockoutto a valid integer. Using default value of 7
  207. ERROR - HibernateContextDAO.authenticate(185) |2017-04-07 09:45:56,801| Unable to convert the global property security.allowedFailedLoginsBeforeLockoutto a valid integer. Using default value of 7
  208. ERROR - HibernateContextDAO.authenticate(185) |2017-04-07 09:45:56,842| Unable to convert the global property security.allowedFailedLoginsBeforeLockoutto a valid integer. Using default value of 7
  209. ERROR - HibernateContextDAO.authenticate(185) |2017-04-07 09:45:56,843| Unable to convert the global property security.allowedFailedLoginsBeforeLockoutto a valid integer. Using default value of 7
  210. ERROR - HibernateContextDAO.authenticate(185) |2017-04-07 09:45:56,844| Unable to convert the global property security.allowedFailedLoginsBeforeLockoutto a valid integer. Using default value of 7
  211. ERROR - HibernateContextDAO.authenticate(185) |2017-04-07 09:45:56,845| Unable to convert the global property security.allowedFailedLoginsBeforeLockoutto a valid integer. Using default value of 7
  212. ERROR - HibernateContextDAO.authenticate(185) |2017-04-07 09:45:56,845| Unable to convert the global property security.allowedFailedLoginsBeforeLockoutto a valid integer. Using default value of 7
  213. ERROR - HibernateContextDAO.authenticate(185) |2017-04-07 09:45:56,846| Unable to convert the global property security.allowedFailedLoginsBeforeLockoutto a valid integer. Using default value of 7
  214. ERROR - HibernateContextDAO.authenticate(185) |2017-04-07 09:45:56,847| Unable to convert the global property security.allowedFailedLoginsBeforeLockoutto a valid integer. Using default value of 7
  215. ERROR - HibernateContextDAO.authenticate(185) |2017-04-07 09:45:56,856| Unable to convert the global property security.allowedFailedLoginsBeforeLockoutto a valid integer. Using default value of 7
  216. ERROR - HibernateContextDAO.authenticate(185) |2017-04-07 09:45:56,868| Unable to convert the global property security.allowedFailedLoginsBeforeLockoutto a valid integer. Using default value of 7
  217. Tests run: 21, Failures: 0, Errors: 0, Skipped: 0, Time elapsed: 0.222 sec - in org.openmrs.api.db.ContextDAOTest
  218. Running org.openmrs.api.db.EncounterDAOTest
  219. Tests run: 4, Failures: 0, Errors: 0, Skipped: 0, Time elapsed: 0.105 sec - in org.openmrs.api.db.EncounterDAOTest
  220. Running org.openmrs.api.db.hibernate.AuditableInterceptorTest
  221. Tests run: 15, Failures: 0, Errors: 0, Skipped: 0, Time elapsed: 0.149 sec - in org.openmrs.api.db.hibernate.AuditableInterceptorTest
  222. Running org.openmrs.api.db.hibernate.DropMillisecondsHibernateInterceptorTest
  223. Tests run: 2, Failures: 0, Errors: 0, Skipped: 0, Time elapsed: 0.023 sec - in org.openmrs.api.db.hibernate.DropMillisecondsHibernateInterceptorTest
  224. Running org.openmrs.api.db.hibernate.HibernateAdministrationDAOTest
  225. Tests run: 4, Failures: 0, Errors: 0, Skipped: 0, Time elapsed: 0.036 sec - in org.openmrs.api.db.hibernate.HibernateAdministrationDAOTest
  226. Running org.openmrs.api.db.hibernate.HibernateConceptDAOTest
  227. Tests run: 11, Failures: 0, Errors: 0, Skipped: 0, Time elapsed: 0.661 sec - in org.openmrs.api.db.hibernate.HibernateConceptDAOTest
  228. Running org.openmrs.api.db.hibernate.HibernateLocationDAOTest
  229. Tests run: 3, Failures: 0, Errors: 0, Skipped: 0, Time elapsed: 0.063 sec - in org.openmrs.api.db.hibernate.HibernateLocationDAOTest
  230. Running org.openmrs.api.db.hibernate.HibernateObsDAOTest
  231. Tests run: 1, Failures: 0, Errors: 0, Skipped: 0, Time elapsed: 0.02 sec - in org.openmrs.api.db.hibernate.HibernateObsDAOTest
  232. Running org.openmrs.api.db.hibernate.HibernateOrderDAOTest
  233. Tests run: 1, Failures: 0, Errors: 0, Skipped: 0, Time elapsed: 0.042 sec - in org.openmrs.api.db.hibernate.HibernateOrderDAOTest
  234. Running org.openmrs.api.db.hibernate.HibernatePatientDAOTest
  235. Tests run: 2, Failures: 0, Errors: 0, Skipped: 0, Time elapsed: 0.131 sec - in org.openmrs.api.db.hibernate.HibernatePatientDAOTest
  236. Running org.openmrs.api.db.hibernate.HibernatePersonDAOTest
  237. Tests run: 41, Failures: 0, Errors: 0, Skipped: 0, Time elapsed: 2.506 sec - in org.openmrs.api.db.hibernate.HibernatePersonDAOTest
  238. Running org.openmrs.api.db.hibernate.HibernateProviderDAOTest
  239. Tests run: 3, Failures: 0, Errors: 0, Skipped: 0, Time elapsed: 0.044 sec - in org.openmrs.api.db.hibernate.HibernateProviderDAOTest
  240. Running org.openmrs.api.db.hibernate.ImmutableEntityInterceptorTest
  241. Tests run: 4, Failures: 0, Errors: 0, Skipped: 0, Time elapsed: 0.028 sec - in org.openmrs.api.db.hibernate.ImmutableEntityInterceptorTest
  242. Running org.openmrs.api.db.hibernate.PatientSearchCriteriaTest
  243. Tests run: 18, Failures: 0, Errors: 0, Skipped: 0, Time elapsed: 0.074 sec - in org.openmrs.api.db.hibernate.PatientSearchCriteriaTest
  244. Running org.openmrs.api.db.hibernate.PersonAttributeHelperTest
  245. Tests run: 5, Failures: 0, Errors: 0, Skipped: 0, Time elapsed: 0.072 sec - in org.openmrs.api.db.hibernate.PersonAttributeHelperTest
  246. Running org.openmrs.api.db.hibernate.ProviderDAOTest
  247. Tests run: 3, Failures: 0, Errors: 0, Skipped: 0, Time elapsed: 0.047 sec - in org.openmrs.api.db.hibernate.ProviderDAOTest
  248. Running org.openmrs.api.db.PatientDAOTest
  249. WARN - HibernatePatientDAO.getDuplicatePatientsSQLString(498) |2017-04-07 09:46:05,515| Unidentified attribute: abcDef
  250. WARN - HibernatePatientDAO.getDuplicatePatientsSQLString(498) |2017-04-07 09:46:13,677| Unidentified attribute: abcDef
  251. Tests run: 145, Failures: 0, Errors: 0, Skipped: 1, Time elapsed: 12.861 sec - in org.openmrs.api.db.PatientDAOTest
  252. Running org.openmrs.api.db.PersonDAOTest
  253. Tests run: 3, Failures: 0, Errors: 0, Skipped: 0, Time elapsed: 0.016 sec - in org.openmrs.api.db.PersonDAOTest
  254. Running org.openmrs.api.db.ProgramWorkflowDAOTest
  255. Tests run: 4, Failures: 0, Errors: 0, Skipped: 0, Time elapsed: 0.021 sec - in org.openmrs.api.db.ProgramWorkflowDAOTest
  256. Running org.openmrs.api.db.SerializedObjectDAOTest
  257. Tests run: 1, Failures: 0, Errors: 0, Skipped: 1, Time elapsed: 0 sec - in org.openmrs.api.db.SerializedObjectDAOTest
  258. Running org.openmrs.api.db.UserDAOTest
  259. Tests run: 8, Failures: 0, Errors: 0, Skipped: 0, Time elapsed: 0.054 sec - in org.openmrs.api.db.UserDAOTest
  260. Running org.openmrs.api.db.VisitDAOTest
  261. Tests run: 3, Failures: 0, Errors: 0, Skipped: 0, Time elapsed: 0.054 sec - in org.openmrs.api.db.VisitDAOTest
  262. Running org.openmrs.api.EncounterServiceTest
  263. Tests run: 141, Failures: 0, Errors: 0, Skipped: 2, Time elapsed: 3.954 sec - in org.openmrs.api.EncounterServiceTest
  264. Running org.openmrs.api.FormServiceTest
  265. Tests run: 40, Failures: 0, Errors: 0, Skipped: 0, Time elapsed: 0.37 sec - in org.openmrs.api.FormServiceTest
  266. Running org.openmrs.api.handler.BaseRetireHandlerTest
  267. Tests run: 8, Failures: 0, Errors: 0, Skipped: 0, Time elapsed: 0 sec - in org.openmrs.api.handler.BaseRetireHandlerTest
  268. Running org.openmrs.api.handler.BaseUnretireHandlerTest
  269. Tests run: 6, Failures: 0, Errors: 0, Skipped: 0, Time elapsed: 0.001 sec - in org.openmrs.api.handler.BaseUnretireHandlerTest
  270. Running org.openmrs.api.handler.BaseUnvoidHandlerTest
  271. Tests run: 6, Failures: 0, Errors: 0, Skipped: 0, Time elapsed: 0 sec - in org.openmrs.api.handler.BaseUnvoidHandlerTest
  272. Running org.openmrs.api.handler.BaseVoidHandlerTest
  273. Tests run: 8, Failures: 0, Errors: 0, Skipped: 0, Time elapsed: 0 sec - in org.openmrs.api.handler.BaseVoidHandlerTest
  274. Running org.openmrs.api.handler.ConceptNameSaveHandlerTest
  275. Tests run: 4, Failures: 0, Errors: 0, Skipped: 0, Time elapsed: 0.026 sec - in org.openmrs.api.handler.ConceptNameSaveHandlerTest
  276. Running org.openmrs.api.handler.ExistingOrNewVisitAssignmentHandlerTest
  277. Tests run: 5, Failures: 0, Errors: 0, Skipped: 0, Time elapsed: 0.156 sec - in org.openmrs.api.handler.ExistingOrNewVisitAssignmentHandlerTest
  278. Running org.openmrs.api.handler.ExistingVisitAssignmentHandlerTest
  279. Tests run: 3, Failures: 0, Errors: 0, Skipped: 0, Time elapsed: 0.09 sec - in org.openmrs.api.handler.ExistingVisitAssignmentHandlerTest
  280. Running org.openmrs.api.handler.OpenmrsMetadataSaveHandlerTest
  281. Tests run: 2, Failures: 0, Errors: 0, Skipped: 0, Time elapsed: 0.002 sec - in org.openmrs.api.handler.OpenmrsMetadataSaveHandlerTest
  282. Running org.openmrs.api.handler.OpenmrsObjectSaveHandlerTest
  283. Tests run: 5, Failures: 0, Errors: 0, Skipped: 0, Time elapsed: 0.003 sec - in org.openmrs.api.handler.OpenmrsObjectSaveHandlerTest
  284. Running org.openmrs.api.handler.PatientDataUnvoidHandlerTest
  285. Tests run: 2, Failures: 0, Errors: 0, Skipped: 0, Time elapsed: 1.537 sec - in org.openmrs.api.handler.PatientDataUnvoidHandlerTest
  286. Running org.openmrs.api.handler.PatientDataVoidHandlerTest
  287. Tests run: 1, Failures: 0, Errors: 0, Skipped: 0, Time elapsed: 0.029 sec - in org.openmrs.api.handler.PatientDataVoidHandlerTest
  288. Running org.openmrs.api.handler.PersonSaveHandlerTest
  289. Tests run: 1, Failures: 0, Errors: 0, Skipped: 0, Time elapsed: 0.01 sec - in org.openmrs.api.handler.PersonSaveHandlerTest
  290. Running org.openmrs.api.handler.PersonUnvoidHandlerTest
  291. Tests run: 6, Failures: 0, Errors: 0, Skipped: 0, Time elapsed: 0 sec - in org.openmrs.api.handler.PersonUnvoidHandlerTest
  292. Running org.openmrs.api.handler.PersonVoidHandlerTest
  293. Tests run: 8, Failures: 0, Errors: 0, Skipped: 0, Time elapsed: 0.046 sec - in org.openmrs.api.handler.PersonVoidHandlerTest
  294. Running org.openmrs.api.handler.RequiredReasonVoidSaveHandlerTest
  295. Tests run: 5, Failures: 0, Errors: 0, Skipped: 0, Time elapsed: 0.04 sec - in org.openmrs.api.handler.RequiredReasonVoidSaveHandlerTest
  296. Running org.openmrs.api.handler.RequireVoidReasonVoidHandlerTest
  297. Tests run: 5, Failures: 0, Errors: 0, Skipped: 0, Time elapsed: 0.029 sec - in org.openmrs.api.handler.RequireVoidReasonVoidHandlerTest
  298. Running org.openmrs.api.impl.ConceptServiceImplTest
  299. Tests run: 55, Failures: 0, Errors: 0, Skipped: 0, Time elapsed: 0.259 sec - in org.openmrs.api.impl.ConceptServiceImplTest
  300. Running org.openmrs.api.impl.SerializationServiceImplTest
  301. Tests run: 1, Failures: 0, Errors: 0, Skipped: 0, Time elapsed: 0.002 sec - in org.openmrs.api.impl.SerializationServiceImplTest
  302. Running org.openmrs.api.LocationServiceTest
  303. Tests run: 70, Failures: 0, Errors: 0, Skipped: 0, Time elapsed: 0.903 sec - in org.openmrs.api.LocationServiceTest
  304. Running org.openmrs.api.ObsServiceTest
  305. ERROR - ImageHandler.getObs(80) |2017-04-07 09:46:22,124| Trying to read file: /var/folders/mh/0dl_nbvn4ll77c5nkf62v7ch0000gn/T/appdir-for-unit-tests-5677297229533716535/complex_obs/openmrs_logo_small.gif
  306. javax.imageio.IIOException: Can't read input file!
  307. at javax.imageio.ImageIO.read(ImageIO.java:1301)
  308. at org.openmrs.obs.handler.ImageHandler.getObs(ImageHandler.java:77)
  309. at org.openmrs.api.impl.ObsServiceImpl.getComplexObs(ObsServiceImpl.java:498)
  310. at sun.reflect.NativeMethodAccessorImpl.invoke0(Native Method)
  311. at sun.reflect.NativeMethodAccessorImpl.invoke(NativeMethodAccessorImpl.java:62)
  312. at sun.reflect.DelegatingMethodAccessorImpl.invoke(DelegatingMethodAccessorImpl.java:43)
  313. at java.lang.reflect.Method.invoke(Method.java:498)
  314. at org.springframework.aop.support.AopUtils.invokeJoinpointUsingReflection(AopUtils.java:317)
  315. at org.springframework.aop.framework.ReflectiveMethodInvocation.invokeJoinpoint(ReflectiveMethodInvocation.java:190)
  316. at org.springframework.aop.framework.ReflectiveMethodInvocation.proceed(ReflectiveMethodInvocation.java:157)
  317. at org.springframework.transaction.interceptor.TransactionInterceptor$1.proceedWithInvocation(TransactionInterceptor.java:99)
  318. at org.springframework.transaction.interceptor.TransactionAspectSupport.invokeWithinTransaction(TransactionAspectSupport.java:281)
  319. at org.springframework.transaction.interceptor.TransactionInterceptor.invoke(TransactionInterceptor.java:96)
  320. at org.springframework.aop.framework.ReflectiveMethodInvocation.proceed(ReflectiveMethodInvocation.java:179)
  321. at org.springframework.aop.framework.JdkDynamicAopProxy.invoke(JdkDynamicAopProxy.java:207)
  322. at com.sun.proxy.$Proxy78.getComplexObs(Unknown Source)
  323. at sun.reflect.NativeMethodAccessorImpl.invoke0(Native Method)
  324. at sun.reflect.NativeMethodAccessorImpl.invoke(NativeMethodAccessorImpl.java:62)
  325. at sun.reflect.DelegatingMethodAccessorImpl.invoke(DelegatingMethodAccessorImpl.java:43)
  326. at java.lang.reflect.Method.invoke(Method.java:498)
  327. at org.springframework.aop.support.AopUtils.invokeJoinpointUsingReflection(AopUtils.java:317)
  328. at org.springframework.aop.framework.ReflectiveMethodInvocation.invokeJoinpoint(ReflectiveMethodInvocation.java:190)
  329. at org.springframework.aop.framework.ReflectiveMethodInvocation.proceed(ReflectiveMethodInvocation.java:157)
  330. at org.springframework.cache.interceptor.CacheInterceptor$1.invoke(CacheInterceptor.java:52)
  331. at org.springframework.cache.interceptor.CacheAspectSupport.execute(CacheAspectSupport.java:303)
  332. at org.springframework.cache.interceptor.CacheInterceptor.invoke(CacheInterceptor.java:61)
  333. at org.springframework.aop.framework.ReflectiveMethodInvocation.proceed(ReflectiveMethodInvocation.java:179)
  334. at org.openmrs.aop.LoggingAdvice.invoke(LoggingAdvice.java:122)
  335. at org.springframework.aop.framework.ReflectiveMethodInvocation.proceed(ReflectiveMethodInvocation.java:179)
  336. at org.springframework.aop.framework.adapter.MethodBeforeAdviceInterceptor.invoke(MethodBeforeAdviceInterceptor.java:52)
  337. at org.springframework.aop.framework.ReflectiveMethodInvocation.proceed(ReflectiveMethodInvocation.java:179)
  338. at org.springframework.aop.framework.adapter.MethodBeforeAdviceInterceptor.invoke(MethodBeforeAdviceInterceptor.java:52)
  339. at org.springframework.aop.framework.ReflectiveMethodInvocation.proceed(ReflectiveMethodInvocation.java:179)
  340. at org.springframework.aop.framework.JdkDynamicAopProxy.invoke(JdkDynamicAopProxy.java:207)
  341. at com.sun.proxy.$Proxy79.getComplexObs(Unknown Source)
  342. at org.openmrs.api.ObsServiceTest.purgeObs_shouldDeleteTheGivenObsFromTheDatabase(ObsServiceTest.java:1319)
  343. at sun.reflect.NativeMethodAccessorImpl.invoke0(Native Method)
  344. at sun.reflect.NativeMethodAccessorImpl.invoke(NativeMethodAccessorImpl.java:62)
  345. at sun.reflect.DelegatingMethodAccessorImpl.invoke(DelegatingMethodAccessorImpl.java:43)
  346. at java.lang.reflect.Method.invoke(Method.java:498)
  347. at org.junit.runners.model.FrameworkMethod$1.runReflectiveCall(FrameworkMethod.java:47)
  348. at org.junit.internal.runners.model.ReflectiveCallable.run(ReflectiveCallable.java:12)
  349. at org.junit.runners.model.FrameworkMethod.invokeExplosively(FrameworkMethod.java:44)
  350. at org.junit.internal.runners.statements.InvokeMethod.evaluate(InvokeMethod.java:17)
  351. at org.junit.internal.runners.statements.RunBefores.evaluate(RunBefores.java:26)
  352. at org.springframework.test.context.junit4.statements.RunBeforeTestMethodCallbacks.evaluate(RunBeforeTestMethodCallbacks.java:73)
  353. at org.junit.internal.runners.statements.RunAfters.evaluate(RunAfters.java:27)
  354. at org.springframework.test.context.junit4.statements.RunAfterTestMethodCallbacks.evaluate(RunAfterTestMethodCallbacks.java:82)
  355. at org.junit.rules.ExpectedException$ExpectedExceptionStatement.evaluate(ExpectedException.java:168)
  356. at org.junit.rules.RunRules.evaluate(RunRules.java:20)
  357. at org.springframework.test.context.junit4.statements.SpringRepeat.evaluate(SpringRepeat.java:73)
  358. at org.junit.runners.ParentRunner.runLeaf(ParentRunner.java:271)
  359. at org.springframework.test.context.junit4.SpringJUnit4ClassRunner.runChild(SpringJUnit4ClassRunner.java:217)
  360. at org.springframework.test.context.junit4.SpringJUnit4ClassRunner.runChild(SpringJUnit4ClassRunner.java:83)
  361. at org.junit.runners.ParentRunner$3.run(ParentRunner.java:238)
  362. at org.junit.runners.ParentRunner$1.schedule(ParentRunner.java:63)
  363. at org.junit.runners.ParentRunner.runChildren(ParentRunner.java:236)
  364. at org.junit.runners.ParentRunner.access$000(ParentRunner.java:53)
  365. at org.junit.runners.ParentRunner$2.evaluate(ParentRunner.java:229)
  366. at org.springframework.test.context.junit4.statements.RunBeforeTestClassCallbacks.evaluate(RunBeforeTestClassCallbacks.java:61)
  367. at org.junit.internal.runners.statements.RunAfters.evaluate(RunAfters.java:27)
  368. at org.springframework.test.context.junit4.statements.RunAfterTestClassCallbacks.evaluate(RunAfterTestClassCallbacks.java:68)
  369. at org.junit.runners.ParentRunner.run(ParentRunner.java:309)
  370. at org.springframework.test.context.junit4.SpringJUnit4ClassRunner.run(SpringJUnit4ClassRunner.java:163)
  371. at org.apache.maven.surefire.junit4.JUnit4Provider.execute(JUnit4Provider.java:283)
  372. at org.apache.maven.surefire.junit4.JUnit4Provider.executeWithRerun(JUnit4Provider.java:173)
  373. at org.apache.maven.surefire.junit4.JUnit4Provider.executeTestSet(JUnit4Provider.java:153)
  374. at org.apache.maven.surefire.junit4.JUnit4Provider.invoke(JUnit4Provider.java:128)
  375. at org.apache.maven.surefire.booter.ForkedBooter.invokeProviderInSameClassLoader(ForkedBooter.java:203)
  376. at org.apache.maven.surefire.booter.ForkedBooter.runSuitesInProcess(ForkedBooter.java:155)
  377. at org.apache.maven.surefire.booter.ForkedBooter.main(ForkedBooter.java:103)
  378. ERROR - ImageHandler.getObs(97) |2017-04-07 09:46:22,128| Image /var/folders/mh/0dl_nbvn4ll77c5nkf62v7ch0000gn/T/appdir-for-unit-tests-5677297229533716535/complex_obs/openmrs_logo_small.gif was not found
  379. java.io.FileNotFoundException: /var/folders/mh/0dl_nbvn4ll77c5nkf62v7ch0000gn/T/appdir-for-unit-tests-5677297229533716535/complex_obs/openmrs_logo_small.gif (No such file or directory)
  380. at java.io.RandomAccessFile.open0(Native Method)
  381. at java.io.RandomAccessFile.open(RandomAccessFile.java:316)
  382. at java.io.RandomAccessFile.<init>(RandomAccessFile.java:243)
  383. at javax.imageio.stream.FileImageInputStream.<init>(FileImageInputStream.java:73)
  384. at org.openmrs.obs.handler.ImageHandler.getObs(ImageHandler.java:87)
  385. at org.openmrs.api.impl.ObsServiceImpl.getComplexObs(ObsServiceImpl.java:498)
  386. at sun.reflect.NativeMethodAccessorImpl.invoke0(Native Method)
  387. at sun.reflect.NativeMethodAccessorImpl.invoke(NativeMethodAccessorImpl.java:62)
  388. at sun.reflect.DelegatingMethodAccessorImpl.invoke(DelegatingMethodAccessorImpl.java:43)
  389. at java.lang.reflect.Method.invoke(Method.java:498)
  390. at org.springframework.aop.support.AopUtils.invokeJoinpointUsingReflection(AopUtils.java:317)
  391. at org.springframework.aop.framework.ReflectiveMethodInvocation.invokeJoinpoint(ReflectiveMethodInvocation.java:190)
  392. at org.springframework.aop.framework.ReflectiveMethodInvocation.proceed(ReflectiveMethodInvocation.java:157)
  393. at org.springframework.transaction.interceptor.TransactionInterceptor$1.proceedWithInvocation(TransactionInterceptor.java:99)
  394. at org.springframework.transaction.interceptor.TransactionAspectSupport.invokeWithinTransaction(TransactionAspectSupport.java:281)
  395. at org.springframework.transaction.interceptor.TransactionInterceptor.invoke(TransactionInterceptor.java:96)
  396. at org.springframework.aop.framework.ReflectiveMethodInvocation.proceed(ReflectiveMethodInvocation.java:179)
  397. at org.springframework.aop.framework.JdkDynamicAopProxy.invoke(JdkDynamicAopProxy.java:207)
  398. at com.sun.proxy.$Proxy78.getComplexObs(Unknown Source)
  399. at sun.reflect.NativeMethodAccessorImpl.invoke0(Native Method)
  400. at sun.reflect.NativeMethodAccessorImpl.invoke(NativeMethodAccessorImpl.java:62)
  401. at sun.reflect.DelegatingMethodAccessorImpl.invoke(DelegatingMethodAccessorImpl.java:43)
  402. at java.lang.reflect.Method.invoke(Method.java:498)
  403. at org.springframework.aop.support.AopUtils.invokeJoinpointUsingReflection(AopUtils.java:317)
  404. at org.springframework.aop.framework.ReflectiveMethodInvocation.invokeJoinpoint(ReflectiveMethodInvocation.java:190)
  405. at org.springframework.aop.framework.ReflectiveMethodInvocation.proceed(ReflectiveMethodInvocation.java:157)
  406. at org.springframework.cache.interceptor.CacheInterceptor$1.invoke(CacheInterceptor.java:52)
  407. at org.springframework.cache.interceptor.CacheAspectSupport.execute(CacheAspectSupport.java:303)
  408. at org.springframework.cache.interceptor.CacheInterceptor.invoke(CacheInterceptor.java:61)
  409. at org.springframework.aop.framework.ReflectiveMethodInvocation.proceed(ReflectiveMethodInvocation.java:179)
  410. at org.openmrs.aop.LoggingAdvice.invoke(LoggingAdvice.java:122)
  411. at org.springframework.aop.framework.ReflectiveMethodInvocation.proceed(ReflectiveMethodInvocation.java:179)
  412. at org.springframework.aop.framework.adapter.MethodBeforeAdviceInterceptor.invoke(MethodBeforeAdviceInterceptor.java:52)
  413. at org.springframework.aop.framework.ReflectiveMethodInvocation.proceed(ReflectiveMethodInvocation.java:179)
  414. at org.springframework.aop.framework.adapter.MethodBeforeAdviceInterceptor.invoke(MethodBeforeAdviceInterceptor.java:52)
  415. at org.springframework.aop.framework.ReflectiveMethodInvocation.proceed(ReflectiveMethodInvocation.java:179)
  416. at org.springframework.aop.framework.JdkDynamicAopProxy.invoke(JdkDynamicAopProxy.java:207)
  417. at com.sun.proxy.$Proxy79.getComplexObs(Unknown Source)
  418. at org.openmrs.api.ObsServiceTest.purgeObs_shouldDeleteTheGivenObsFromTheDatabase(ObsServiceTest.java:1319)
  419. at sun.reflect.NativeMethodAccessorImpl.invoke0(Native Method)
  420. at sun.reflect.NativeMethodAccessorImpl.invoke(NativeMethodAccessorImpl.java:62)
  421. at sun.reflect.DelegatingMethodAccessorImpl.invoke(DelegatingMethodAccessorImpl.java:43)
  422. at java.lang.reflect.Method.invoke(Method.java:498)
  423. at org.junit.runners.model.FrameworkMethod$1.runReflectiveCall(FrameworkMethod.java:47)
  424. at org.junit.internal.runners.model.ReflectiveCallable.run(ReflectiveCallable.java:12)
  425. at org.junit.runners.model.FrameworkMethod.invokeExplosively(FrameworkMethod.java:44)
  426. at org.junit.internal.runners.statements.InvokeMethod.evaluate(InvokeMethod.java:17)
  427. at org.junit.internal.runners.statements.RunBefores.evaluate(RunBefores.java:26)
  428. at org.springframework.test.context.junit4.statements.RunBeforeTestMethodCallbacks.evaluate(RunBeforeTestMethodCallbacks.java:73)
  429. at org.junit.internal.runners.statements.RunAfters.evaluate(RunAfters.java:27)
  430. at org.springframework.test.context.junit4.statements.RunAfterTestMethodCallbacks.evaluate(RunAfterTestMethodCallbacks.java:82)
  431. at org.junit.rules.ExpectedException$ExpectedExceptionStatement.evaluate(ExpectedException.java:168)
  432. at org.junit.rules.RunRules.evaluate(RunRules.java:20)
  433. at org.springframework.test.context.junit4.statements.SpringRepeat.evaluate(SpringRepeat.java:73)
  434. at org.junit.runners.ParentRunner.runLeaf(ParentRunner.java:271)
  435. at org.springframework.test.context.junit4.SpringJUnit4ClassRunner.runChild(SpringJUnit4ClassRunner.java:217)
  436. at org.springframework.test.context.junit4.SpringJUnit4ClassRunner.runChild(SpringJUnit4ClassRunner.java:83)
  437. at org.junit.runners.ParentRunner$3.run(ParentRunner.java:238)
  438. at org.junit.runners.ParentRunner$1.schedule(ParentRunner.java:63)
  439. at org.junit.runners.ParentRunner.runChildren(ParentRunner.java:236)
  440. at org.junit.runners.ParentRunner.access$000(ParentRunner.java:53)
  441. at org.junit.runners.ParentRunner$2.evaluate(ParentRunner.java:229)
  442. at org.springframework.test.context.junit4.statements.RunBeforeTestClassCallbacks.evaluate(RunBeforeTestClassCallbacks.java:61)
  443. at org.junit.internal.runners.statements.RunAfters.evaluate(RunAfters.java:27)
  444. at org.springframework.test.context.junit4.statements.RunAfterTestClassCallbacks.evaluate(RunAfterTestClassCallbacks.java:68)
  445. at org.junit.runners.ParentRunner.run(ParentRunner.java:309)
  446. at org.springframework.test.context.junit4.SpringJUnit4ClassRunner.run(SpringJUnit4ClassRunner.java:163)
  447. at org.apache.maven.surefire.junit4.JUnit4Provider.execute(JUnit4Provider.java:283)
  448. at org.apache.maven.surefire.junit4.JUnit4Provider.executeWithRerun(JUnit4Provider.java:173)
  449. at org.apache.maven.surefire.junit4.JUnit4Provider.executeTestSet(JUnit4Provider.java:153)
  450. at org.apache.maven.surefire.junit4.JUnit4Provider.invoke(JUnit4Provider.java:128)
  451. at org.apache.maven.surefire.booter.ForkedBooter.invokeProviderInSameClassLoader(ForkedBooter.java:203)
  452. at org.apache.maven.surefire.booter.ForkedBooter.runSuitesInProcess(ForkedBooter.java:155)
  453. at org.apache.maven.surefire.booter.ForkedBooter.main(ForkedBooter.java:103)
  454. Tests run: 76, Failures: 0, Errors: 0, Skipped: 0, Time elapsed: 0.792 sec - in org.openmrs.api.ObsServiceTest
  455. Running org.openmrs.api.OpenmrsServiceTest
  456. Tests run: 1, Failures: 0, Errors: 0, Skipped: 1, Time elapsed: 0 sec - in org.openmrs.api.OpenmrsServiceTest
  457. Running org.openmrs.api.OrderServiceTest
  458. Tests run: 165, Failures: 0, Errors: 0, Skipped: 3, Time elapsed: 1.884 sec - in org.openmrs.api.OrderServiceTest
  459. Running org.openmrs.api.OrderSetServiceTest
  460. Tests run: 12, Failures: 0, Errors: 0, Skipped: 0, Time elapsed: 0.188 sec - in org.openmrs.api.OrderSetServiceTest
  461. Running org.openmrs.api.PatientServiceAllergyTest
  462. Tests run: 16, Failures: 0, Errors: 0, Skipped: 0, Time elapsed: 0.27 sec - in org.openmrs.api.PatientServiceAllergyTest
  463. Running org.openmrs.api.PatientServiceTest
  464. Tests run: 167, Failures: 0, Errors: 0, Skipped: 1, Time elapsed: 10.997 sec - in org.openmrs.api.PatientServiceTest
  465. Running org.openmrs.api.PersonServiceTest
  466. Tests run: 119, Failures: 0, Errors: 0, Skipped: 0, Time elapsed: 0.792 sec - in org.openmrs.api.PersonServiceTest
  467. Running org.openmrs.api.ProgramWorkflowServiceTest
  468. Tests run: 25, Failures: 0, Errors: 0, Skipped: 0, Time elapsed: 0.368 sec - in org.openmrs.api.ProgramWorkflowServiceTest
  469. Running org.openmrs.api.ProgramWorkflowServiceUnitTest
  470. Tests run: 3, Failures: 0, Errors: 0, Skipped: 0, Time elapsed: 0.007 sec - in org.openmrs.api.ProgramWorkflowServiceUnitTest
  471. Running org.openmrs.api.ProviderServiceTest
  472. Tests run: 40, Failures: 0, Errors: 0, Skipped: 2, Time elapsed: 0.435 sec - in org.openmrs.api.ProviderServiceTest
  473. Running org.openmrs.api.UserServiceTest
  474. Tests run: 85, Failures: 0, Errors: 0, Skipped: 1, Time elapsed: 2.082 sec - in org.openmrs.api.UserServiceTest
  475. Running org.openmrs.api.VisitServiceTest
  476. Tests run: 60, Failures: 0, Errors: 0, Skipped: 0, Time elapsed: 0.437 sec - in org.openmrs.api.VisitServiceTest
  477. Running org.openmrs.attribute.AttributeIntegrationTest
  478. Tests run: 1, Failures: 0, Errors: 0, Skipped: 0, Time elapsed: 0.012 sec - in org.openmrs.attribute.AttributeIntegrationTest
  479. Running org.openmrs.BaseCustomizableMetadataTest
  480. Tests run: 2, Failures: 0, Errors: 0, Skipped: 0, Time elapsed: 0.041 sec - in org.openmrs.BaseCustomizableMetadataTest
  481. Running org.openmrs.BaseOpenmrsObjectTest
  482. Tests run: 20, Failures: 0, Errors: 0, Skipped: 0, Time elapsed: 0.061 sec - in org.openmrs.BaseOpenmrsObjectTest
  483. Running org.openmrs.CohortTest
  484. Tests run: 4, Failures: 0, Errors: 0, Skipped: 0, Time elapsed: 0.02 sec - in org.openmrs.CohortTest
  485. Running org.openmrs.comparator.PatientIdentifierTypeDefaultComparatorTest
  486. Tests run: 1, Failures: 0, Errors: 0, Skipped: 0, Time elapsed: 0 sec - in org.openmrs.comparator.PatientIdentifierTypeDefaultComparatorTest
  487. Running org.openmrs.ConceptComponentTest
  488. Tests run: 1, Failures: 0, Errors: 0, Skipped: 0, Time elapsed: 0.009 sec - in org.openmrs.ConceptComponentTest
  489. Running org.openmrs.ConceptNumericTest
  490. Tests run: 8, Failures: 0, Errors: 0, Skipped: 0, Time elapsed: 0.036 sec - in org.openmrs.ConceptNumericTest
  491. Running org.openmrs.ConceptReferenceTermTest
  492. Tests run: 3, Failures: 0, Errors: 0, Skipped: 0, Time elapsed: 0 sec - in org.openmrs.ConceptReferenceTermTest
  493. Running org.openmrs.ConceptTest
  494. Tests run: 72, Failures: 0, Errors: 0, Skipped: 0, Time elapsed: 0.232 sec - in org.openmrs.ConceptTest
  495. Running org.openmrs.customdatatype.CustomDatatypeUtilTest
  496. Tests run: 1, Failures: 0, Errors: 0, Skipped: 0, Time elapsed: 0.012 sec - in org.openmrs.customdatatype.CustomDatatypeUtilTest
  497. Running org.openmrs.customdatatype.datatype.BaseMetadataDatatypeTest
  498. Tests run: 1, Failures: 0, Errors: 0, Skipped: 0, Time elapsed: 0 sec - in org.openmrs.customdatatype.datatype.BaseMetadataDatatypeTest
  499. Running org.openmrs.customdatatype.datatype.BaseOpenmrsDatatypeTest
  500. Tests run: 1, Failures: 0, Errors: 0, Skipped: 0, Time elapsed: 0 sec - in org.openmrs.customdatatype.datatype.BaseOpenmrsDatatypeTest
  501. Running org.openmrs.customdatatype.datatype.DateDatatypeTest
  502. Tests run: 2, Failures: 0, Errors: 0, Skipped: 0, Time elapsed: 0 sec - in org.openmrs.customdatatype.datatype.DateDatatypeTest
  503. Running org.openmrs.customdatatype.datatype.RegexValidatedTextTest
  504. Tests run: 3, Failures: 0, Errors: 0, Skipped: 0, Time elapsed: 0 sec - in org.openmrs.customdatatype.datatype.RegexValidatedTextTest
  505. Running org.openmrs.DrugOrderTest
  506. Tests run: 22, Failures: 0, Errors: 0, Skipped: 0, Time elapsed: 0.042 sec - in org.openmrs.DrugOrderTest
  507. Running org.openmrs.DrugTest
  508. Tests run: 2, Failures: 0, Errors: 0, Skipped: 0, Time elapsed: 0.019 sec - in org.openmrs.DrugTest
  509. Running org.openmrs.DurationTest
  510. Tests run: 11, Failures: 0, Errors: 0, Skipped: 0, Time elapsed: 0.042 sec - in org.openmrs.DurationTest
  511. Running org.openmrs.EncounterProviderTest
  512. Tests run: 1, Failures: 0, Errors: 0, Skipped: 0, Time elapsed: 0 sec - in org.openmrs.EncounterProviderTest
  513. Running org.openmrs.EncounterRoleTest
  514. Tests run: 1, Failures: 0, Errors: 0, Skipped: 0, Time elapsed: 0 sec - in org.openmrs.EncounterRoleTest
  515. Running org.openmrs.EncounterTest
  516. Tests run: 57, Failures: 0, Errors: 0, Skipped: 0, Time elapsed: 0.488 sec - in org.openmrs.EncounterTest
  517. Running org.openmrs.EncounterTypeTest
  518. Tests run: 1, Failures: 0, Errors: 0, Skipped: 0, Time elapsed: 0 sec - in org.openmrs.EncounterTypeTest
  519. Running org.openmrs.FormTest
  520. Tests run: 1, Failures: 0, Errors: 0, Skipped: 0, Time elapsed: 0 sec - in org.openmrs.FormTest
  521. Running org.openmrs.hl7.handler.ORUR01HandlerTest
  522. Tests run: 39, Failures: 0, Errors: 0, Skipped: 0, Time elapsed: 1.136 sec - in org.openmrs.hl7.handler.ORUR01HandlerTest
  523. Running org.openmrs.hl7.HL7ServiceTest
  524. ERROR - HL7ServiceImpl.setFatalError(796) |2017-04-07 09:46:42,097| Fatal error
  525. ca.uhn.hl7v2.HL7Exception: HL7 encoding not supported
  526. at org.openmrs.hl7.impl.HL7ServiceImpl.parseHL7String(HL7ServiceImpl.java:818)
  527. at sun.reflect.GeneratedMethodAccessor1495.invoke(Unknown Source)
  528. at sun.reflect.DelegatingMethodAccessorImpl.invoke(DelegatingMethodAccessorImpl.java:43)
  529. at java.lang.reflect.Method.invoke(Method.java:498)
  530. at org.springframework.aop.support.AopUtils.invokeJoinpointUsingReflection(AopUtils.java:317)
  531. at org.springframework.aop.framework.ReflectiveMethodInvocation.invokeJoinpoint(ReflectiveMethodInvocation.java:190)
  532. at org.springframework.aop.framework.ReflectiveMethodInvocation.proceed(ReflectiveMethodInvocation.java:157)
  533. at org.springframework.transaction.interceptor.TransactionInterceptor$1.proceedWithInvocation(TransactionInterceptor.java:99)
  534. at org.springframework.transaction.interceptor.TransactionAspectSupport.invokeWithinTransaction(TransactionAspectSupport.java:281)
  535. at org.springframework.transaction.interceptor.TransactionInterceptor.invoke(TransactionInterceptor.java:96)
  536. at org.springframework.aop.framework.ReflectiveMethodInvocation.proceed(ReflectiveMethodInvocation.java:179)
  537. at org.springframework.aop.framework.JdkDynamicAopProxy.invoke(JdkDynamicAopProxy.java:207)
  538. at com.sun.proxy.$Proxy101.parseHL7String(Unknown Source)
  539. at sun.reflect.GeneratedMethodAccessor1495.invoke(Unknown Source)
  540. at sun.reflect.DelegatingMethodAccessorImpl.invoke(DelegatingMethodAccessorImpl.java:43)
  541. at java.lang.reflect.Method.invoke(Method.java:498)
  542. at org.springframework.aop.support.AopUtils.invokeJoinpointUsingReflection(AopUtils.java:317)
  543. at org.springframework.aop.framework.ReflectiveMethodInvocation.invokeJoinpoint(ReflectiveMethodInvocation.java:190)
  544. at org.springframework.aop.framework.ReflectiveMethodInvocation.proceed(ReflectiveMethodInvocation.java:157)
  545. at org.springframework.cache.interceptor.CacheInterceptor$1.invoke(CacheInterceptor.java:52)
  546. at org.springframework.cache.interceptor.CacheAspectSupport.execute(CacheAspectSupport.java:303)
  547. at org.springframework.cache.interceptor.CacheInterceptor.invoke(CacheInterceptor.java:61)
  548. at org.springframework.aop.framework.ReflectiveMethodInvocation.proceed(ReflectiveMethodInvocation.java:179)
  549. at org.openmrs.aop.LoggingAdvice.invoke(LoggingAdvice.java:122)
  550. at org.springframework.aop.framework.ReflectiveMethodInvocation.proceed(ReflectiveMethodInvocation.java:179)
  551. at org.springframework.aop.framework.adapter.MethodBeforeAdviceInterceptor.invoke(MethodBeforeAdviceInterceptor.java:52)
  552. at org.springframework.aop.framework.ReflectiveMethodInvocation.proceed(ReflectiveMethodInvocation.java:179)
  553. at org.springframework.aop.framework.adapter.MethodBeforeAdviceInterceptor.invoke(MethodBeforeAdviceInterceptor.java:52)
  554. at org.springframework.aop.framework.ReflectiveMethodInvocation.proceed(ReflectiveMethodInvocation.java:179)
  555. at org.springframework.aop.framework.JdkDynamicAopProxy.invoke(JdkDynamicAopProxy.java:207)
  556. at com.sun.proxy.$Proxy102.parseHL7String(Unknown Source)
  557. at org.openmrs.hl7.impl.HL7ServiceImpl.processHL7InQueue(HL7ServiceImpl.java:743)
  558. at sun.reflect.NativeMethodAccessorImpl.invoke0(Native Method)
  559. at sun.reflect.NativeMethodAccessorImpl.invoke(NativeMethodAccessorImpl.java:62)
  560. at sun.reflect.DelegatingMethodAccessorImpl.invoke(DelegatingMethodAccessorImpl.java:43)
  561. at java.lang.reflect.Method.invoke(Method.java:498)
  562. at org.springframework.aop.support.AopUtils.invokeJoinpointUsingReflection(AopUtils.java:317)
  563. at org.springframework.aop.framework.ReflectiveMethodInvocation.invokeJoinpoint(ReflectiveMethodInvocation.java:190)
  564. at org.springframework.aop.framework.ReflectiveMethodInvocation.proceed(ReflectiveMethodInvocation.java:157)
  565. at org.springframework.transaction.interceptor.TransactionInterceptor$1.proceedWithInvocation(TransactionInterceptor.java:99)
  566. at org.springframework.transaction.interceptor.TransactionAspectSupport.invokeWithinTransaction(TransactionAspectSupport.java:281)
  567. at org.springframework.transaction.interceptor.TransactionInterceptor.invoke(TransactionInterceptor.java:96)
  568. at org.springframework.aop.framework.ReflectiveMethodInvocation.proceed(ReflectiveMethodInvocation.java:179)
  569. at org.springframework.aop.framework.JdkDynamicAopProxy.invoke(JdkDynamicAopProxy.java:207)
  570. at com.sun.proxy.$Proxy101.processHL7InQueue(Unknown Source)
  571. at sun.reflect.NativeMethodAccessorImpl.invoke0(Native Method)
  572. at sun.reflect.NativeMethodAccessorImpl.invoke(NativeMethodAccessorImpl.java:62)
  573. at sun.reflect.DelegatingMethodAccessorImpl.invoke(DelegatingMethodAccessorImpl.java:43)
  574. at java.lang.reflect.Method.invoke(Method.java:498)
  575. at org.springframework.aop.support.AopUtils.invokeJoinpointUsingReflection(AopUtils.java:317)
  576. at org.springframework.aop.framework.ReflectiveMethodInvocation.invokeJoinpoint(ReflectiveMethodInvocation.java:190)
  577. at org.springframework.aop.framework.ReflectiveMethodInvocation.proceed(ReflectiveMethodInvocation.java:157)
  578. at org.springframework.cache.interceptor.CacheInterceptor$1.invoke(CacheInterceptor.java:52)
  579. at org.springframework.cache.interceptor.CacheAspectSupport.execute(CacheAspectSupport.java:303)
  580. at org.springframework.cache.interceptor.CacheInterceptor.invoke(CacheInterceptor.java:61)
  581. at org.springframework.aop.framework.ReflectiveMethodInvocation.proceed(ReflectiveMethodInvocation.java:179)
  582. at org.openmrs.aop.LoggingAdvice.invoke(LoggingAdvice.java:122)
  583. at org.springframework.aop.framework.ReflectiveMethodInvocation.proceed(ReflectiveMethodInvocation.java:179)
  584. at org.springframework.aop.framework.adapter.MethodBeforeAdviceInterceptor.invoke(MethodBeforeAdviceInterceptor.java:52)
  585. at org.springframework.aop.framework.ReflectiveMethodInvocation.proceed(ReflectiveMethodInvocation.java:179)
  586. at org.springframework.aop.framework.adapter.MethodBeforeAdviceInterceptor.invoke(MethodBeforeAdviceInterceptor.java:52)
  587. at org.springframework.aop.framework.ReflectiveMethodInvocation.proceed(ReflectiveMethodInvocation.java:179)
  588. at org.springframework.aop.framework.JdkDynamicAopProxy.invoke(JdkDynamicAopProxy.java:207)
  589. at com.sun.proxy.$Proxy102.processHL7InQueue(Unknown Source)
  590. at org.openmrs.hl7.HL7ServiceTest.processHL7InQueue_shouldCreateHL7InErrorAfterFailedParsing(HL7ServiceTest.java:119)
  591. at sun.reflect.NativeMethodAccessorImpl.invoke0(Native Method)
  592. at sun.reflect.NativeMethodAccessorImpl.invoke(NativeMethodAccessorImpl.java:62)
  593. at sun.reflect.DelegatingMethodAccessorImpl.invoke(DelegatingMethodAccessorImpl.java:43)
  594. at java.lang.reflect.Method.invoke(Method.java:498)
  595. at org.junit.runners.model.FrameworkMethod$1.runReflectiveCall(FrameworkMethod.java:47)
  596. at org.junit.internal.runners.model.ReflectiveCallable.run(ReflectiveCallable.java:12)
  597. at org.junit.runners.model.FrameworkMethod.invokeExplosively(FrameworkMethod.java:44)
  598. at org.junit.internal.runners.statements.InvokeMethod.evaluate(InvokeMethod.java:17)
  599. at org.junit.internal.runners.statements.RunBefores.evaluate(RunBefores.java:26)
  600. at org.springframework.test.context.junit4.statements.RunBeforeTestMethodCallbacks.evaluate(RunBeforeTestMethodCallbacks.java:73)
  601. at org.junit.internal.runners.statements.RunAfters.evaluate(RunAfters.java:27)
  602. at org.springframework.test.context.junit4.statements.RunAfterTestMethodCallbacks.evaluate(RunAfterTestMethodCallbacks.java:82)
  603. at org.springframework.test.context.junit4.statements.SpringRepeat.evaluate(SpringRepeat.java:73)
  604. at org.junit.runners.ParentRunner.runLeaf(ParentRunner.java:271)
  605. at org.springframework.test.context.junit4.SpringJUnit4ClassRunner.runChild(SpringJUnit4ClassRunner.java:217)
  606. at org.springframework.test.context.junit4.SpringJUnit4ClassRunner.runChild(SpringJUnit4ClassRunner.java:83)
  607. at org.junit.runners.ParentRunner$3.run(ParentRunner.java:238)
  608. at org.junit.runners.ParentRunner$1.schedule(ParentRunner.java:63)
  609. at org.junit.runners.ParentRunner.runChildren(ParentRunner.java:236)
  610. at org.junit.runners.ParentRunner.access$000(ParentRunner.java:53)
  611. at org.junit.runners.ParentRunner$2.evaluate(ParentRunner.java:229)
  612. at org.springframework.test.context.junit4.statements.RunBeforeTestClassCallbacks.evaluate(RunBeforeTestClassCallbacks.java:61)
  613. at org.junit.internal.runners.statements.RunAfters.evaluate(RunAfters.java:27)
  614. at org.springframework.test.context.junit4.statements.RunAfterTestClassCallbacks.evaluate(RunAfterTestClassCallbacks.java:68)
  615. at org.junit.runners.ParentRunner.run(ParentRunner.java:309)
  616. at org.springframework.test.context.junit4.SpringJUnit4ClassRunner.run(SpringJUnit4ClassRunner.java:163)
  617. at org.apache.maven.surefire.junit4.JUnit4Provider.execute(JUnit4Provider.java:283)
  618. at org.apache.maven.surefire.junit4.JUnit4Provider.executeWithRerun(JUnit4Provider.java:173)
  619. at org.apache.maven.surefire.junit4.JUnit4Provider.executeTestSet(JUnit4Provider.java:153)
  620. at org.apache.maven.surefire.junit4.JUnit4Provider.invoke(JUnit4Provider.java:128)
  621. at org.apache.maven.surefire.booter.ForkedBooter.invokeProviderInSameClassLoader(ForkedBooter.java:203)
  622. at org.apache.maven.surefire.booter.ForkedBooter.runSuitesInProcess(ForkedBooter.java:155)
  623. at org.apache.maven.surefire.booter.ForkedBooter.main(ForkedBooter.java:103)
  624. Caused by: ca.uhn.hl7v2.parser.EncodingNotSupportedException: Can't parse message beginning a malformed hl7 message
  625. at ca.uhn.hl7v2.parser.Parser.parse(Parser.java:183)
  626. at org.openmrs.hl7.impl.HL7ServiceImpl.parseHL7String(HL7ServiceImpl.java:815)
  627. ... 97 more
  628. ERROR - HL7ServiceImpl.resolveUserId(472) |2017-04-07 09:46:42,118| Error resolving user with id 'null' family name 'User' and given name 'Super': Found 2 ambiguous users.
  629. Tests run: 29, Failures: 0, Errors: 0, Skipped: 2, Time elapsed: 0.381 sec - in org.openmrs.hl7.HL7ServiceTest
  630. Running org.openmrs.hl7.HL7UtilTest
  631. Tests run: 5, Failures: 0, Errors: 0, Skipped: 0, Time elapsed: 0 sec - in org.openmrs.hl7.HL7UtilTest
  632. Running org.openmrs.layout.name.NameTemplateTest
  633. Tests run: 2, Failures: 0, Errors: 0, Skipped: 0, Time elapsed: 0.001 sec - in org.openmrs.layout.name.NameTemplateTest
  634. Running org.openmrs.LocationTest
  635. Tests run: 3, Failures: 0, Errors: 0, Skipped: 0, Time elapsed: 0 sec - in org.openmrs.LocationTest
  636. Running org.openmrs.logic.result.EmptyResultTest
  637. Tests run: 2, Failures: 0, Errors: 0, Skipped: 0, Time elapsed: 0.001 sec - in org.openmrs.logic.result.EmptyResultTest
  638. Running org.openmrs.logic.result.ResultTest
  639. Tests run: 17, Failures: 0, Errors: 0, Skipped: 0, Time elapsed: 0.003 sec - in org.openmrs.logic.result.ResultTest
  640. Running org.openmrs.messagesource.impl.CachedMessageSourceTest
  641. Tests run: 2, Failures: 0, Errors: 0, Skipped: 0, Time elapsed: 0.007 sec - in org.openmrs.messagesource.impl.CachedMessageSourceTest
  642. Running org.openmrs.messagesource.MessageSourceServiceTest
  643. Tests run: 1, Failures: 0, Errors: 0, Skipped: 0, Time elapsed: 0.014 sec - in org.openmrs.messagesource.MessageSourceServiceTest
  644. Running org.openmrs.messagesource.PresentationMessageMapTest
  645. Tests run: 2, Failures: 0, Errors: 0, Skipped: 0, Time elapsed: 0 sec - in org.openmrs.messagesource.PresentationMessageMapTest
  646. Running org.openmrs.module.ModuleActivatorTest
  647. INFO 4/7/17 9:46 AM:liquibase: Creating database history table with name: LIQUIBASECHANGELOG
  648. INFO 4/7/17 9:46 AM:liquibase: liquibase.xml is using schema version 1.9 rather than version 2.0
  649. INFO 4/7/17 9:46 AM:liquibase: Reading from LIQUIBASECHANGELOG
  650. INFO 4/7/17 9:46 AM:liquibase: Successfully acquired change log lock
  651. INFO 4/7/17 9:46 AM:liquibase: liquibase.xml is using schema version 1.9 rather than version 2.0
  652. INFO 4/7/17 9:46 AM:liquibase: Successfully released change log lock
  653. INFO 4/7/17 9:46 AM:liquibase: liquibase.xml is using schema version 1.9 rather than version 2.0
  654. INFO 4/7/17 9:46 AM:liquibase: Reading from LIQUIBASECHANGELOG
  655. INFO 4/7/17 9:46 AM:liquibase: Successfully acquired change log lock
  656. INFO 4/7/17 9:46 AM:liquibase: liquibase.xml is using schema version 1.9 rather than version 2.0
  657. INFO 4/7/17 9:46 AM:liquibase: Successfully released change log lock
  658. INFO 4/7/17 9:46 AM:liquibase: liquibase.xml is using schema version 1.9 rather than version 2.0
  659. INFO 4/7/17 9:46 AM:liquibase: Reading from LIQUIBASECHANGELOG
  660. INFO 4/7/17 9:46 AM:liquibase: Successfully acquired change log lock
  661. INFO 4/7/17 9:46 AM:liquibase: liquibase.xml is using schema version 1.9 rather than version 2.0
  662. INFO 4/7/17 9:46 AM:liquibase: Successfully released change log lock
  663. INFO 4/7/17 9:46 AM:liquibase: liquibase.xml is using schema version 1.9 rather than version 2.0
  664. INFO 4/7/17 9:46 AM:liquibase: Reading from LIQUIBASECHANGELOG
  665. INFO 4/7/17 9:46 AM:liquibase: Successfully acquired change log lock
  666. INFO 4/7/17 9:46 AM:liquibase: liquibase.xml is using schema version 1.9 rather than version 2.0
  667. INFO 4/7/17 9:46 AM:liquibase: Successfully released change log lock
  668. INFO 4/7/17 9:46 AM:liquibase: liquibase.xml is using schema version 1.9 rather than version 2.0
  669. INFO 4/7/17 9:46 AM:liquibase: Reading from LIQUIBASECHANGELOG
  670. INFO 4/7/17 9:46 AM:liquibase: Successfully acquired change log lock
  671. INFO 4/7/17 9:46 AM:liquibase: liquibase.xml is using schema version 1.9 rather than version 2.0
  672. INFO 4/7/17 9:46 AM:liquibase: Successfully released change log lock
  673. INFO 4/7/17 9:46 AM:liquibase: liquibase.xml is using schema version 1.9 rather than version 2.0
  674. INFO 4/7/17 9:46 AM:liquibase: Reading from LIQUIBASECHANGELOG
  675. INFO 4/7/17 9:46 AM:liquibase: Successfully acquired change log lock
  676. INFO 4/7/17 9:46 AM:liquibase: liquibase.xml is using schema version 1.9 rather than version 2.0
  677. INFO 4/7/17 9:46 AM:liquibase: Successfully released change log lock
  678. INFO 4/7/17 9:46 AM:liquibase: liquibase.xml is using schema version 1.9 rather than version 2.0
  679. INFO 4/7/17 9:46 AM:liquibase: Reading from LIQUIBASECHANGELOG
  680. INFO 4/7/17 9:46 AM:liquibase: Successfully acquired change log lock
  681. INFO 4/7/17 9:46 AM:liquibase: liquibase.xml is using schema version 1.9 rather than version 2.0
  682. INFO 4/7/17 9:46 AM:liquibase: Successfully released change log lock
  683. INFO 4/7/17 9:46 AM:liquibase: liquibase.xml is using schema version 1.9 rather than version 2.0
  684. INFO 4/7/17 9:46 AM:liquibase: Reading from LIQUIBASECHANGELOG
  685. INFO 4/7/17 9:46 AM:liquibase: Successfully acquired change log lock
  686. INFO 4/7/17 9:46 AM:liquibase: liquibase.xml is using schema version 1.9 rather than version 2.0
  687. INFO 4/7/17 9:46 AM:liquibase: Successfully released change log lock
  688. INFO 4/7/17 9:46 AM:liquibase: liquibase.xml is using schema version 1.9 rather than version 2.0
  689. INFO 4/7/17 9:46 AM:liquibase: Reading from LIQUIBASECHANGELOG
  690. INFO 4/7/17 9:46 AM:liquibase: Successfully acquired change log lock
  691. INFO 4/7/17 9:46 AM:liquibase: liquibase.xml is using schema version 1.9 rather than version 2.0
  692. INFO 4/7/17 9:46 AM:liquibase: Successfully released change log lock
  693. INFO 4/7/17 9:46 AM:liquibase: liquibase.xml is using schema version 1.9 rather than version 2.0
  694. INFO 4/7/17 9:46 AM:liquibase: Reading from LIQUIBASECHANGELOG
  695. INFO 4/7/17 9:46 AM:liquibase: Successfully acquired change log lock
  696. INFO 4/7/17 9:46 AM:liquibase: liquibase.xml is using schema version 1.9 rather than version 2.0
  697. INFO 4/7/17 9:46 AM:liquibase: Successfully released change log lock
  698. INFO 4/7/17 9:46 AM:liquibase: liquibase.xml is using schema version 1.9 rather than version 2.0
  699. INFO 4/7/17 9:46 AM:liquibase: Reading from LIQUIBASECHANGELOG
  700. INFO 4/7/17 9:46 AM:liquibase: Successfully acquired change log lock
  701. INFO 4/7/17 9:46 AM:liquibase: liquibase.xml is using schema version 1.9 rather than version 2.0
  702. INFO 4/7/17 9:46 AM:liquibase: Successfully released change log lock
  703. INFO 4/7/17 9:46 AM:liquibase: liquibase.xml is using schema version 1.9 rather than version 2.0
  704. INFO 4/7/17 9:46 AM:liquibase: Reading from LIQUIBASECHANGELOG
  705. INFO 4/7/17 9:46 AM:liquibase: Successfully acquired change log lock
  706. INFO 4/7/17 9:46 AM:liquibase: liquibase.xml is using schema version 1.9 rather than version 2.0
  707. INFO 4/7/17 9:46 AM:liquibase: Successfully released change log lock
  708. INFO 4/7/17 9:46 AM:liquibase: liquibase.xml is using schema version 1.9 rather than version 2.0
  709. INFO 4/7/17 9:46 AM:liquibase: Reading from LIQUIBASECHANGELOG
  710. INFO 4/7/17 9:46 AM:liquibase: Successfully acquired change log lock
  711. INFO 4/7/17 9:46 AM:liquibase: liquibase.xml is using schema version 1.9 rather than version 2.0
  712. INFO 4/7/17 9:46 AM:liquibase: Successfully released change log lock
  713. INFO 4/7/17 9:46 AM:liquibase: liquibase.xml is using schema version 1.9 rather than version 2.0
  714. INFO 4/7/17 9:46 AM:liquibase: Reading from LIQUIBASECHANGELOG
  715. INFO 4/7/17 9:46 AM:liquibase: Successfully acquired change log lock
  716. INFO 4/7/17 9:46 AM:liquibase: liquibase.xml is using schema version 1.9 rather than version 2.0
  717. INFO 4/7/17 9:46 AM:liquibase: Successfully released change log lock
  718. INFO 4/7/17 9:46 AM:liquibase: liquibase.xml is using schema version 1.9 rather than version 2.0
  719. INFO 4/7/17 9:46 AM:liquibase: Reading from LIQUIBASECHANGELOG
  720. INFO 4/7/17 9:46 AM:liquibase: Successfully acquired change log lock
  721. INFO 4/7/17 9:46 AM:liquibase: liquibase.xml is using schema version 1.9 rather than version 2.0
  722. INFO 4/7/17 9:46 AM:liquibase: Successfully released change log lock
  723. INFO 4/7/17 9:46 AM:liquibase: liquibase.xml is using schema version 1.9 rather than version 2.0
  724. INFO 4/7/17 9:46 AM:liquibase: Reading from LIQUIBASECHANGELOG
  725. INFO 4/7/17 9:46 AM:liquibase: Successfully acquired change log lock
  726. INFO 4/7/17 9:46 AM:liquibase: liquibase.xml is using schema version 1.9 rather than version 2.0
  727. INFO 4/7/17 9:46 AM:liquibase: Successfully released change log lock
  728. INFO 4/7/17 9:46 AM:liquibase: liquibase.xml is using schema version 1.9 rather than version 2.0
  729. INFO 4/7/17 9:46 AM:liquibase: Reading from LIQUIBASECHANGELOG
  730. INFO 4/7/17 9:46 AM:liquibase: Successfully acquired change log lock
  731. INFO 4/7/17 9:46 AM:liquibase: liquibase.xml is using schema version 1.9 rather than version 2.0
  732. INFO 4/7/17 9:46 AM:liquibase: Successfully released change log lock
  733. INFO 4/7/17 9:46 AM:liquibase: liquibase.xml is using schema version 1.9 rather than version 2.0
  734. INFO 4/7/17 9:46 AM:liquibase: Reading from LIQUIBASECHANGELOG
  735. INFO 4/7/17 9:46 AM:liquibase: Successfully acquired change log lock
  736. INFO 4/7/17 9:46 AM:liquibase: liquibase.xml is using schema version 1.9 rather than version 2.0
  737. INFO 4/7/17 9:46 AM:liquibase: Successfully released change log lock
  738. INFO 4/7/17 9:46 AM:liquibase: liquibase.xml is using schema version 1.9 rather than version 2.0
  739. INFO 4/7/17 9:46 AM:liquibase: Reading from LIQUIBASECHANGELOG
  740. INFO 4/7/17 9:46 AM:liquibase: Successfully acquired change log lock
  741. INFO 4/7/17 9:46 AM:liquibase: liquibase.xml is using schema version 1.9 rather than version 2.0
  742. INFO 4/7/17 9:46 AM:liquibase: Successfully released change log lock
  743. INFO 4/7/17 9:46 AM:liquibase: liquibase.xml is using schema version 1.9 rather than version 2.0
  744. INFO 4/7/17 9:46 AM:liquibase: Reading from LIQUIBASECHANGELOG
  745. INFO 4/7/17 9:46 AM:liquibase: Successfully acquired change log lock
  746. INFO 4/7/17 9:46 AM:liquibase: liquibase.xml is using schema version 1.9 rather than version 2.0
  747. INFO 4/7/17 9:46 AM:liquibase: Successfully released change log lock
  748. INFO 4/7/17 9:46 AM:liquibase: liquibase.xml is using schema version 1.9 rather than version 2.0
  749. INFO 4/7/17 9:46 AM:liquibase: Reading from LIQUIBASECHANGELOG
  750. INFO 4/7/17 9:46 AM:liquibase: Successfully acquired change log lock
  751. INFO 4/7/17 9:46 AM:liquibase: liquibase.xml is using schema version 1.9 rather than version 2.0
  752. INFO 4/7/17 9:46 AM:liquibase: Successfully released change log lock
  753. INFO 4/7/17 9:46 AM:liquibase: liquibase.xml is using schema version 1.9 rather than version 2.0
  754. INFO 4/7/17 9:46 AM:liquibase: Reading from LIQUIBASECHANGELOG
  755. INFO 4/7/17 9:46 AM:liquibase: Successfully acquired change log lock
  756. INFO 4/7/17 9:46 AM:liquibase: liquibase.xml is using schema version 1.9 rather than version 2.0
  757. INFO 4/7/17 9:46 AM:liquibase: Successfully released change log lock
  758. INFO 4/7/17 9:46 AM:liquibase: liquibase.xml is using schema version 1.9 rather than version 2.0
  759. INFO 4/7/17 9:46 AM:liquibase: Reading from LIQUIBASECHANGELOG
  760. INFO 4/7/17 9:46 AM:liquibase: Successfully acquired change log lock
  761. INFO 4/7/17 9:46 AM:liquibase: liquibase.xml is using schema version 1.9 rather than version 2.0
  762. INFO 4/7/17 9:46 AM:liquibase: Successfully released change log lock
  763. INFO 4/7/17 9:46 AM:liquibase: liquibase.xml is using schema version 1.9 rather than version 2.0
  764. INFO 4/7/17 9:46 AM:liquibase: Reading from LIQUIBASECHANGELOG
  765. INFO 4/7/17 9:46 AM:liquibase: Successfully acquired change log lock
  766. INFO 4/7/17 9:46 AM:liquibase: liquibase.xml is using schema version 1.9 rather than version 2.0
  767. INFO 4/7/17 9:46 AM:liquibase: Successfully released change log lock
  768. INFO 4/7/17 9:46 AM:liquibase: liquibase.xml is using schema version 1.9 rather than version 2.0
  769. INFO 4/7/17 9:46 AM:liquibase: Reading from LIQUIBASECHANGELOG
  770. INFO 4/7/17 9:46 AM:liquibase: Successfully acquired change log lock
  771. INFO 4/7/17 9:46 AM:liquibase: liquibase.xml is using schema version 1.9 rather than version 2.0
  772. INFO 4/7/17 9:46 AM:liquibase: Successfully released change log lock
  773. INFO 4/7/17 9:46 AM:liquibase: liquibase.xml is using schema version 1.9 rather than version 2.0
  774. INFO 4/7/17 9:46 AM:liquibase: Reading from LIQUIBASECHANGELOG
  775. INFO 4/7/17 9:46 AM:liquibase: Successfully acquired change log lock
  776. INFO 4/7/17 9:46 AM:liquibase: liquibase.xml is using schema version 1.9 rather than version 2.0
  777. INFO 4/7/17 9:46 AM:liquibase: Successfully released change log lock
  778. INFO 4/7/17 9:46 AM:liquibase: liquibase.xml is using schema version 1.9 rather than version 2.0
  779. INFO 4/7/17 9:46 AM:liquibase: Reading from LIQUIBASECHANGELOG
  780. INFO 4/7/17 9:46 AM:liquibase: Successfully acquired change log lock
  781. INFO 4/7/17 9:46 AM:liquibase: liquibase.xml is using schema version 1.9 rather than version 2.0
  782. INFO 4/7/17 9:46 AM:liquibase: Successfully released change log lock
  783. INFO 4/7/17 9:46 AM:liquibase: liquibase.xml is using schema version 1.9 rather than version 2.0
  784. INFO 4/7/17 9:46 AM:liquibase: Reading from LIQUIBASECHANGELOG
  785. INFO 4/7/17 9:46 AM:liquibase: Successfully acquired change log lock
  786. INFO 4/7/17 9:46 AM:liquibase: liquibase.xml is using schema version 1.9 rather than version 2.0
  787. INFO 4/7/17 9:46 AM:liquibase: Successfully released change log lock
  788. INFO 4/7/17 9:46 AM:liquibase: liquibase.xml is using schema version 1.9 rather than version 2.0
  789. INFO 4/7/17 9:46 AM:liquibase: Reading from LIQUIBASECHANGELOG
  790. INFO 4/7/17 9:46 AM:liquibase: Successfully acquired change log lock
  791. INFO 4/7/17 9:46 AM:liquibase: liquibase.xml is using schema version 1.9 rather than version 2.0
  792. INFO 4/7/17 9:46 AM:liquibase: Successfully released change log lock
  793. INFO 4/7/17 9:46 AM:liquibase: liquibase.xml is using schema version 1.9 rather than version 2.0
  794. INFO 4/7/17 9:46 AM:liquibase: Reading from LIQUIBASECHANGELOG
  795. INFO 4/7/17 9:46 AM:liquibase: Successfully acquired change log lock
  796. INFO 4/7/17 9:46 AM:liquibase: liquibase.xml is using schema version 1.9 rather than version 2.0
  797. INFO 4/7/17 9:46 AM:liquibase: Successfully released change log lock
  798. INFO 4/7/17 9:46 AM:liquibase: liquibase.xml is using schema version 1.9 rather than version 2.0
  799. INFO 4/7/17 9:46 AM:liquibase: Reading from LIQUIBASECHANGELOG
  800. INFO 4/7/17 9:46 AM:liquibase: Successfully acquired change log lock
  801. INFO 4/7/17 9:46 AM:liquibase: liquibase.xml is using schema version 1.9 rather than version 2.0
  802. INFO 4/7/17 9:46 AM:liquibase: Successfully released change log lock
  803. INFO 4/7/17 9:46 AM:liquibase: liquibase.xml is using schema version 1.9 rather than version 2.0
  804. INFO 4/7/17 9:46 AM:liquibase: Reading from LIQUIBASECHANGELOG
  805. INFO 4/7/17 9:46 AM:liquibase: Successfully acquired change log lock
  806. INFO 4/7/17 9:46 AM:liquibase: liquibase.xml is using schema version 1.9 rather than version 2.0
  807. INFO 4/7/17 9:46 AM:liquibase: Successfully released change log lock
  808. INFO 4/7/17 9:46 AM:liquibase: liquibase.xml is using schema version 1.9 rather than version 2.0
  809. INFO 4/7/17 9:46 AM:liquibase: Reading from LIQUIBASECHANGELOG
  810. INFO 4/7/17 9:46 AM:liquibase: Successfully acquired change log lock
  811. INFO 4/7/17 9:46 AM:liquibase: liquibase.xml is using schema version 1.9 rather than version 2.0
  812. INFO 4/7/17 9:46 AM:liquibase: Successfully released change log lock
  813. Tests run: 11, Failures: 0, Errors: 0, Skipped: 0, Time elapsed: 1.607 sec - in org.openmrs.module.ModuleActivatorTest
  814. Running org.openmrs.module.ModuleClassLoaderTest
  815. Tests run: 8, Failures: 0, Errors: 0, Skipped: 0, Time elapsed: 0.032 sec - in org.openmrs.module.ModuleClassLoaderTest
  816. Running org.openmrs.module.ModuleExtensionsTest
  817. SLF4J: Class path contains multiple SLF4J bindings.
  818. SLF4J: Found binding in [jar:file:/Users/kostya/.m2/repository/org/slf4j/slf4j-log4j12/1.6.0/slf4j-log4j12-1.6.0.jar!/org/slf4j/impl/StaticLoggerBinder.class]
  819. SLF4J: Found binding in [jar:file:/Users/kostya/.m2/repository/org/slf4j/slf4j-log4j12/1.6.0/slf4j-log4j12-1.6.0.jar!/org/slf4j/impl/StaticLoggerBinder.class]
  820. SLF4J: See http://www.slf4j.org/codes.html#multiple_bindings for an explanation.
  821. Tests run: 4, Failures: 0, Errors: 0, Skipped: 0, Time elapsed: 0.672 sec - in org.openmrs.module.ModuleExtensionsTest
  822. Running org.openmrs.module.ModuleFactoryTest
  823. Tests run: 9, Failures: 0, Errors: 0, Skipped: 0, Time elapsed: 0.161 sec - in org.openmrs.module.ModuleFactoryTest
  824. Running org.openmrs.module.ModuleFileParserTest
  825. Tests run: 5, Failures: 0, Errors: 0, Skipped: 0, Time elapsed: 0.004 sec - in org.openmrs.module.ModuleFileParserTest
  826. Running org.openmrs.module.ModuleInteroperabilityTest
  827. Tests run: 1, Failures: 0, Errors: 0, Skipped: 0, Time elapsed: 0.162 sec - in org.openmrs.module.ModuleInteroperabilityTest
  828. Running org.openmrs.module.ModuleTest
  829. Tests run: 9, Failures: 0, Errors: 0, Skipped: 0, Time elapsed: 0.001 sec - in org.openmrs.module.ModuleTest
  830. Running org.openmrs.module.ModuleUtilTest
  831. Tests run: 52, Failures: 0, Errors: 0, Skipped: 0, Time elapsed: 0.335 sec - in org.openmrs.module.ModuleUtilTest
  832. Running org.openmrs.module.UpdateFileParserTest
  833. Tests run: 3, Failures: 0, Errors: 0, Skipped: 0, Time elapsed: 0.004 sec - in org.openmrs.module.UpdateFileParserTest
  834. Running org.openmrs.module.VersionComparatorTest
  835. Tests run: 1, Failures: 0, Errors: 0, Skipped: 0, Time elapsed: 0 sec - in org.openmrs.module.VersionComparatorTest
  836. Running org.openmrs.notification.AlertServiceTest
  837. Tests run: 3, Failures: 0, Errors: 0, Skipped: 0, Time elapsed: 0.207 sec - in org.openmrs.notification.AlertServiceTest
  838. Running org.openmrs.notification.db.hibernate.HibernateAlertDAOTest
  839. Tests run: 1, Failures: 0, Errors: 0, Skipped: 0, Time elapsed: 0.168 sec - in org.openmrs.notification.db.hibernate.HibernateAlertDAOTest
  840. Running org.openmrs.notification.MessageTest
  841. Tests run: 4, Failures: 0, Errors: 0, Skipped: 0, Time elapsed: 0 sec - in org.openmrs.notification.MessageTest
  842. Running org.openmrs.obs.BinaryDataHandlerTest
  843. Tests run: 3, Failures: 0, Errors: 0, Skipped: 0, Time elapsed: 0 sec - in org.openmrs.obs.BinaryDataHandlerTest
  844. Running org.openmrs.obs.BinaryStreamHandlerTest
  845. Tests run: 3, Failures: 0, Errors: 0, Skipped: 0, Time elapsed: 0 sec - in org.openmrs.obs.BinaryStreamHandlerTest
  846. Running org.openmrs.obs.ImageHandlerTest
  847. Tests run: 3, Failures: 0, Errors: 0, Skipped: 0, Time elapsed: 0 sec - in org.openmrs.obs.ImageHandlerTest
  848. Running org.openmrs.obs.MediaHandlerTest
  849. Tests run: 3, Failures: 0, Errors: 0, Skipped: 0, Time elapsed: 0 sec - in org.openmrs.obs.MediaHandlerTest
  850. Running org.openmrs.obs.TextHandlerTest
  851. Tests run: 3, Failures: 0, Errors: 0, Skipped: 0, Time elapsed: 0 sec - in org.openmrs.obs.TextHandlerTest
  852. Running org.openmrs.ObsBehaviorTest
  853. Tests run: 3, Failures: 0, Errors: 0, Skipped: 1, Time elapsed: 0.17 sec - in org.openmrs.ObsBehaviorTest
  854. Running org.openmrs.ObsTest
  855. Tests run: 57, Failures: 0, Errors: 0, Skipped: 0, Time elapsed: 0.009 sec - in org.openmrs.ObsTest
  856. Running org.openmrs.OpenmrsTestAnnotationsTest
  857. Tests run: 2, Failures: 0, Errors: 0, Skipped: 0, Time elapsed: 0.181 sec - in org.openmrs.OpenmrsTestAnnotationsTest
  858. Running org.openmrs.OpenmrsTestsTest
  859. Tests run: 4, Failures: 0, Errors: 0, Skipped: 0, Time elapsed: 0.093 sec - in org.openmrs.OpenmrsTestsTest
  860. Running org.openmrs.order.OrderUtilTest
  861. Tests run: 15, Failures: 0, Errors: 0, Skipped: 0, Time elapsed: 0.001 sec - in org.openmrs.order.OrderUtilTest
  862. Running org.openmrs.OrderEntryIntegrationTest
  863. Tests run: 15, Failures: 0, Errors: 0, Skipped: 0, Time elapsed: 0.373 sec - in org.openmrs.OrderEntryIntegrationTest
  864. Running org.openmrs.OrderTest
  865. Tests run: 56, Failures: 0, Errors: 0, Skipped: 0, Time elapsed: 0.356 sec - in org.openmrs.OrderTest
  866. Running org.openmrs.OrderTypeTest
  867. Tests run: 3, Failures: 0, Errors: 0, Skipped: 0, Time elapsed: 0 sec - in org.openmrs.OrderTypeTest
  868. Running org.openmrs.patient.impl.LuhnIdentifierValidatorTest
  869. Tests run: 3, Failures: 0, Errors: 0, Skipped: 0, Time elapsed: 0 sec - in org.openmrs.patient.impl.LuhnIdentifierValidatorTest
  870. Running org.openmrs.patient.impl.VerhoeffIdentifierValidatorTest
  871. Tests run: 2, Failures: 0, Errors: 0, Skipped: 0, Time elapsed: 0 sec - in org.openmrs.patient.impl.VerhoeffIdentifierValidatorTest
  872. Running org.openmrs.PatientProgramTest
  873. Tests run: 2, Failures: 0, Errors: 0, Skipped: 0, Time elapsed: 0 sec - in org.openmrs.PatientProgramTest
  874. Running org.openmrs.PatientStateTest
  875. Tests run: 13, Failures: 0, Errors: 0, Skipped: 0, Time elapsed: 0.001 sec - in org.openmrs.PatientStateTest
  876. Running org.openmrs.PatientTest
  877. Tests run: 8, Failures: 0, Errors: 0, Skipped: 0, Time elapsed: 0.001 sec - in org.openmrs.PatientTest
  878. Running org.openmrs.PersonAddressTest
  879. Tests run: 15, Failures: 0, Errors: 0, Skipped: 0, Time elapsed: 0 sec - in org.openmrs.PersonAddressTest
  880. Running org.openmrs.PersonAttributeTest
  881. Tests run: 6, Failures: 0, Errors: 0, Skipped: 0, Time elapsed: 0.184 sec - in org.openmrs.PersonAttributeTest
  882. Running org.openmrs.PersonNameTest
  883. Tests run: 19, Failures: 0, Errors: 0, Skipped: 0, Time elapsed: 0.002 sec - in org.openmrs.PersonNameTest
  884. Running org.openmrs.PersonTest
  885. Tests run: 37, Failures: 0, Errors: 0, Skipped: 0, Time elapsed: 0.259 sec - in org.openmrs.PersonTest
  886. Running org.openmrs.propertyeditor.CohortEditorTest
  887. Tests run: 2, Failures: 0, Errors: 0, Skipped: 0, Time elapsed: 0.203 sec - in org.openmrs.propertyeditor.CohortEditorTest
  888. Running org.openmrs.propertyeditor.ConceptAnswerEditorTest
  889. Tests run: 2, Failures: 0, Errors: 0, Skipped: 0, Time elapsed: 0.159 sec - in org.openmrs.propertyeditor.ConceptAnswerEditorTest
  890. Running org.openmrs.propertyeditor.ConceptAnswersEditorTest
  891. Tests run: 1, Failures: 0, Errors: 0, Skipped: 0, Time elapsed: 0.162 sec - in org.openmrs.propertyeditor.ConceptAnswersEditorTest
  892. Running org.openmrs.propertyeditor.ConceptClassEditorTest
  893. Tests run: 2, Failures: 0, Errors: 0, Skipped: 0, Time elapsed: 0.177 sec - in org.openmrs.propertyeditor.ConceptClassEditorTest
  894. Running org.openmrs.propertyeditor.ConceptDatatypeEditorTest
  895. Tests run: 2, Failures: 0, Errors: 0, Skipped: 0, Time elapsed: 0.183 sec - in org.openmrs.propertyeditor.ConceptDatatypeEditorTest
  896. Running org.openmrs.propertyeditor.ConceptEditorTest
  897. Tests run: 2, Failures: 0, Errors: 0, Skipped: 0, Time elapsed: 0.172 sec - in org.openmrs.propertyeditor.ConceptEditorTest
  898. Running org.openmrs.propertyeditor.ConceptNameEditorTest
  899. Tests run: 2, Failures: 0, Errors: 0, Skipped: 0, Time elapsed: 0.19 sec - in org.openmrs.propertyeditor.ConceptNameEditorTest
  900. Running org.openmrs.propertyeditor.ConceptNumericEditorTest
  901. Tests run: 2, Failures: 0, Errors: 0, Skipped: 0, Time elapsed: 0.183 sec - in org.openmrs.propertyeditor.ConceptNumericEditorTest
  902. Running org.openmrs.propertyeditor.ConceptSourceEditorTest
  903. Tests run: 2, Failures: 0, Errors: 0, Skipped: 0, Time elapsed: 0.194 sec - in org.openmrs.propertyeditor.ConceptSourceEditorTest
  904. Running org.openmrs.propertyeditor.DateOrDatetimeEditorTest
  905. Tests run: 6, Failures: 0, Errors: 0, Skipped: 0, Time elapsed: 0.001 sec - in org.openmrs.propertyeditor.DateOrDatetimeEditorTest
  906. Running org.openmrs.propertyeditor.DrugEditorTest
  907. Tests run: 2, Failures: 0, Errors: 0, Skipped: 0, Time elapsed: 0.209 sec - in org.openmrs.propertyeditor.DrugEditorTest
  908. Running org.openmrs.propertyeditor.EncounterEditorTest
  909. Tests run: 2, Failures: 0, Errors: 0, Skipped: 0, Time elapsed: 0.211 sec - in org.openmrs.propertyeditor.EncounterEditorTest
  910. Running org.openmrs.propertyeditor.EncounterTypeEditorTest
  911. Tests run: 2, Failures: 0, Errors: 0, Skipped: 0, Time elapsed: 0.23 sec - in org.openmrs.propertyeditor.EncounterTypeEditorTest
  912. Running org.openmrs.propertyeditor.FormEditorTest
  913. Tests run: 2, Failures: 0, Errors: 0, Skipped: 0, Time elapsed: 0.222 sec - in org.openmrs.propertyeditor.FormEditorTest
  914. Running org.openmrs.propertyeditor.LocationEditorTest
  915. Tests run: 4, Failures: 0, Errors: 0, Skipped: 0, Time elapsed: 0.203 sec - in org.openmrs.propertyeditor.LocationEditorTest
  916. Running org.openmrs.propertyeditor.LocationTagEditorTest
  917. Tests run: 2, Failures: 0, Errors: 0, Skipped: 0, Time elapsed: 0.268 sec - in org.openmrs.propertyeditor.LocationTagEditorTest
  918. Running org.openmrs.propertyeditor.OrderEditorTest
  919. Tests run: 2, Failures: 0, Errors: 0, Skipped: 0, Time elapsed: 0.245 sec - in org.openmrs.propertyeditor.OrderEditorTest
  920. Running org.openmrs.propertyeditor.PatientEditorTest
  921. Tests run: 2, Failures: 0, Errors: 0, Skipped: 0, Time elapsed: 0.233 sec - in org.openmrs.propertyeditor.PatientEditorTest
  922. Running org.openmrs.propertyeditor.PatientIdentifierTypeEditorTest
  923. Tests run: 2, Failures: 0, Errors: 0, Skipped: 0, Time elapsed: 0.236 sec - in org.openmrs.propertyeditor.PatientIdentifierTypeEditorTest
  924. Running org.openmrs.propertyeditor.PersonAttributeEditorTest
  925. Tests run: 2, Failures: 0, Errors: 0, Skipped: 0, Time elapsed: 0.203 sec - in org.openmrs.propertyeditor.PersonAttributeEditorTest
  926. Running org.openmrs.propertyeditor.PersonAttributeTypeEditorTest
  927. Tests run: 2, Failures: 0, Errors: 0, Skipped: 0, Time elapsed: 0.209 sec - in org.openmrs.propertyeditor.PersonAttributeTypeEditorTest
  928. Running org.openmrs.propertyeditor.PersonEditorTest
  929. Tests run: 2, Failures: 0, Errors: 0, Skipped: 0, Time elapsed: 0.205 sec - in org.openmrs.propertyeditor.PersonEditorTest
  930. Running org.openmrs.propertyeditor.PrivilegeEditorTest
  931. Tests run: 2, Failures: 0, Errors: 0, Skipped: 0, Time elapsed: 0.259 sec - in org.openmrs.propertyeditor.PrivilegeEditorTest
  932. Running org.openmrs.propertyeditor.ProgramEditorTest
  933. Tests run: 4, Failures: 0, Errors: 0, Skipped: 0, Time elapsed: 0.227 sec - in org.openmrs.propertyeditor.ProgramEditorTest
  934. Running org.openmrs.propertyeditor.ProgramWorkflowEditorTest
  935. Tests run: 1, Failures: 0, Errors: 0, Skipped: 0, Time elapsed: 0.215 sec - in org.openmrs.propertyeditor.ProgramWorkflowEditorTest
  936. Running org.openmrs.propertyeditor.ProgramWorkflowStateEditorTest
  937. Tests run: 1, Failures: 0, Errors: 0, Skipped: 0, Time elapsed: 0.197 sec - in org.openmrs.propertyeditor.ProgramWorkflowStateEditorTest
  938. Running org.openmrs.propertyeditor.ProviderEditorTest
  939. Tests run: 2, Failures: 0, Errors: 0, Skipped: 0, Time elapsed: 0.196 sec - in org.openmrs.propertyeditor.ProviderEditorTest
  940. Running org.openmrs.propertyeditor.RoleEditorTest
  941. Tests run: 2, Failures: 0, Errors: 0, Skipped: 0, Time elapsed: 0.195 sec - in org.openmrs.propertyeditor.RoleEditorTest
  942. Running org.openmrs.propertyeditor.UserEditorTest
  943. Tests run: 2, Failures: 0, Errors: 0, Skipped: 0, Time elapsed: 0.2 sec - in org.openmrs.propertyeditor.UserEditorTest
  944. Running org.openmrs.propertyeditor.VisitEditorTest
  945. Tests run: 2, Failures: 0, Errors: 0, Skipped: 0, Time elapsed: 0.203 sec - in org.openmrs.propertyeditor.VisitEditorTest
  946. Running org.openmrs.propertyeditor.VisitTypeEditorTest
  947. Tests run: 2, Failures: 0, Errors: 0, Skipped: 0, Time elapsed: 0.19 sec - in org.openmrs.propertyeditor.VisitTypeEditorTest
  948. Running org.openmrs.propertyeditor.WorkflowCollectionEditorTest
  949. Tests run: 1, Failures: 0, Errors: 0, Skipped: 0, Time elapsed: 0.222 sec - in org.openmrs.propertyeditor.WorkflowCollectionEditorTest
  950. Running org.openmrs.ProviderTest
  951. Tests run: 2, Failures: 0, Errors: 0, Skipped: 0, Time elapsed: 0 sec - in org.openmrs.ProviderTest
  952. Running org.openmrs.RoleTest
  953. Tests run: 7, Failures: 0, Errors: 0, Skipped: 0, Time elapsed: 0 sec - in org.openmrs.RoleTest
  954. Running org.openmrs.scheduler.SchedulerServiceTest
  955. Tests run: 1, Failures: 0, Errors: 0, Skipped: 1, Time elapsed: 0 sec - in org.openmrs.scheduler.SchedulerServiceTest
  956. Running org.openmrs.scheduler.SchedulerUtilTest
  957. Tests run: 1, Failures: 0, Errors: 0, Skipped: 0, Time elapsed: 0 sec - in org.openmrs.scheduler.SchedulerUtilTest
  958. Running org.openmrs.scheduler.timer.TimerSchedulerServiceImplTest
  959. Tests run: 1, Failures: 0, Errors: 0, Skipped: 0, Time elapsed: 0.213 sec - in org.openmrs.scheduler.timer.TimerSchedulerServiceImplTest
  960. Running org.openmrs.serialization.JavaSerializationTest
  961. Tests run: 2, Failures: 0, Errors: 0, Skipped: 0, Time elapsed: 0.021 sec - in org.openmrs.serialization.JavaSerializationTest
  962. Running org.openmrs.serialization.SimpleXStreamSerializerTest
  963. Tests run: 5, Failures: 0, Errors: 0, Skipped: 0, Time elapsed: 0.015 sec - in org.openmrs.serialization.SimpleXStreamSerializerTest
  964. Running org.openmrs.SimpleDosingInstructionsTest
  965. Tests run: 10, Failures: 0, Errors: 0, Skipped: 0, Time elapsed: 0.222 sec - in org.openmrs.SimpleDosingInstructionsTest
  966. Running org.openmrs.test.matchers.HasFieldErrorsTest
  967. Tests run: 13, Failures: 0, Errors: 0, Skipped: 0, Time elapsed: 0.006 sec - in org.openmrs.test.matchers.HasFieldErrorsTest
  968. Running org.openmrs.test.matchers.HasGlobalErrorsTest
  969. Tests run: 7, Failures: 0, Errors: 0, Skipped: 0, Time elapsed: 0.001 sec - in org.openmrs.test.matchers.HasGlobalErrorsTest
  970. Running org.openmrs.TestOrderTest
  971. Tests run: 4, Failures: 0, Errors: 0, Skipped: 0, Time elapsed: 0.001 sec - in org.openmrs.TestOrderTest
  972. Running org.openmrs.UserTest
  973. Tests run: 9, Failures: 0, Errors: 0, Skipped: 0, Time elapsed: 0.001 sec - in org.openmrs.UserTest
  974. Running org.openmrs.util.DatabaseUpdaterTest
  975. INFO 4/7/17 9:46 AM:liquibase: Reading from LIQUIBASECHANGELOG
  976. Tests run: 1, Failures: 0, Errors: 0, Skipped: 0, Time elapsed: 0.686 sec - in org.openmrs.util.DatabaseUpdaterTest
  977. Running org.openmrs.util.DateUtilTest
  978. Tests run: 1, Failures: 0, Errors: 0, Skipped: 0, Time elapsed: 0 sec - in org.openmrs.util.DateUtilTest
  979. Running org.openmrs.util.DoubleRangeTest
  980. Tests run: 28, Failures: 0, Errors: 0, Skipped: 0, Time elapsed: 0.005 sec - in org.openmrs.util.DoubleRangeTest
  981. Running org.openmrs.util.DrugsByNameComparatorTest
  982. Tests run: 4, Failures: 0, Errors: 0, Skipped: 0, Time elapsed: 0.001 sec - in org.openmrs.util.DrugsByNameComparatorTest
  983. Running org.openmrs.util.ExceptionUtilTest
  984. Tests run: 1, Failures: 0, Errors: 0, Skipped: 0, Time elapsed: 0.002 sec - in org.openmrs.util.ExceptionUtilTest
  985. Running org.openmrs.util.FormatTest
  986. Tests run: 8, Failures: 0, Errors: 0, Skipped: 0, Time elapsed: 0.002 sec - in org.openmrs.util.FormatTest
  987. Running org.openmrs.util.GraphTest
  988. Tests run: 2, Failures: 0, Errors: 0, Skipped: 0, Time elapsed: 0 sec - in org.openmrs.util.GraphTest
  989. Running org.openmrs.util.HandlerUtilTest
  990. Tests run: 6, Failures: 0, Errors: 0, Skipped: 0, Time elapsed: 0.25 sec - in org.openmrs.util.HandlerUtilTest
  991. Running org.openmrs.util.HttpClientTest
  992. Tests run: 1, Failures: 0, Errors: 0, Skipped: 0, Time elapsed: 0.017 sec - in org.openmrs.util.HttpClientTest
  993. Running org.openmrs.util.HttpUrlTest
  994. Tests run: 4, Failures: 0, Errors: 0, Skipped: 0, Time elapsed: 0.001 sec - in org.openmrs.util.HttpUrlTest
  995. Running org.openmrs.util.JavaVersionTest
  996. SLF4J: Class path contains multiple SLF4J bindings.
  997. SLF4J: Found binding in [jar:file:/Users/kostya/.m2/repository/org/slf4j/slf4j-log4j12/1.6.0/slf4j-log4j12-1.6.0.jar!/org/slf4j/impl/StaticLoggerBinder.class]
  998. SLF4J: Found binding in [jar:file:/Users/kostya/.m2/repository/org/slf4j/slf4j-log4j12/1.6.0/slf4j-log4j12-1.6.0.jar!/org/slf4j/impl/StaticLoggerBinder.class]
  999. SLF4J: See http://www.slf4j.org/codes.html#multiple_bindings for an explanation.
  1000. Tests run: 2, Failures: 0, Errors: 0, Skipped: 0, Time elapsed: 0.542 sec - in org.openmrs.util.JavaVersionTest
  1001. Running org.openmrs.util.LocaleUtilityTest
  1002. Tests run: 21, Failures: 0, Errors: 0, Skipped: 0, Time elapsed: 0.321 sec - in org.openmrs.util.LocaleUtilityTest
  1003. Running org.openmrs.util.LocationUtilityTest
  1004. Tests run: 2, Failures: 0, Errors: 0, Skipped: 0, Time elapsed: 0.253 sec - in org.openmrs.util.LocationUtilityTest
  1005. Running org.openmrs.util.OpenmrsSecurityManagerTest
  1006. Tests run: 2, Failures: 0, Errors: 0, Skipped: 0, Time elapsed: 0 sec - in org.openmrs.util.OpenmrsSecurityManagerTest
  1007. Running org.openmrs.util.OpenmrsUtilTest
  1008. Tests run: 47, Failures: 0, Errors: 0, Skipped: 0, Time elapsed: 1.528 sec - in org.openmrs.util.OpenmrsUtilTest
  1009. Running org.openmrs.util.PersonByNameComparatorTest
  1010. Tests run: 4, Failures: 0, Errors: 0, Skipped: 0, Time elapsed: 0.001 sec - in org.openmrs.util.PersonByNameComparatorTest
  1011. Running org.openmrs.util.ProviderByPersonNameComparatorTest
  1012. Tests run: 6, Failures: 0, Errors: 0, Skipped: 0, Time elapsed: 0.001 sec - in org.openmrs.util.ProviderByPersonNameComparatorTest
  1013. Running org.openmrs.util.ReflectTest
  1014. Tests run: 18, Failures: 0, Errors: 0, Skipped: 0, Time elapsed: 0.002 sec - in org.openmrs.util.ReflectTest
  1015. Running org.openmrs.util.SecurityTest
  1016. Tests run: 7, Failures: 0, Errors: 0, Skipped: 0, Time elapsed: 0.14 sec - in org.openmrs.util.SecurityTest
  1017. Running org.openmrs.util.UpgradeUtilTest
  1018. Tests run: 2, Failures: 0, Errors: 0, Skipped: 0, Time elapsed: 0.225 sec - in org.openmrs.util.UpgradeUtilTest
  1019. Running org.openmrs.util.UserByNameComparatorTest
  1020. Tests run: 1, Failures: 0, Errors: 0, Skipped: 0, Time elapsed: 0 sec - in org.openmrs.util.UserByNameComparatorTest
  1021. Running org.openmrs.validator.AlertValidatorTest
  1022. Tests run: 5, Failures: 0, Errors: 0, Skipped: 0, Time elapsed: 0.231 sec - in org.openmrs.validator.AlertValidatorTest
  1023. Running org.openmrs.validator.AllergyValidatorTest
  1024. SLF4J: Class path contains multiple SLF4J bindings.
  1025. SLF4J: Found binding in [jar:file:/Users/kostya/.m2/repository/org/slf4j/slf4j-log4j12/1.6.0/slf4j-log4j12-1.6.0.jar!/org/slf4j/impl/StaticLoggerBinder.class]
  1026. SLF4J: Found binding in [jar:file:/Users/kostya/.m2/repository/org/slf4j/slf4j-log4j12/1.6.0/slf4j-log4j12-1.6.0.jar!/org/slf4j/impl/StaticLoggerBinder.class]
  1027. SLF4J: See http://www.slf4j.org/codes.html#multiple_bindings for an explanation.
  1028. Tests run: 9, Failures: 0, Errors: 0, Skipped: 0, Time elapsed: 0.906 sec - in org.openmrs.validator.AllergyValidatorTest
  1029. Running org.openmrs.validator.BaseAttributeTypeValidatorTest
  1030. Tests run: 16, Failures: 0, Errors: 0, Skipped: 0, Time elapsed: 2.81 sec - in org.openmrs.validator.BaseAttributeTypeValidatorTest
  1031. Running org.openmrs.validator.CohortValidatorTest
  1032. Tests run: 6, Failures: 0, Errors: 0, Skipped: 0, Time elapsed: 0.211 sec - in org.openmrs.validator.CohortValidatorTest
  1033. Running org.openmrs.validator.ConceptAttributeTypeValidatorTest
  1034. Tests run: 8, Failures: 0, Errors: 0, Skipped: 0, Time elapsed: 0.253 sec - in org.openmrs.validator.ConceptAttributeTypeValidatorTest
  1035. Running org.openmrs.validator.ConceptClassValidatorTest
  1036. Tests run: 6, Failures: 0, Errors: 0, Skipped: 0, Time elapsed: 0.232 sec - in org.openmrs.validator.ConceptClassValidatorTest
  1037. Running org.openmrs.validator.ConceptDatatypeValidatorTest
  1038. Tests run: 5, Failures: 0, Errors: 0, Skipped: 0, Time elapsed: 0.222 sec - in org.openmrs.validator.ConceptDatatypeValidatorTest
  1039. Running org.openmrs.validator.ConceptDrugValidatorTest
  1040. Tests run: 3, Failures: 0, Errors: 0, Skipped: 0, Time elapsed: 0 sec - in org.openmrs.validator.ConceptDrugValidatorTest
  1041. Running org.openmrs.validator.ConceptMapTypeValidatorTest
  1042. Tests run: 8, Failures: 0, Errors: 0, Skipped: 0, Time elapsed: 0.209 sec - in org.openmrs.validator.ConceptMapTypeValidatorTest
  1043. Running org.openmrs.validator.ConceptNameTagValidatorTest
  1044. Tests run: 7, Failures: 0, Errors: 0, Skipped: 0, Time elapsed: 0.216 sec - in org.openmrs.validator.ConceptNameTagValidatorTest
  1045. Running org.openmrs.validator.ConceptReferenceTermValidatorTest
  1046. [Field error in object 'term' on field 'conceptReferenceTermMaps[1].termB': rejected value [weight term(WGT234)]; codes [ConceptReferenceTerm.termToTerm.alreadyMapped.term.conceptReferenceTermMaps[1].termB,ConceptReferenceTerm.termToTerm.alreadyMapped.term.conceptReferenceTermMaps.termB,ConceptReferenceTerm.termToTerm.alreadyMapped.conceptReferenceTermMaps[1].termB,ConceptReferenceTerm.termToTerm.alreadyMapped.conceptReferenceTermMaps.termB,ConceptReferenceTerm.termToTerm.alreadyMapped.termB,ConceptReferenceTerm.termToTerm.alreadyMapped.org.openmrs.ConceptReferenceTerm,ConceptReferenceTerm.termToTerm.alreadyMapped]; arguments []; default message [Cannot map a reference term multiple times to the same concept reference term]]
  1047. Tests run: 18, Failures: 0, Errors: 0, Skipped: 3, Time elapsed: 0.275 sec - in org.openmrs.validator.ConceptReferenceTermValidatorTest
  1048. Running org.openmrs.validator.ConceptSourceValidatorTest
  1049. Tests run: 6, Failures: 0, Errors: 0, Skipped: 0, Time elapsed: 0.231 sec - in org.openmrs.validator.ConceptSourceValidatorTest
  1050. Running org.openmrs.validator.ConceptValidatorTest
  1051. Tests run: 31, Failures: 0, Errors: 0, Skipped: 0, Time elapsed: 0.419 sec - in org.openmrs.validator.ConceptValidatorTest
  1052. Running org.openmrs.validator.DrugOrderValidatorTest
  1053. Tests run: 36, Failures: 0, Errors: 0, Skipped: 0, Time elapsed: 0.809 sec - in org.openmrs.validator.DrugOrderValidatorTest
  1054. Running org.openmrs.validator.DrugValidatorTest
  1055. Tests run: 9, Failures: 0, Errors: 0, Skipped: 0, Time elapsed: 0.408 sec - in org.openmrs.validator.DrugValidatorTest
  1056. Running org.openmrs.validator.EncounterRoleValidatorTest
  1057. Tests run: 5, Failures: 0, Errors: 0, Skipped: 0, Time elapsed: 0.299 sec - in org.openmrs.validator.EncounterRoleValidatorTest
  1058. Running org.openmrs.validator.EncounterTypeValidatorTest
  1059. Tests run: 7, Failures: 0, Errors: 0, Skipped: 0, Time elapsed: 0.225 sec - in org.openmrs.validator.EncounterTypeValidatorTest
  1060. Running org.openmrs.validator.EncounterValidatorTest
  1061. Tests run: 12, Failures: 0, Errors: 0, Skipped: 0, Time elapsed: 0.255 sec - in org.openmrs.validator.EncounterValidatorTest
  1062. Running org.openmrs.validator.FieldTypeValidatorTest
  1063. Tests run: 5, Failures: 0, Errors: 0, Skipped: 0, Time elapsed: 0.251 sec - in org.openmrs.validator.FieldTypeValidatorTest
  1064. Running org.openmrs.validator.FieldValidatorTest
  1065. Tests run: 8, Failures: 0, Errors: 0, Skipped: 0, Time elapsed: 0.262 sec - in org.openmrs.validator.FieldValidatorTest
  1066. Running org.openmrs.validator.FormValidatorTest
  1067. Tests run: 8, Failures: 0, Errors: 0, Skipped: 0, Time elapsed: 0.261 sec - in org.openmrs.validator.FormValidatorTest
  1068. Running org.openmrs.validator.HL7SourceValidatorTest
  1069. Tests run: 2, Failures: 0, Errors: 0, Skipped: 0, Time elapsed: 0.24 sec - in org.openmrs.validator.HL7SourceValidatorTest
  1070. Running org.openmrs.validator.ImplementationIdValidatorTest
  1071. Tests run: 8, Failures: 0, Errors: 0, Skipped: 0, Time elapsed: 0.253 sec - in org.openmrs.validator.ImplementationIdValidatorTest
  1072. Running org.openmrs.validator.LocationAttributeTypeValidatorTest
  1073. Tests run: 6, Failures: 0, Errors: 0, Skipped: 0, Time elapsed: 0.254 sec - in org.openmrs.validator.LocationAttributeTypeValidatorTest
  1074. Running org.openmrs.validator.LocationTagValidatorTest
  1075. Tests run: 2, Failures: 0, Errors: 0, Skipped: 0, Time elapsed: 0.246 sec - in org.openmrs.validator.LocationTagValidatorTest
  1076. Running org.openmrs.validator.LocationValidatorTest
  1077. Tests run: 9, Failures: 0, Errors: 0, Skipped: 0, Time elapsed: 0.272 sec - in org.openmrs.validator.LocationValidatorTest
  1078. Running org.openmrs.validator.ObsValidatorTest
  1079. Tests run: 22, Failures: 0, Errors: 0, Skipped: 0, Time elapsed: 0.329 sec - in org.openmrs.validator.ObsValidatorTest
  1080. Running org.openmrs.validator.OrderFrequencyValidatorTest
  1081. Tests run: 9, Failures: 0, Errors: 0, Skipped: 0, Time elapsed: 0.247 sec - in org.openmrs.validator.OrderFrequencyValidatorTest
  1082. Running org.openmrs.validator.OrderTypeValidatorTest
  1083. Tests run: 14, Failures: 0, Errors: 0, Skipped: 0, Time elapsed: 0.263 sec - in org.openmrs.validator.OrderTypeValidatorTest
  1084. Running org.openmrs.validator.OrderValidatorTest
  1085. Tests run: 22, Failures: 0, Errors: 0, Skipped: 0, Time elapsed: 0.44 sec - in org.openmrs.validator.OrderValidatorTest
  1086. Running org.openmrs.validator.PatientIdentifierTypeValidatorTest
  1087. Tests run: 9, Failures: 0, Errors: 0, Skipped: 0, Time elapsed: 0.263 sec - in org.openmrs.validator.PatientIdentifierTypeValidatorTest
  1088. Running org.openmrs.validator.PatientIdentifierValidatorTest
  1089. Tests run: 20, Failures: 0, Errors: 0, Skipped: 0, Time elapsed: 0.371 sec - in org.openmrs.validator.PatientIdentifierValidatorTest
  1090. Running org.openmrs.validator.PatientProgramValidatorTest
  1091. Tests run: 22, Failures: 0, Errors: 0, Skipped: 0, Time elapsed: 0.444 sec - in org.openmrs.validator.PatientProgramValidatorTest
  1092. Running org.openmrs.validator.PatientValidatorTest
  1093. Tests run: 14, Failures: 0, Errors: 0, Skipped: 0, Time elapsed: 0.274 sec - in org.openmrs.validator.PatientValidatorTest
  1094. Running org.openmrs.validator.PersonAddressValidatorTest
  1095. Tests run: 10, Failures: 0, Errors: 0, Skipped: 0, Time elapsed: 0.255 sec - in org.openmrs.validator.PersonAddressValidatorTest
  1096. Running org.openmrs.validator.PersonAttributeTypeValidatorTest
  1097. Tests run: 7, Failures: 0, Errors: 0, Skipped: 0, Time elapsed: 0.215 sec - in org.openmrs.validator.PersonAttributeTypeValidatorTest
  1098. Running org.openmrs.validator.PersonMergeLogValidatorTest
  1099. Tests run: 6, Failures: 0, Errors: 0, Skipped: 0, Time elapsed: 0.214 sec - in org.openmrs.validator.PersonMergeLogValidatorTest
  1100. Running org.openmrs.validator.PersonNameValidatorTest
  1101. Tests run: 59, Failures: 0, Errors: 0, Skipped: 8, Time elapsed: 0.417 sec - in org.openmrs.validator.PersonNameValidatorTest
  1102. Running org.openmrs.validator.PersonValidatorTest
  1103. Tests run: 10, Failures: 0, Errors: 0, Skipped: 0, Time elapsed: 0.259 sec - in org.openmrs.validator.PersonValidatorTest
  1104. Running org.openmrs.validator.PrivilegeValidatorTest
  1105. Tests run: 5, Failures: 0, Errors: 0, Skipped: 0, Time elapsed: 0.213 sec - in org.openmrs.validator.PrivilegeValidatorTest
  1106. Running org.openmrs.validator.ProgramValidatorTest
  1107. Tests run: 8, Failures: 0, Errors: 0, Skipped: 0, Time elapsed: 0.244 sec - in org.openmrs.validator.ProgramValidatorTest
  1108. Running org.openmrs.validator.ProviderAttributeTypeValidatorTest
  1109. Tests run: 2, Failures: 0, Errors: 0, Skipped: 0, Time elapsed: 0.212 sec - in org.openmrs.validator.ProviderAttributeTypeValidatorTest
  1110. Running org.openmrs.validator.ProviderValidatorTest
  1111. Tests run: 13, Failures: 0, Errors: 0, Skipped: 0, Time elapsed: 0.266 sec - in org.openmrs.validator.ProviderValidatorTest
  1112. Running org.openmrs.validator.RelationshipTypeValidatorTest
  1113. Tests run: 7, Failures: 0, Errors: 0, Skipped: 0, Time elapsed: 0.231 sec - in org.openmrs.validator.RelationshipTypeValidatorTest
  1114. Running org.openmrs.validator.RelationshipValidatorTest
  1115. Tests run: 7, Failures: 0, Errors: 0, Skipped: 0, Time elapsed: 0.224 sec - in org.openmrs.validator.RelationshipValidatorTest
  1116. Running org.openmrs.validator.RequireNameValidatorTest
  1117. Tests run: 2, Failures: 0, Errors: 0, Skipped: 0, Time elapsed: 0 sec - in org.openmrs.validator.RequireNameValidatorTest
  1118. Running org.openmrs.validator.RoleValidatorTest
  1119. Tests run: 6, Failures: 0, Errors: 0, Skipped: 0, Time elapsed: 0.23 sec - in org.openmrs.validator.RoleValidatorTest
  1120. Running org.openmrs.validator.SchedulerFormValidatorTest
  1121. Tests run: 10, Failures: 0, Errors: 0, Skipped: 0, Time elapsed: 0.238 sec - in org.openmrs.validator.SchedulerFormValidatorTest
  1122. Running org.openmrs.validator.StateConversionValidatorTest
  1123. Tests run: 4, Failures: 0, Errors: 0, Skipped: 0, Time elapsed: 0.229 sec - in org.openmrs.validator.StateConversionValidatorTest
  1124. Running org.openmrs.validator.TestOrderValidatorTest
  1125. Tests run: 2, Failures: 0, Errors: 0, Skipped: 0, Time elapsed: 0.214 sec - in org.openmrs.validator.TestOrderValidatorTest
  1126. Running org.openmrs.validator.UserValidatorTest
  1127. Tests run: 21, Failures: 0, Errors: 0, Skipped: 0, Time elapsed: 0.267 sec - in org.openmrs.validator.UserValidatorTest
  1128. Running org.openmrs.validator.ValidateUtilTest
  1129. Tests run: 8, Failures: 0, Errors: 0, Skipped: 0, Time elapsed: 0.228 sec - in org.openmrs.validator.ValidateUtilTest
  1130. Running org.openmrs.validator.VisitAttributeTypeValidatorTest
  1131. Tests run: 2, Failures: 0, Errors: 0, Skipped: 0, Time elapsed: 0.203 sec - in org.openmrs.validator.VisitAttributeTypeValidatorTest
  1132. Running org.openmrs.validator.VisitTypeValidatorTest
  1133. Tests run: 2, Failures: 0, Errors: 0, Skipped: 0, Time elapsed: 0.2 sec - in org.openmrs.validator.VisitTypeValidatorTest
  1134. Running org.openmrs.validator.VisitValidatorTest
  1135. Tests run: 20, Failures: 0, Errors: 0, Skipped: 1, Time elapsed: 0.472 sec - in org.openmrs.validator.VisitValidatorTest
  1136.  
  1137. Results :
  1138.  
  1139. Tests run: 3482, Failures: 0, Errors: 0, Skipped: 37
  1140.  
  1141. [INFO]
  1142. [INFO] --- maven-jar-plugin:2.3.2:jar (default-jar) @ openmrs-api ---
  1143. [INFO] Building jar: /www/openmrs/openmrs-core/api/target/openmrs-api-2.2.0-SNAPSHOT.jar
  1144. [INFO]
  1145. [INFO] --- maven-jar-plugin:2.3.2:test-jar (default) @ openmrs-api ---
  1146. [INFO] Building jar: /www/openmrs/openmrs-core/api/target/openmrs-api-2.2.0-SNAPSHOT-tests.jar
  1147. [INFO]
  1148. [INFO] --- license-maven-plugin:2.6:check (default) @ openmrs-api ---
  1149. [INFO] Checking licenses...
  1150. [INFO]
  1151. [INFO] --- maven-install-plugin:2.4:install (default-install) @ openmrs-api ---
  1152. [INFO] Installing /www/openmrs/openmrs-core/api/target/openmrs-api-2.2.0-SNAPSHOT.jar to /Users/kostya/.m2/repository/org/openmrs/api/openmrs-api/2.2.0-SNAPSHOT/openmrs-api-2.2.0-SNAPSHOT.jar
  1153. [INFO] Installing /www/openmrs/openmrs-core/api/pom.xml to /Users/kostya/.m2/repository/org/openmrs/api/openmrs-api/2.2.0-SNAPSHOT/openmrs-api-2.2.0-SNAPSHOT.pom
  1154. [INFO] Installing /www/openmrs/openmrs-core/api/target/openmrs-api-2.2.0-SNAPSHOT-tests.jar to /Users/kostya/.m2/repository/org/openmrs/api/openmrs-api/2.2.0-SNAPSHOT/openmrs-api-2.2.0-SNAPSHOT-tests.jar
  1155. [INFO]
  1156. [INFO] ------------------------------------------------------------------------
  1157. [INFO] Building openmrs-web 2.2.0-SNAPSHOT
  1158. [INFO] ------------------------------------------------------------------------
  1159. [INFO]
  1160. [INFO] --- maven-clean-plugin:2.5:clean (default-clean) @ openmrs-web ---
  1161. [INFO]
  1162. [INFO] --- buildnumber-maven-plugin:1.1:create (default) @ openmrs-web ---
  1163. [INFO]
  1164. [INFO] --- build-helper-maven-plugin:1.5:parse-version (parse-version) @ openmrs-web ---
  1165. [INFO]
  1166. [INFO] --- jacoco-maven-plugin:0.7.4.201502262128:prepare-agent (prepare-agent) @ openmrs-web ---
  1167. [INFO] argLine set to -javaagent:/Users/kostya/.m2/repository/org/jacoco/org.jacoco.agent/0.7.4.201502262128/org.jacoco.agent-0.7.4.201502262128-runtime.jar=destfile=/www/openmrs/openmrs-core/web/target/jacoco.exec,includes=org/openmrs/** -Duser.language=en -Duser.region=US -Xmx2g
  1168. [INFO]
  1169. [INFO] --- maven-java-formatter-plugin:0.3:format (default) @ openmrs-web ---
  1170. [INFO] Using 'UTF-8' encoding to format source files.
  1171. [INFO] Number of files to be formatted: 50
  1172. [INFO] Successfully formatted: 0 file(s)
  1173. [INFO] Fail to format : 0 file(s)
  1174. [INFO] Skipped : 50 file(s)
  1175. [INFO] Approximate time taken: 0s
  1176. [INFO]
  1177. [INFO] --- maven-resources-plugin:2.4:resources (default-resources) @ openmrs-web ---
  1178. [INFO] Using 'UTF-8' encoding to copy filtered resources.
  1179. [INFO] Copying 22 resources
  1180. [INFO]
  1181. [INFO] --- maven-compiler-plugin:2.1:compile (default-compile) @ openmrs-web ---
  1182. [INFO] Compiling 39 source files to /www/openmrs/openmrs-core/web/target/classes
  1183. [INFO]
  1184. [INFO] --- maven-resources-plugin:2.4:testResources (default-testResources) @ openmrs-web ---
  1185. [INFO] Using 'UTF-8' encoding to copy filtered resources.
  1186. [INFO] skip non existing resourceDirectory /www/openmrs/openmrs-core/web/src/test/resources
  1187. [INFO]
  1188. [INFO] --- maven-compiler-plugin:2.1:testCompile (default-testCompile) @ openmrs-web ---
  1189. [INFO] Compiling 11 source files to /www/openmrs/openmrs-core/web/target/test-classes
  1190. [INFO]
  1191. [INFO] --- maven-surefire-plugin:2.18.1:test (default-test) @ openmrs-web ---
  1192. [INFO] Surefire report directory: /www/openmrs/openmrs-core/web/target/surefire-reports
  1193.  
  1194. -------------------------------------------------------
  1195. T E S T S
  1196. -------------------------------------------------------
  1197. objc[4175]: Class JavaLaunchHelper is implemented in both /Library/Java/JavaVirtualMachines/jdk1.8.0_77.jdk/Contents/Home/jre/bin/java (0x10133c4c0) and /Library/Java/JavaVirtualMachines/jdk1.8.0_77.jdk/Contents/Home/jre/lib/libinstrument.dylib (0x1034964e0). One of the two will be used. Which one is undefined.
  1198. Running org.openmrs.module.web.WebModuleUtilTest
  1199. SLF4J: Class path contains multiple SLF4J bindings.
  1200. SLF4J: Found binding in [jar:file:/Users/kostya/.m2/repository/org/slf4j/slf4j-log4j12/1.6.0/slf4j-log4j12-1.6.0.jar!/org/slf4j/impl/StaticLoggerBinder.class]
  1201. SLF4J: Found binding in [jar:file:/Users/kostya/.m2/repository/org/slf4j/slf4j-log4j12/1.6.0/slf4j-log4j12-1.6.0.jar!/org/slf4j/impl/StaticLoggerBinder.class]
  1202. SLF4J: See http://www.slf4j.org/codes.html#multiple_bindings for an explanation.
  1203. Tests run: 9, Failures: 0, Errors: 0, Skipped: 0, Time elapsed: 1.265 sec - in org.openmrs.module.web.WebModuleUtilTest
  1204. Running org.openmrs.web.filter.update.GZIPFilterTest
  1205. Tests run: 1, Failures: 0, Errors: 0, Skipped: 0, Time elapsed: 10.342 sec - in org.openmrs.web.filter.update.GZIPFilterTest
  1206. Running org.openmrs.web.filter.update.UpdateFilterTest
  1207. Tests run: 5, Failures: 0, Errors: 0, Skipped: 0, Time elapsed: 0.194 sec - in org.openmrs.web.filter.update.UpdateFilterTest
  1208. Running org.openmrs.web.filter.update.util.FilterUtilTest
  1209. Tests run: 2, Failures: 0, Errors: 0, Skipped: 2, Time elapsed: 0.002 sec - in org.openmrs.web.filter.update.util.FilterUtilTest
  1210. Running org.openmrs.web.WebUtilTest
  1211. Tests run: 14, Failures: 0, Errors: 0, Skipped: 0, Time elapsed: 0.007 sec - in org.openmrs.web.WebUtilTest
  1212.  
  1213. Results :
  1214.  
  1215. Tests run: 31, Failures: 0, Errors: 0, Skipped: 2
  1216.  
  1217. [INFO]
  1218. [INFO] --- maven-jar-plugin:2.3.2:jar (default-jar) @ openmrs-web ---
  1219. [INFO] Building jar: /www/openmrs/openmrs-core/web/target/openmrs-web-2.2.0-SNAPSHOT.jar
  1220. [INFO]
  1221. [INFO] --- maven-jar-plugin:2.3.2:test-jar (default) @ openmrs-web ---
  1222. [INFO] Building jar: /www/openmrs/openmrs-core/web/target/openmrs-web-2.2.0-SNAPSHOT-tests.jar
  1223. [INFO]
  1224. [INFO] --- license-maven-plugin:2.6:check (default) @ openmrs-web ---
  1225. [INFO] Checking licenses...
  1226. [INFO]
  1227. [INFO] --- maven-install-plugin:2.4:install (default-install) @ openmrs-web ---
  1228. [INFO] Installing /www/openmrs/openmrs-core/web/target/openmrs-web-2.2.0-SNAPSHOT.jar to /Users/kostya/.m2/repository/org/openmrs/web/openmrs-web/2.2.0-SNAPSHOT/openmrs-web-2.2.0-SNAPSHOT.jar
  1229. [INFO] Installing /www/openmrs/openmrs-core/web/pom.xml to /Users/kostya/.m2/repository/org/openmrs/web/openmrs-web/2.2.0-SNAPSHOT/openmrs-web-2.2.0-SNAPSHOT.pom
  1230. [INFO] Installing /www/openmrs/openmrs-core/web/target/openmrs-web-2.2.0-SNAPSHOT-tests.jar to /Users/kostya/.m2/repository/org/openmrs/web/openmrs-web/2.2.0-SNAPSHOT/openmrs-web-2.2.0-SNAPSHOT-tests.jar
  1231. [INFO]
  1232. [INFO] ------------------------------------------------------------------------
  1233. [INFO] Building openmrs-webapp 2.2.0-SNAPSHOT
  1234. [INFO] ------------------------------------------------------------------------
  1235. [INFO]
  1236. [INFO] --- maven-clean-plugin:2.5:clean (default-clean) @ openmrs-webapp ---
  1237. [INFO]
  1238. [INFO] --- buildnumber-maven-plugin:1.1:create (default) @ openmrs-webapp ---
  1239. [INFO]
  1240. [INFO] --- build-helper-maven-plugin:1.5:parse-version (parse-version) @ openmrs-webapp ---
  1241. [INFO]
  1242. [INFO] --- maven-resources-plugin:2.4:resources (default-resources) @ openmrs-webapp ---
  1243. [INFO] Using 'UTF-8' encoding to copy filtered resources.
  1244. [INFO] Copying 2 resources
  1245. [INFO] Copying 1 resource to ../jetty
  1246. [INFO]
  1247. [INFO] --- maven-antrun-plugin:1.4:run (default) @ openmrs-webapp ---
  1248. project.artifactId
  1249. [INFO] Executing tasks
  1250. [unzip] Expanding: /www/openmrs/openmrs-core/webapp/src/main/resources/liquibase-demo-data.zip into /www/openmrs/openmrs-core/webapp/target/classes
  1251. [INFO] Executed tasks
  1252. [INFO]
  1253. [INFO] --- maven-compiler-plugin:2.1:compile (default-compile) @ openmrs-webapp ---
  1254. [INFO] No sources to compile
  1255. [INFO]
  1256. [INFO] --- maven-resources-plugin:2.4:testResources (default-testResources) @ openmrs-webapp ---
  1257. [INFO] Using 'UTF-8' encoding to copy filtered resources.
  1258. [INFO] Copying 1 resource
  1259. [INFO]
  1260. [INFO] --- maven-compiler-plugin:2.1:testCompile (default-testCompile) @ openmrs-webapp ---
  1261. [INFO] Compiling 3 source files to /www/openmrs/openmrs-core/webapp/target/test-classes
  1262. [INFO]
  1263. [INFO] --- maven-surefire-plugin:2.18.1:test (default-test) @ openmrs-webapp ---
  1264. [INFO] Surefire report directory: /www/openmrs/openmrs-core/webapp/target/surefire-reports
  1265.  
  1266. -------------------------------------------------------
  1267. T E S T S
  1268. -------------------------------------------------------
  1269. Running org.openmrs.MessagePropertiesFilesTest
  1270. Tests run: 0, Failures: 0, Errors: 0, Skipped: 0, Time elapsed: 0.003 sec - in org.openmrs.MessagePropertiesFilesTest
  1271.  
  1272. Results :
  1273.  
  1274. Tests run: 0, Failures: 0, Errors: 0, Skipped: 0
  1275.  
  1276. [INFO]
  1277. [INFO] --- maven-war-plugin:2.4:war (default-war) @ openmrs-webapp ---
  1278. [INFO] Packaging webapp
  1279. [INFO] Assembling webapp [openmrs-webapp] in [/www/openmrs/openmrs-core/webapp/target/openmrs]
  1280. [INFO] Processing war project
  1281. [INFO] Copying webapp webResources [/www/openmrs/openmrs-core/webapp/src/main/webapp] to [/www/openmrs/openmrs-core/webapp/target/openmrs]
  1282. [INFO] Copying webapp resources [/www/openmrs/openmrs-core/webapp/src/main/webapp]
  1283. [INFO] Webapp assembled in [427 msecs]
  1284. [INFO] Building war: /www/openmrs/openmrs-core/webapp/target/openmrs.war
  1285. [INFO]
  1286. [INFO] --- maven-jar-plugin:2.3.2:test-jar (default) @ openmrs-webapp ---
  1287. [INFO] Building jar: /www/openmrs/openmrs-core/webapp/target/openmrs-tests.jar
  1288. [INFO]
  1289. [INFO] --- license-maven-plugin:2.6:check (default) @ openmrs-webapp ---
  1290. [INFO] Checking licenses...
  1291. [INFO]
  1292. [INFO] --- maven-install-plugin:2.4:install (default-install) @ openmrs-webapp ---
  1293. [INFO] Installing /www/openmrs/openmrs-core/webapp/target/openmrs.war to /Users/kostya/.m2/repository/org/openmrs/web/openmrs-webapp/2.2.0-SNAPSHOT/openmrs-webapp-2.2.0-SNAPSHOT.war
  1294. [INFO] Installing /www/openmrs/openmrs-core/webapp/pom.xml to /Users/kostya/.m2/repository/org/openmrs/web/openmrs-webapp/2.2.0-SNAPSHOT/openmrs-webapp-2.2.0-SNAPSHOT.pom
  1295. [INFO] Installing /www/openmrs/openmrs-core/webapp/target/openmrs-tests.jar to /Users/kostya/.m2/repository/org/openmrs/web/openmrs-webapp/2.2.0-SNAPSHOT/openmrs-webapp-2.2.0-SNAPSHOT-tests.jar
  1296. [INFO] ------------------------------------------------------------------------
  1297. [INFO] Reactor Summary:
  1298. [INFO]
  1299. [INFO] OpenMRS ............................................ SUCCESS [ 1.671 s]
  1300. [INFO] openmrs-tools ...................................... SUCCESS [ 0.647 s]
  1301. [INFO] openmrs-test ....................................... SUCCESS [ 0.082 s]
  1302. [INFO] openmrs-api ........................................ SUCCESS [02:06 min]
  1303. [INFO] openmrs-web ........................................ SUCCESS [ 17.755 s]
  1304. [INFO] openmrs-webapp ..................................... SUCCESS [ 6.487 s]
  1305. [INFO] ------------------------------------------------------------------------
  1306. [INFO] BUILD SUCCESS
  1307. [INFO] ------------------------------------------------------------------------
  1308. [INFO] Total time: 02:33 min
  1309. [INFO] Finished at: 2017-04-07T09:47:42+02:00
  1310. [INFO] Final Memory: 121M/1354M
  1311. [INFO] ------------------------------------------------------------------------
  1312. ➜ openmrs-core git:(master) cd webapp
  1313. ➜ webapp git:(master) mvn jetty:run
  1314. [INFO] Scanning for projects...
  1315. [INFO]
  1316. [INFO] ------------------------------------------------------------------------
  1317. [INFO] Building openmrs-webapp 2.2.0-SNAPSHOT
  1318. [INFO] ------------------------------------------------------------------------
  1319. [INFO]
  1320. [INFO] >>> jetty-maven-plugin:9.3.3.v20150827:run (default-cli) > test-compile @ openmrs-webapp >>>
  1321. [INFO]
  1322. [INFO] --- buildnumber-maven-plugin:1.1:create (default) @ openmrs-webapp ---
  1323. [INFO] Checking for local modifications: skipped.
  1324. [INFO] Updating project files from SCM: skipped.
  1325. [INFO] ShortRevision tag detected. The value is '6'.
  1326. [INFO] Executing: /bin/sh -c cd /www/openmrs/openmrs-core/webapp && git rev-parse --verify --short=6 HEAD
  1327. [INFO] Working directory: /www/openmrs/openmrs-core/webapp
  1328. [INFO] Storing buildNumber: 0d7fbf at timestamp: 1491551287280
  1329. [INFO] ShortRevision tag detected. The value is '6'.
  1330. [INFO] Executing: /bin/sh -c cd /www/openmrs/openmrs-core/webapp && git rev-parse --verify --short=6 HEAD
  1331. [INFO] Working directory: /www/openmrs/openmrs-core/webapp
  1332. [INFO] Storing buildScmBranch: UNKNOWN
  1333. [INFO]
  1334. [INFO] --- build-helper-maven-plugin:1.5:parse-version (parse-version) @ openmrs-webapp ---
  1335. [INFO]
  1336. [INFO] --- maven-resources-plugin:2.4:resources (default-resources) @ openmrs-webapp ---
  1337. [INFO] Using 'UTF-8' encoding to copy filtered resources.
  1338. [INFO] Copying 2 resources
  1339. [INFO] Copying 1 resource to ../jetty
  1340. [INFO]
  1341. [INFO] --- maven-antrun-plugin:1.4:run (default) @ openmrs-webapp ---
  1342. project.artifactId
  1343. [INFO] Executing tasks
  1344. [unzip] Expanding: /www/openmrs/openmrs-core/webapp/src/main/resources/liquibase-demo-data.zip into /www/openmrs/openmrs-core/webapp/target/classes
  1345. [INFO] Executed tasks
  1346. [INFO]
  1347. [INFO] --- maven-compiler-plugin:2.1:compile (default-compile) @ openmrs-webapp ---
  1348. [INFO] No sources to compile
  1349. [INFO]
  1350. [INFO] --- maven-resources-plugin:2.4:testResources (default-testResources) @ openmrs-webapp ---
  1351. [INFO] Using 'UTF-8' encoding to copy filtered resources.
  1352. [INFO] Copying 1 resource
  1353. [INFO]
  1354. [INFO] --- maven-compiler-plugin:2.1:testCompile (default-testCompile) @ openmrs-webapp ---
  1355. [INFO] Nothing to compile - all classes are up to date
  1356. [INFO]
  1357. [INFO] <<< jetty-maven-plugin:9.3.3.v20150827:run (default-cli) < test-compile @ openmrs-webapp <<<
  1358. [INFO]
  1359. [INFO] --- jetty-maven-plugin:9.3.3.v20150827:run (default-cli) @ openmrs-webapp ---
  1360. [INFO] Logging initialized @2565ms
  1361. [INFO] Configuring Jetty for project: openmrs-webapp
  1362. [INFO] webAppSourceDirectory not set. Trying src/main/webapp
  1363. [INFO] Reload Mechanic: automatic
  1364. [INFO] Classes = /www/openmrs/openmrs-core/webapp/target/classes
  1365. [INFO] Context path = /openmrs
  1366. [INFO] Tmp directory = /www/openmrs/openmrs-core/webapp/target/tmp
  1367. [INFO] Web defaults = org/eclipse/jetty/webapp/webdefault.xml
  1368. [INFO] Web overrides = src/test/resources/override-web.xml
  1369. [INFO] web.xml file = /www/openmrs/openmrs-core/webapp/target/jetty/WEB-INF/web.xml
  1370. [INFO] Webapp directory = /www/openmrs/openmrs-core/webapp/src/main/webapp
  1371. [INFO] jetty-9.3.3.v20150827
  1372. [INFO] No Spring WebApplicationInitializer types detected on classpath
  1373. [INFO] Initializing log4j from [classpath:log4j.xml]
  1374. WARN - OpenmrsUtil.getRuntimePropertiesFilePathName(2083) |2017-04-07 09:48:10,966| Unable to find a runtime properties file at /www/openmrs/openmrs-core/webapp/openmrs-runtime.properties
  1375. WARN - OpenmrsUtil.getRuntimePropertiesFilePathName(2111) |2017-04-07 09:48:10,980| Unable to find properties file: /Users/kostya/.OpenMRS/openmrs-runtime.properties
  1376. WARN - OpenmrsUtil.getRuntimeProperties(2044) |2017-04-07 09:48:10,981| Unable to find a runtime properties file. Initial setup is needed. View the webapp to run the setup wizard.
  1377. WARN - OpenmrsUtil.getRuntimePropertiesFilePathName(2083) |2017-04-07 09:48:11,108| Unable to find a runtime properties file at /www/openmrs/openmrs-core/webapp/openmrs-runtime.properties
  1378. WARN - OpenmrsUtil.getRuntimePropertiesFilePathName(2111) |2017-04-07 09:48:11,108| Unable to find properties file: /Users/kostya/.OpenMRS/openmrs-runtime.properties
  1379. WARN - OpenmrsUtil.getRuntimeProperties(2044) |2017-04-07 09:48:11,109| Unable to find a runtime properties file. Initial setup is needed. View the webapp to run the setup wizard.
  1380. [INFO] Started o.e.j.m.p.JettyWebAppContext@20ab3e3a{/openmrs,file:///www/openmrs/openmrs-core/webapp/src/main/webapp/,AVAILABLE}{file:///www/openmrs/openmrs-core/webapp/src/main/webapp/}
  1381. [INFO] Started ServerConnector@4c6a4ffd{HTTP/1.1,[http/1.1]}{0.0.0.0:8080}
  1382. [INFO] Started @5559ms
  1383. [INFO] Started Jetty Server
  1384. [INFO] Using Non-Native Java sun.nio.fs.PollingWatchService
  1385. [WARNING] Quiet Time is too low for non-native WatchService [sun.nio.fs.PollingWatchService]: 1000 < 5000 ms (defaulting to 5000 ms)
  1386. WARN - OpenmrsUtil.getRuntimePropertiesFilePathName(2083) |2017-04-07 09:49:31,390| Unable to find a runtime properties file at /www/openmrs/openmrs-core/webapp/openmrs-runtime.properties
  1387. WARN - OpenmrsUtil.getRuntimePropertiesFilePathName(2111) |2017-04-07 09:49:31,391| Unable to find properties file: /Users/kostya/.OpenMRS/openmrs-runtime.properties
  1388. ERROR - Context.getServiceContext(249) |2017-04-07 09:53:46,345| serviceContext is null. Creating new ServiceContext()
  1389. [WARNING] /openmrs/initialsetup
  1390. org.openmrs.api.APIException: Service not found: interface org.openmrs.messagesource.MessageSourceService
  1391. at org.openmrs.api.context.ServiceContext.getService(ServiceContext.java:641)
  1392. at org.openmrs.api.context.ServiceContext.getMessageSourceService(ServiceContext.java:458)
  1393. at org.openmrs.api.context.Context.getMessageSourceService(Context.java:479)
  1394. at org.openmrs.api.APIException.<init>(APIException.java:69)
  1395. at org.openmrs.api.PasswordException.<init>(PasswordException.java:39)
  1396. at org.openmrs.api.ShortPasswordException.<init>(ShortPasswordException.java:30)
  1397. at org.openmrs.util.OpenmrsUtil.validatePassword(OpenmrsUtil.java:1860)
  1398. at org.openmrs.web.filter.initialization.InitializationFilter.doPost(InitializationFilter.java:663)
  1399. at org.openmrs.web.filter.StartupFilter.doFilter(StartupFilter.java:159)
  1400. at org.eclipse.jetty.servlet.ServletHandler$CachedChain.doFilter(ServletHandler.java:1669)
  1401. at org.openmrs.web.filter.StartupFilter.doFilter(StartupFilter.java:106)
  1402. at org.eclipse.jetty.servlet.ServletHandler$CachedChain.doFilter(ServletHandler.java:1669)
  1403. at org.springframework.web.filter.CharacterEncodingFilter.doFilterInternal(CharacterEncodingFilter.java:88)
  1404. at org.springframework.web.filter.OncePerRequestFilter.doFilter(OncePerRequestFilter.java:107)
  1405. at org.eclipse.jetty.servlet.ServletHandler$CachedChain.doFilter(ServletHandler.java:1669)
  1406. at org.eclipse.jetty.servlet.ServletHandler.doHandle(ServletHandler.java:581)
  1407. at org.eclipse.jetty.server.handler.ScopedHandler.handle(ScopedHandler.java:143)
  1408. at org.eclipse.jetty.security.SecurityHandler.handle(SecurityHandler.java:548)
  1409. at org.eclipse.jetty.server.session.SessionHandler.doHandle(SessionHandler.java:226)
  1410. at org.eclipse.jetty.server.handler.ContextHandler.doHandle(ContextHandler.java:1156)
  1411. at org.eclipse.jetty.servlet.ServletHandler.doScope(ServletHandler.java:511)
  1412. at org.eclipse.jetty.server.session.SessionHandler.doScope(SessionHandler.java:185)
  1413. at org.eclipse.jetty.server.handler.ContextHandler.doScope(ContextHandler.java:1088)
  1414. at org.eclipse.jetty.server.handler.ScopedHandler.handle(ScopedHandler.java:141)
  1415. at org.eclipse.jetty.server.handler.ContextHandlerCollection.handle(ContextHandlerCollection.java:213)
  1416. at org.eclipse.jetty.server.handler.HandlerCollection.handle(HandlerCollection.java:109)
  1417. at org.eclipse.jetty.server.handler.HandlerWrapper.handle(HandlerWrapper.java:119)
  1418. at org.eclipse.jetty.server.Server.handle(Server.java:517)
  1419. at org.eclipse.jetty.server.HttpChannel.handle(HttpChannel.java:306)
  1420. at org.eclipse.jetty.server.HttpConnection.onFillable(HttpConnection.java:242)
  1421. at org.eclipse.jetty.io.AbstractConnection$ReadCallback.succeeded(AbstractConnection.java:245)
  1422. at org.eclipse.jetty.io.FillInterest.fillable(FillInterest.java:95)
  1423. at org.eclipse.jetty.io.SelectChannelEndPoint$2.run(SelectChannelEndPoint.java:75)
  1424. at org.eclipse.jetty.util.thread.strategy.ExecuteProduceConsume.produceAndRun(ExecuteProduceConsume.java:213)
  1425. at org.eclipse.jetty.util.thread.strategy.ExecuteProduceConsume.run(ExecuteProduceConsume.java:147)
  1426. at org.eclipse.jetty.util.thread.QueuedThreadPool.runJob(QueuedThreadPool.java:654)
  1427. at org.eclipse.jetty.util.thread.QueuedThreadPool$3.run(QueuedThreadPool.java:572)
  1428. at java.lang.Thread.run(Thread.java:745)
Advertisement
RAW Paste Data Copied
Advertisement