SHARE
TWEET

Untitled

a guest Jul 17th, 2017 39 Never
Not a member of Pastebin yet? Sign Up, it unlocks many cool features!
  1. -------------------------------------------------------
  2.  T E S T S
  3. -------------------------------------------------------
  4. Running org.apache.directory.server.suites.StockServerISuite
  5. org.apache.directory.shared.ldap.model.exception.LdapConfigurationException: ERR_171 Failed to bind an LDAP service (1,025) to the service registry.
  6.     at org.apache.directory.server.ldap.LdapServer.startNetwork(LdapServer.java:606)
  7.     at org.apache.directory.server.ldap.LdapServer.start(LdapServer.java:449)
  8.     at org.apache.directory.server.factory.ServerAnnotationProcessor.createLdapServer(ServerAnnotationProcessor.java:168)
  9.     at org.apache.directory.server.factory.ServerAnnotationProcessor.createLdapServer(ServerAnnotationProcessor.java:216)
  10.     at org.apache.directory.server.core.integ.FrameworkSuite.startLdapServer(FrameworkSuite.java:123)
  11.     at org.apache.directory.server.core.integ.FrameworkSuite.run(FrameworkSuite.java:155)
  12.     at org.apache.maven.surefire.junit4.JUnit4TestSet.execute(JUnit4TestSet.java:59)
  13.     at org.apache.maven.surefire.suite.AbstractDirectoryTestSuite.executeTestSet(AbstractDirectoryTestSuite.java:120)
  14.     at org.apache.maven.surefire.suite.AbstractDirectoryTestSuite.execute(AbstractDirectoryTestSuite.java:103)
  15.     at org.apache.maven.surefire.Surefire.run(Surefire.java:169)
  16.     at sun.reflect.NativeMethodAccessorImpl.invoke0(Native Method)
  17.     at sun.reflect.NativeMethodAccessorImpl.invoke(NativeMethodAccessorImpl.java:39)
  18.     at sun.reflect.DelegatingMethodAccessorImpl.invoke(DelegatingMethodAccessorImpl.java:25)
  19.     at java.lang.reflect.Method.invoke(Method.java:597)
  20.     at org.apache.maven.surefire.booter.SurefireBooter.runSuitesInProcess(SurefireBooter.java:350)
  21.     at org.apache.maven.surefire.booter.SurefireBooter.main(SurefireBooter.java:1021)
  22. Caused by: java.net.BindException: Address already in use
  23.     at sun.nio.ch.Net.bind(Native Method)
  24.     at sun.nio.ch.ServerSocketChannelImpl.bind(ServerSocketChannelImpl.java:119)
  25.     at sun.nio.ch.ServerSocketAdaptor.bind(ServerSocketAdaptor.java:59)
  26.     at org.apache.mina.transport.socket.nio.NioSocketAcceptor.open(NioSocketAcceptor.java:248)
  27.     at org.apache.mina.transport.socket.nio.NioSocketAcceptor.open(NioSocketAcceptor.java:48)
  28.     at org.apache.mina.core.polling.AbstractPollingIoAcceptor.registerHandles(AbstractPollingIoAcceptor.java:525)
  29.     at org.apache.mina.core.polling.AbstractPollingIoAcceptor.access$200(AbstractPollingIoAcceptor.java:66)
  30.     at org.apache.mina.core.polling.AbstractPollingIoAcceptor$Acceptor.run(AbstractPollingIoAcceptor.java:406)
  31.     at org.apache.mina.util.NamePreservingRunnable.run(NamePreservingRunnable.java:64)
  32.     at java.util.concurrent.ThreadPoolExecutor$Worker.runTask(ThreadPoolExecutor.java:886)
  33.     at java.util.concurrent.ThreadPoolExecutor$Worker.run(ThreadPoolExecutor.java:908)
  34.     at java.lang.Thread.run(Thread.java:680)
  35. javax.naming.CommunicationException: Request: 4 cancelled; remaining name 'cn=Kate Bush'
  36.     at com.sun.jndi.ldap.LdapRequest.getReplyBer(LdapRequest.java:60)
  37.     at com.sun.jndi.ldap.Connection.readReply(Connection.java:414)
  38.     at com.sun.jndi.ldap.LdapClient.processReply(LdapClient.java:857)
  39.     at com.sun.jndi.ldap.LdapClient.modify(LdapClient.java:931)
  40.     at com.sun.jndi.ldap.LdapCtx.c_modifyAttributes(LdapCtx.java:1451)
  41.     at com.sun.jndi.toolkit.ctx.ComponentDirContext.p_modifyAttributes(ComponentDirContext.java:255)
  42.     at com.sun.jndi.toolkit.ctx.PartialCompositeDirContext.modifyAttributes(PartialCompositeDirContext.java:172)
  43.     at com.sun.jndi.toolkit.ctx.PartialCompositeDirContext.modifyAttributes(PartialCompositeDirContext.java:161)
  44.     at org.apache.directory.server.operations.modify.ModifyRemoveIT.testDeleteOclAttrWithTopPersonOrganizationalpersonInetorgperson(ModifyRemoveIT.java:602)
  45.     at sun.reflect.NativeMethodAccessorImpl.invoke0(Native Method)
  46.     at sun.reflect.NativeMethodAccessorImpl.invoke(NativeMethodAccessorImpl.java:39)
  47.     at sun.reflect.DelegatingMethodAccessorImpl.invoke(DelegatingMethodAccessorImpl.java:25)
  48.     at java.lang.reflect.Method.invoke(Method.java:597)
  49.     at org.junit.runners.model.FrameworkMethod$1.runReflectiveCall(FrameworkMethod.java:44)
  50.     at org.junit.internal.runners.model.ReflectiveCallable.run(ReflectiveCallable.java:15)
  51.     at org.junit.runners.model.FrameworkMethod.invokeExplosively(FrameworkMethod.java:41)
  52.     at org.junit.internal.runners.statements.InvokeMethod.evaluate(InvokeMethod.java:20)
  53.     at org.junit.internal.runners.statements.RunBefores.evaluate(RunBefores.java:28)
  54.     at org.junit.runners.BlockJUnit4ClassRunner.runNotIgnored(BlockJUnit4ClassRunner.java:79)
  55.     at org.junit.runners.BlockJUnit4ClassRunner.runChild(BlockJUnit4ClassRunner.java:71)
  56.     at org.apache.directory.server.core.integ.FrameworkRunner.runChild(FrameworkRunner.java:433)
  57.     at org.apache.directory.server.core.integ.FrameworkRunner.runChild(FrameworkRunner.java:55)
  58.     at org.junit.runners.ParentRunner$3.run(ParentRunner.java:193)
  59.     at org.junit.runners.ParentRunner$1.schedule(ParentRunner.java:52)
  60.     at org.junit.runners.ParentRunner.runChildren(ParentRunner.java:191)
  61.     at org.junit.runners.ParentRunner.access$000(ParentRunner.java:42)
  62.     at org.junit.runners.ParentRunner$2.evaluate(ParentRunner.java:184)
  63.     at org.junit.runners.ParentRunner.run(ParentRunner.java:236)
  64.     at org.apache.directory.server.core.integ.FrameworkRunner.run(FrameworkRunner.java:221)
  65.     at org.junit.runners.Suite.runChild(Suite.java:128)
  66.     at org.apache.directory.server.core.integ.FrameworkSuite.runChild(FrameworkSuite.java:191)
  67.     at org.apache.directory.server.core.integ.FrameworkSuite.runChild(FrameworkSuite.java:48)
  68.     at org.junit.runners.ParentRunner$3.run(ParentRunner.java:193)
  69.     at org.junit.runners.ParentRunner$1.schedule(ParentRunner.java:52)
  70.     at org.junit.runners.ParentRunner.runChildren(ParentRunner.java:191)
  71.     at org.junit.runners.ParentRunner.access$000(ParentRunner.java:42)
  72.     at org.junit.runners.ParentRunner$2.evaluate(ParentRunner.java:184)
  73.     at org.junit.runners.ParentRunner.run(ParentRunner.java:236)
  74.     at org.apache.directory.server.core.integ.FrameworkSuite.run(FrameworkSuite.java:158)
  75.     at org.apache.maven.surefire.junit4.JUnit4TestSet.execute(JUnit4TestSet.java:59)
  76.     at org.apache.maven.surefire.suite.AbstractDirectoryTestSuite.executeTestSet(AbstractDirectoryTestSuite.java:120)
  77.     at org.apache.maven.surefire.suite.AbstractDirectoryTestSuite.execute(AbstractDirectoryTestSuite.java:103)
  78.     at org.apache.maven.surefire.Surefire.run(Surefire.java:169)
  79.     at sun.reflect.NativeMethodAccessorImpl.invoke0(Native Method)
  80.     at sun.reflect.NativeMethodAccessorImpl.invoke(NativeMethodAccessorImpl.java:39)
  81.     at sun.reflect.DelegatingMethodAccessorImpl.invoke(DelegatingMethodAccessorImpl.java:25)
  82.     at java.lang.reflect.Method.invoke(Method.java:597)
  83.     at org.apache.maven.surefire.booter.SurefireBooter.runSuitesInProcess(SurefireBooter.java:350)
  84.     at org.apache.maven.surefire.booter.SurefireBooter.main(SurefireBooter.java:1021)
  85. javax.naming.NamingException: [LDAP: error code 80 - OTHER: failed for     SearchRequest
  86.         baseDn : 'ou=system'
  87.         filter : '(objectClass=*)'
  88.         scope : single level
  89.         typesOnly : false
  90.         Size Limit : no limit
  91.         Time Limit : no limit
  92.         Deref Aliases : deref Always
  93.         attributes :
  94.     Persistant Search Control
  95.         oid : 2.16.840.1.113730.3.4.3
  96.         critical : true
  97.         changeTypes : '15'
  98.         changesOnly : 'true'
  99.         returnECs   : 'false'
  100.     ManageDsaIT Control
  101.         Type OID    : '2.16.840.1.113730.3.4.2'
  102.         Criticality : 'true'
  103. : org.apache.directory.shared.ldap.codec.search.controls.persistentSearch.PersistentSearchDecorator cannot be cast to org.apache.directory.shared.ldap.codec.search.controls.persistentSearch.PersistentSearch]; remaining name ''
  104.     at com.sun.jndi.ldap.LdapCtx.mapErrorCode(LdapCtx.java:3085)
  105.     at com.sun.jndi.ldap.LdapCtx.processReturnCode(LdapCtx.java:2987)
  106.     at com.sun.jndi.ldap.LdapCtx.processReturnCode(LdapCtx.java:2794)
  107.     at com.sun.jndi.ldap.LdapCtx.searchAux(LdapCtx.java:1826)
  108.     at com.sun.jndi.ldap.LdapCtx.c_search(LdapCtx.java:1749)
  109.     at com.sun.jndi.toolkit.ctx.ComponentDirContext.p_search(ComponentDirContext.java:368)
  110.     at com.sun.jndi.toolkit.ctx.PartialCompositeDirContext.search(PartialCompositeDirContext.java:338)
  111.     at com.sun.jndi.toolkit.ctx.PartialCompositeDirContext.search(PartialCompositeDirContext.java:321)
  112.     at org.apache.directory.server.operations.search.PersistentSearchIT$PSearchListener.run(PersistentSearchIT.java:585)
  113.     at java.lang.Thread.run(Thread.java:680)
RAW Paste Data
Pastebin PRO Summer Special!
Get 60% OFF on Pastebin PRO accounts!
Top