msoutopico

okapi-omegat-plugin-mvn-clean-package

Apr 29th, 2024
81
0
Never
Not a member of Pastebin yet? Sign Up, it unlocks many cool features!
text 16.33 KB | None | 0 0
  1. ╭─   ~/Repos/okapiframework/omegat-plugin/filters   dev !3 ▓▒░────────────────────────────────────────░▒▓ ✔ 17:56:18  ─╮
  2. ╰─ mvn clean package ─╯
  3. Picked up _JAVA_OPTIONS: -Dawt.useSystemAAFontSettings=on -Dswing.aatext=true
  4. [INFO] Scanning for projects...
  5. [INFO]
  6. [INFO] -------------------< net.sf.okapi:okapi-lib-omegat >--------------------
  7. [INFO] Building Okapi Filter Plug-in for OmegaT 1.14-1.46.0-SNAPSHOT
  8. [INFO] --------------------------------[ jar ]---------------------------------
  9. [INFO]
  10. [INFO] --- maven-clean-plugin:2.5:clean (default-clean) @ okapi-lib-omegat ---
  11. [INFO]
  12. [INFO] --- maven-resources-plugin:2.6:resources (default-resources) @ okapi-lib-omegat ---
  13. [INFO] Using 'UTF-8' encoding to copy filtered resources.
  14. [INFO] Copying 9 resources
  15. [INFO]
  16. [INFO] --- maven-compiler-plugin:3.8.1:compile (default-compile) @ okapi-lib-omegat ---
  17. [INFO] Changes detected - recompiling the module!
  18. [INFO] Compiling 22 source files to /home/souto/Repos/okapiframework/omegat-plugin/filters/target/classes
  19. [INFO] /home/souto/Repos/okapiframework/omegat-plugin/filters/src/main/java/net/sf/okapi/lib/omegat/AbstractOkapiFilter.java: Some input files use or override a deprecated API.
  20. [INFO] /home/souto/Repos/okapiframework/omegat-plugin/filters/src/main/java/net/sf/okapi/lib/omegat/AbstractOkapiFilter.java: Recompile with -Xlint:deprecation for details.
  21. [INFO]
  22. [INFO] --- maven-resources-plugin:2.6:testResources (default-testResources) @ okapi-lib-omegat ---
  23. [INFO] Using 'UTF-8' encoding to copy filtered resources.
  24. [INFO] Copying 21 resources
  25. [INFO]
  26. [INFO] --- maven-compiler-plugin:3.8.1:testCompile (default-testCompile) @ okapi-lib-omegat ---
  27. [INFO] Changes detected - recompiling the module!
  28. [INFO] Compiling 7 source files to /home/souto/Repos/okapiframework/omegat-plugin/filters/target/test-classes
  29. [INFO]
  30. [INFO] --- maven-surefire-plugin:3.2.3:test (default-test) @ okapi-lib-omegat ---
  31. [INFO] Using configured provider org.apache.maven.surefire.junitcore.JUnitCoreProvider
  32. [INFO]
  33. [INFO] -------------------------------------------------------
  34. [INFO] T E S T S
  35. [INFO] -------------------------------------------------------
  36. Picked up _JAVA_OPTIONS: -Dawt.useSystemAAFontSettings=on -Dswing.aatext=true
  37. [INFO] Running net.sf.okapi.lib.omegat.XLIFFDetectorTest
  38. [INFO] Tests run: 4, Failures: 0, Errors: 0, Skipped: 0, Time elapsed: 0.095 s -- in net.sf.okapi.lib.omegat.XLIFFDetectorTest
  39. [INFO] Running net.sf.okapi.lib.omegat.AbstractOkapiFilterTest
  40. Apr 29, 2024 5:56:26 PM net.sf.okapi.lib.omegat.AbstractOkapiFilter checkOmegaTVersion
  41. INFO: Omtv= 5.7.1 flag2_5=true flag3_plus=true
  42. Apr 29, 2024 5:56:26 PM net.sf.okapi.lib.omegat.AbstractOkapiFilter processFile
  43. INFO: Loading: '/home/souto/Repos/okapiframework/omegat-plugin/filters/target/test-classes/multi-cases.xlf' with okf_xliff
  44. Apr 29, 2024 5:56:26 PM net.sf.okapi.lib.omegat.AbstractOkapiFilter processFile
  45. INFO: Loading: '/home/souto/Repos/okapiframework/omegat-plugin/filters/target/test-classes/multi-cases.xlf' with okf_xliff
  46. Apr 29, 2024 5:56:26 PM net.sf.okapi.lib.omegat.AbstractOkapiFilter checkOmegaTVersion
  47. INFO: Omtv= 5.7.1 flag2_5=true flag3_plus=true
  48. Apr 29, 2024 5:56:26 PM net.sf.okapi.lib.omegat.AbstractOkapiFilter processFile
  49. INFO: Loading: '/home/souto/Repos/okapiframework/omegat-plugin/filters/target/test-classes/allowTransEqualToSrc.xlf' with okf_xliff
  50. Apr 29, 2024 5:56:26 PM net.sf.okapi.lib.omegat.AbstractOkapiFilter processFile
  51. INFO: Loading: '/home/souto/Repos/okapiframework/omegat-plugin/filters/target/test-classes/allowTransEqualToSrc.xlf' with okf_xliff
  52. Apr 29, 2024 5:56:26 PM net.sf.okapi.lib.omegat.AbstractOkapiFilter checkOmegaTVersion
  53. INFO: Omtv= 5.7.1 flag2_5=true flag3_plus=true
  54. Apr 29, 2024 5:56:26 PM net.sf.okapi.lib.omegat.AbstractOkapiFilter processFile
  55. INFO: Loading: '/home/souto/Repos/okapiframework/omegat-plugin/filters/target/test-classes/withEmptyTarget.xlf' with okf_xliff@allowEmptyTargets
  56. Apr 29, 2024 5:56:26 PM net.sf.okapi.lib.omegat.AbstractOkapiFilter processFile
  57. INFO: Loading: '/home/souto/Repos/okapiframework/omegat-plugin/filters/target/test-classes/withEmptyTarget.xlf' with okf_xliff@allowEmptyTargets
  58. Apr 29, 2024 5:56:26 PM net.sf.okapi.lib.omegat.AbstractOkapiFilter checkOmegaTVersion
  59. INFO: Omtv= 5.7.1 flag2_5=true flag3_plus=true
  60. Apr 29, 2024 5:56:26 PM net.sf.okapi.lib.omegat.AbstractOkapiFilter processFile
  61. INFO: Loading: '/home/souto/Repos/okapiframework/omegat-plugin/filters/target/test-classes/json-with-html.json' with okf_json@with-subfilter
  62. Apr 29, 2024 5:56:26 PM net.sf.okapi.lib.omegat.AbstractOkapiFilter processFile
  63. INFO: Loading: '/home/souto/Repos/okapiframework/omegat-plugin/filters/target/test-classes/json-with-html.json' with okf_json@with-subfilter
  64. Apr 29, 2024 5:56:26 PM net.sf.okapi.lib.omegat.AbstractOkapiFilter checkOmegaTVersion
  65. INFO: Omtv= 5.7.1 flag2_5=true flag3_plus=true
  66. Apr 29, 2024 5:56:26 PM net.sf.okapi.lib.omegat.AbstractOkapiFilter processFile
  67. INFO: Loading: '/home/souto/Repos/okapiframework/omegat-plugin/filters/target/test-classes/W3CHTMHLTest1.html' with okf_html
  68. Apr 29, 2024 5:56:27 PM net.sf.okapi.lib.omegat.AbstractOkapiFilter processFile
  69. INFO: Loading: '/home/souto/Repos/okapiframework/omegat-plugin/filters/target/test-classes/W3CHTMHLTest1.html' with okf_html
  70. Apr 29, 2024 5:56:27 PM net.sf.okapi.lib.omegat.AbstractOkapiFilter checkOmegaTVersion
  71. INFO: Omtv= 5.7.1 flag2_5=true flag3_plus=true
  72. Apr 29, 2024 5:56:27 PM net.sf.okapi.lib.omegat.AbstractOkapiFilter processFile
  73. INFO: Loading: '/home/souto/Repos/okapiframework/omegat-plugin/filters/target/test-classes/en.yml' with okf_yaml
  74. Apr 29, 2024 5:56:27 PM net.sf.okapi.lib.omegat.AbstractOkapiFilter processFile
  75. INFO: Loading: '/home/souto/Repos/okapiframework/omegat-plugin/filters/target/test-classes/en.yml' with okf_yaml
  76. Apr 29, 2024 5:56:27 PM net.sf.okapi.lib.omegat.AbstractOkapiFilter checkOmegaTVersion
  77. INFO: Omtv= 5.7.1 flag2_5=true flag3_plus=true
  78. Apr 29, 2024 5:56:27 PM net.sf.okapi.lib.omegat.AbstractOkapiFilter processFile
  79. INFO: Loading: '/home/souto/Repos/okapiframework/omegat-plugin/filters/target/test-classes/example_v12.xlf' with okf_xliff
  80. Apr 29, 2024 5:56:27 PM net.sf.okapi.lib.omegat.AbstractOkapiFilter processFile
  81. INFO: Loading: '/home/souto/Repos/okapiframework/omegat-plugin/filters/target/test-classes/example_v12.xlf' with okf_xliff
  82. Apr 29, 2024 5:56:27 PM net.sf.okapi.lib.omegat.AbstractOkapiFilter checkOmegaTVersion
  83. INFO: Omtv= 5.7.1 flag2_5=true flag3_plus=true
  84. Apr 29, 2024 5:56:27 PM net.sf.okapi.lib.omegat.AbstractOkapiFilter processFile
  85. INFO: Loading: '/home/souto/Repos/okapiframework/omegat-plugin/filters/target/test-classes/translate-no_space-preserve.xlf' with okf_xliff
  86. Apr 29, 2024 5:56:27 PM net.sf.okapi.lib.omegat.AbstractOkapiFilter processFile
  87. INFO: Loading: '/home/souto/Repos/okapiframework/omegat-plugin/filters/target/test-classes/translate-no_space-preserve.xlf' with okf_xliff
  88. Apr 29, 2024 5:56:27 PM net.sf.okapi.lib.omegat.AbstractOkapiFilter checkOmegaTVersion
  89. INFO: Omtv= 5.7.1 flag2_5=true flag3_plus=true
  90. Apr 29, 2024 5:56:27 PM net.sf.okapi.lib.omegat.AbstractOkapiFilter processFile
  91. INFO: Loading: '/home/souto/Repos/okapiframework/omegat-plugin/filters/target/test-classes/javadoc-style.h' with okf_doxygen
  92. Apr 29, 2024 5:56:27 PM net.sf.okapi.lib.omegat.AbstractOkapiFilter processFile
  93. INFO: Loading: '/home/souto/Repos/okapiframework/omegat-plugin/filters/target/test-classes/javadoc-style.h' with okf_doxygen
  94. Apr 29, 2024 5:56:27 PM net.sf.okapi.lib.omegat.AbstractOkapiFilter checkOmegaTVersion
  95. INFO: Omtv= 5.7.1 flag2_5=true flag3_plus=true
  96. Apr 29, 2024 5:56:27 PM net.sf.okapi.lib.omegat.AbstractOkapiFilter processFile
  97. INFO: Loading: '/home/souto/Repos/okapiframework/omegat-plugin/filters/target/test-classes/multi-cases.xlf' with okf_xliff
  98. Apr 29, 2024 5:56:27 PM net.sf.okapi.lib.omegat.AbstractOkapiFilter processFile
  99. INFO: Loading: '/home/souto/Repos/okapiframework/omegat-plugin/filters/target/test-classes/multi-cases.xlf' with okf_xliff
  100. Apr 29, 2024 5:56:27 PM net.sf.okapi.lib.omegat.AbstractOkapiFilter checkOmegaTVersion
  101. INFO: Omtv= 5.7.1 flag2_5=true flag3_plus=true
  102. Apr 29, 2024 5:56:27 PM net.sf.okapi.lib.omegat.AbstractOkapiFilter processFile
  103. INFO: Loading: '/home/souto/Repos/okapiframework/omegat-plugin/filters/target/test-classes/multi-cases.xlf' with okf_xliff
  104. Apr 29, 2024 5:56:27 PM net.sf.okapi.lib.omegat.AbstractOkapiFilter processFile
  105. INFO: Loading: '/home/souto/Repos/okapiframework/omegat-plugin/filters/target/test-classes/multi-cases.xlf' with okf_xliff
  106. Apr 29, 2024 5:56:27 PM net.sf.okapi.lib.omegat.AbstractOkapiFilter checkOmegaTVersion
  107. INFO: Omtv= 5.7.1 flag2_5=true flag3_plus=true
  108. Apr 29, 2024 5:56:27 PM net.sf.okapi.lib.omegat.AbstractOkapiFilter processFile
  109. INFO: Loading: '/home/souto/Repos/okapiframework/omegat-plugin/filters/target/test-classes/43.json' with okf_json@43
  110. Apr 29, 2024 5:56:27 PM net.sf.okapi.lib.omegat.AbstractOkapiFilter processFile
  111. INFO: Loading: '/home/souto/Repos/okapiframework/omegat-plugin/filters/target/test-classes/43.json' with okf_json@43
  112. Apr 29, 2024 5:56:27 PM net.sf.okapi.lib.omegat.AbstractOkapiFilter checkOmegaTVersion
  113. INFO: Omtv= 5.7.1 flag2_5=true flag3_plus=true
  114. Apr 29, 2024 5:56:27 PM net.sf.okapi.lib.omegat.AbstractOkapiFilter processFile
  115. INFO: Loading: '/home/souto/Repos/okapiframework/omegat-plugin/filters/target/test-classes/multi-cases.xlf' with okf_xliff
  116. Apr 29, 2024 5:56:27 PM net.sf.okapi.lib.omegat.AbstractOkapiFilter processFile
  117. INFO: Loading: '/home/souto/Repos/okapiframework/omegat-plugin/filters/target/test-classes/multi-cases.xlf' with okf_xliff
  118. Apr 29, 2024 5:56:27 PM net.sf.okapi.lib.omegat.AbstractOkapiFilter checkOmegaTVersion
  119. INFO: Omtv= 5.7.1 flag2_5=true flag3_plus=true
  120. Apr 29, 2024 5:56:27 PM net.sf.okapi.lib.omegat.AbstractOkapiFilter processFile
  121. INFO: Loading: '/home/souto/Repos/okapiframework/omegat-plugin/filters/target/test-classes/xmlstream-test.xml' with okf_xmlstream@myf
  122. Apr 29, 2024 5:56:27 PM net.sf.okapi.lib.omegat.AbstractOkapiFilter processFile
  123. INFO: Loading: '/home/souto/Repos/okapiframework/omegat-plugin/filters/target/test-classes/xmlstream-test.xml' with okf_xmlstream@myf
  124. [INFO] Tests run: 15, Failures: 0, Errors: 0, Skipped: 0, Time elapsed: 1.959 s -- in net.sf.okapi.lib.omegat.AbstractOkapiFilterTest
  125. [INFO] Running net.sf.okapi.lib.omegat.XLIFF2FilterTest
  126. [INFO] Tests run: 7, Failures: 0, Errors: 0, Skipped: 0, Time elapsed: 0.287 s -- in net.sf.okapi.lib.omegat.XLIFF2FilterTest
  127. [INFO] Running net.sf.okapi.lib.omegat.XMLFilterTest
  128. Apr 29, 2024 5:56:28 PM net.sf.okapi.lib.omegat.AbstractOkapiFilter checkOmegaTVersion
  129. INFO: Omtv= 5.7.1 flag2_5=true flag3_plus=true
  130. Apr 29, 2024 5:56:28 PM net.sf.okapi.lib.omegat.AbstractOkapiFilter processFile
  131. INFO: Loading: '/tmp/okapi13044113890942155541/infile.xml' with okf_xml
  132. [ERROR] Tests run: 1, Failures: 1, Errors: 0, Skipped: 0, Time elapsed: 0.071 s <<< FAILURE! -- in net.sf.okapi.lib.omegat.XMLFilterTest
  133. [ERROR] net.sf.okapi.lib.omegat.XMLFilterTest.testXmlFilterGotUnwantedTag -- Time elapsed: 0.069 s <<< FAILURE!
  134. org.junit.ComparisonFailure:
  135. expected:<... <text>[&lt;g1&gt;Popatrz na Etap 4.&lt;/g1&gt;</text>
  136. </label>
  137. </item>
  138. </items>
  139. </file>
  140. ]> but was:<... <text>[<g1>Popatrz na Etap 4.</g1></text>
  141. </label>
  142. </item>
  143. </items>
  144. </file>]>
  145. at org.junit.Assert.assertEquals(Assert.java:117)
  146. at org.junit.Assert.assertEquals(Assert.java:146)
  147. at net.sf.okapi.lib.omegat.XMLFilterTest.testXmlFilterGotUnwantedTag(XMLFilterTest.java:48)
  148. at java.base/jdk.internal.reflect.NativeMethodAccessorImpl.invoke0(Native Method)
  149. at java.base/jdk.internal.reflect.NativeMethodAccessorImpl.invoke(NativeMethodAccessorImpl.java:62)
  150. at java.base/jdk.internal.reflect.DelegatingMethodAccessorImpl.invoke(DelegatingMethodAccessorImpl.java:43)
  151. at java.base/java.lang.reflect.Method.invoke(Method.java:566)
  152. at org.junit.runners.model.FrameworkMethod$1.runReflectiveCall(FrameworkMethod.java:59)
  153. at org.junit.internal.runners.model.ReflectiveCallable.run(ReflectiveCallable.java:12)
  154. at org.junit.runners.model.FrameworkMethod.invokeExplosively(FrameworkMethod.java:56)
  155. at org.junit.internal.runners.statements.InvokeMethod.evaluate(InvokeMethod.java:17)
  156. at org.junit.internal.runners.statements.RunBefores.evaluate(RunBefores.java:26)
  157. at org.junit.runners.ParentRunner$3.evaluate(ParentRunner.java:306)
  158. at org.junit.runners.BlockJUnit4ClassRunner$1.evaluate(BlockJUnit4ClassRunner.java:100)
  159. at org.junit.runners.ParentRunner.runLeaf(ParentRunner.java:366)
  160. at org.junit.runners.BlockJUnit4ClassRunner.runChild(BlockJUnit4ClassRunner.java:103)
  161. at org.junit.runners.BlockJUnit4ClassRunner.runChild(BlockJUnit4ClassRunner.java:63)
  162. at org.junit.runners.ParentRunner$4.run(ParentRunner.java:331)
  163. at org.junit.runners.ParentRunner$1.schedule(ParentRunner.java:79)
  164. at org.junit.runners.ParentRunner.runChildren(ParentRunner.java:329)
  165. at org.junit.runners.ParentRunner.access$100(ParentRunner.java:66)
  166. at org.junit.runners.ParentRunner$2.evaluate(ParentRunner.java:293)
  167. at org.junit.runners.ParentRunner$3.evaluate(ParentRunner.java:306)
  168. at org.junit.runners.ParentRunner.run(ParentRunner.java:413)
  169. at org.junit.runners.Suite.runChild(Suite.java:128)
  170. at org.junit.runners.Suite.runChild(Suite.java:27)
  171. at org.junit.runners.ParentRunner$4.run(ParentRunner.java:331)
  172. at org.junit.runners.ParentRunner$1.schedule(ParentRunner.java:79)
  173. at org.junit.runners.ParentRunner.runChildren(ParentRunner.java:329)
  174. at org.junit.runners.ParentRunner.access$100(ParentRunner.java:66)
  175. at org.junit.runners.ParentRunner$2.evaluate(ParentRunner.java:293)
  176. at org.junit.runners.ParentRunner$3.evaluate(ParentRunner.java:306)
  177. at org.junit.runners.ParentRunner.run(ParentRunner.java:413)
  178. at org.apache.maven.surefire.junitcore.JUnitCore.run(JUnitCore.java:49)
  179. at org.apache.maven.surefire.junitcore.JUnitCoreWrapper.createRequestAndRun(JUnitCoreWrapper.java:120)
  180. at org.apache.maven.surefire.junitcore.JUnitCoreWrapper.executeEager(JUnitCoreWrapper.java:95)
  181. at org.apache.maven.surefire.junitcore.JUnitCoreWrapper.execute(JUnitCoreWrapper.java:75)
  182. at org.apache.maven.surefire.junitcore.JUnitCoreWrapper.execute(JUnitCoreWrapper.java:69)
  183. at org.apache.maven.surefire.junitcore.JUnitCoreProvider.invoke(JUnitCoreProvider.java:146)
  184. at org.apache.maven.surefire.booter.ForkedBooter.runSuitesInProcess(ForkedBooter.java:385)
  185. at org.apache.maven.surefire.booter.ForkedBooter.execute(ForkedBooter.java:162)
  186. at org.apache.maven.surefire.booter.ForkedBooter.run(ForkedBooter.java:507)
  187. at org.apache.maven.surefire.booter.ForkedBooter.main(ForkedBooter.java:495)
  188.  
  189. [INFO]
  190. [INFO] Results:
  191. [INFO]
  192. [ERROR] Failures:
  193. [ERROR] XMLFilterTest.testXmlFilterGotUnwantedTag:48 expected:<... <text>[&lt;g1&gt;Popatrz na Etap 4.&lt;/g1&gt;</text>
  194. </label>
  195. </item>
  196. </items>
  197. </file>
  198. ]> but was:<... <text>[<g1>Popatrz na Etap 4.</g1></text>
  199. </label>
  200. </item>
  201. </items>
  202. </file>]>
  203. [INFO]
  204. [ERROR] Tests run: 27, Failures: 1, Errors: 0, Skipped: 0
  205. [INFO]
  206. [INFO] ------------------------------------------------------------------------
  207. [INFO] BUILD FAILURE
  208. [INFO] ------------------------------------------------------------------------
  209. [INFO] Total time: 6.860 s
  210. [INFO] Finished at: 2024-04-29T17:56:28+02:00
  211. [INFO] ------------------------------------------------------------------------
  212. [ERROR] Failed to execute goal org.apache.maven.plugins:maven-surefire-plugin:3.2.3:test (default-test) on project okapi-lib-omegat: There are test failures.
  213. [ERROR]
  214. [ERROR] Please refer to /home/souto/Repos/okapiframework/omegat-plugin/filters/target/surefire-reports for the individual test results.
  215. [ERROR] Please refer to dump files (if any exist) [date].dump, [date]-jvmRun[N].dump and [date].dumpstream.
  216. [ERROR] -> [Help 1]
  217. [ERROR]
  218. [ERROR] To see the full stack trace of the errors, re-run Maven with the -e switch.
  219. [ERROR] Re-run Maven using the -X switch to enable full debug logging.
  220. [ERROR]
  221. [ERROR] For more information about the errors and possible solutions, please read the following articles:
  222. [ERROR] [Help 1] http://cwiki.apache.org/confluence/display/MAVEN/MojoFailureException
  223.  
  224.  
Advertisement
Add Comment
Please, Sign In to add comment