daily pastebin goal
22%
SHARE
TWEET

Untitled

a guest Apr 16th, 2018 51 Never
Not a member of Pastebin yet? Sign Up, it unlocks many cool features!
  1. In file included from char.cpp:25:
  2. shop_manager.h:40:7: warning: no newline at end of file
  3. In file included from char.cpp:62:
  4. PetSystem.h:163:31: warning: no newline at end of file
  5. char.cpp:7292: warning: this decimal constant is unsigned only in ISO C90
  6. char.cpp:7885:7: warning: no newline at end of file
  7. In file included from char_battle.cpp:27:
  8. shop_manager.h:40:7: warning: no newline at end of file
  9. In file included from PetSystem.cpp:8:
  10. PetSystem.h:163:31: warning: no newline at end of file
  11. PetSystem.cpp:637:2: warning: no newline at end of file
  12. char.cpp: In member function 'void CHARACTER::PointChange(BYTE, int, bool, bool)':
  13. char.cpp:3110: warning: comparison between signed and unsigned integer expressions
  14. char.cpp: In member function 'void CHARACTER::RefineSashMaterials()':
  15. char.cpp:7746: warning: comparison between signed and unsigned integer expressions
  16. constants.cpp:291: warning: this decimal constant is unsigned only in ISO C90
  17. constants.cpp:292: warning: this decimal constant is unsigned only in ISO C90
  18. constants.cpp:293: warning: this decimal constant is unsigned only in ISO C90
  19. constants.cpp:294: warning: this decimal constant is unsigned only in ISO C90
  20. constants.cpp:295: warning: this decimal constant is unsigned only in ISO C90
  21. constants.cpp:296: warning: this decimal constant is unsigned only in ISO C90
  22. constants.cpp:297: warning: this decimal constant is unsigned only in ISO C90
  23. constants.cpp:298: warning: this decimal constant is unsigned only in ISO C90
  24. constants.cpp:299: warning: this decimal constant is unsigned only in ISO C90
  25. constants.cpp:300: warning: this decimal constant is unsigned only in ISO C90
  26. constants.cpp:301: warning: this decimal constant is unsigned only in ISO C90
  27. constants.cpp:302: warning: this decimal constant is unsigned only in ISO C90
  28. constants.cpp:303: warning: this decimal constant is unsigned only in ISO C90
  29. constants.cpp:304: warning: this decimal constant is unsigned only in ISO C90
  30. constants.cpp:305: warning: this decimal constant is unsigned only in ISO C90
  31. constants.cpp:306: warning: this decimal constant is unsigned only in ISO C90
  32. constants.cpp:307: warning: this decimal constant is unsigned only in ISO C90
  33. constants.cpp:308: warning: this decimal constant is unsigned only in ISO C90
  34. constants.cpp:309: warning: this decimal constant is unsigned only in ISO C90
  35. constants.cpp:310: warning: this decimal constant is unsigned only in ISO C90
  36. constants.cpp:311: warning: this decimal constant is unsigned only in ISO C90
  37. PetSystem.cpp: In member function 'virtual bool CPetActor::_UpdateFollowAI()':
  38. PetSystem.cpp:246: warning: unused variable 'bDoMoveAlone'
  39. PetSystem.cpp: In member function 'CPetActor* CPetSystem::Summon(DWORD, CItem*, const char*, bool, DWORD)':
  40. PetSystem.cpp:552: warning: unused variable 'petVID'
  41. In file included from desc_manager.cpp:15:
  42. ClientPackageCryptInfo.h:117:41: warning: no newline at end of file
  43. In file included from char_item.cpp:47:
  44. belt_inventory_helper.h: In static member function 'static BYTE CBeltInventoryHelper::GetBeltGradeByRefineLevel(int)':
  45. belt_inventory_helper.h:28: warning: comparison between signed and unsigned integer expressions
  46. char_item.cpp: In member function 'bool CHARACTER::IsEmptyItemGrid(TItemPos, BYTE, int) const':
  47. char_item.cpp:644: warning: comparison is always false due to limited range of data type
  48. char_item.cpp:670: warning: comparison is always false due to limited range of data type
  49. char_item.cpp: In member function 'bool CHARACTER::UseItemEx(CItem*, TItemPos)':
  50. char_item.cpp:2407: warning: format '%d' expects type 'int', but argument 6 has type 'long int'
  51. char_item.cpp:2411: warning: format '%d' expects type 'int', but argument 6 has type 'long int'
  52. char_item.cpp:2423: warning: format '%d' expects type 'int', but argument 5 has type 'long int'
  53. char_item.cpp:2427: warning: format '%d' expects type 'int', but argument 5 has type 'long int'
  54. char_item.cpp:2454: warning: format '%d' expects type 'int', but argument 6 has type 'long int'
  55. char_item.cpp:2462: warning: format '%d' expects type 'int', but argument 5 has type 'long int'
  56. char_item.cpp:5117: warning: comparison between signed and unsigned integer expressions
  57. char_item.cpp: In member function 'bool CHARACTER::UseItem(TItemPos, TItemPos)':
  58. char_item.cpp:5193: warning: unused variable 'wDestCell'
  59. char_item.cpp:5194: warning: unused variable 'bDestInven'
  60. char_item.cpp: In member function 'bool CHARACTER::EquipItem(CItem*, int)':
  61. char_item.cpp:6194: warning: array subscript has type 'char'
  62. char_item.cpp: In member function 'void CHARACTER::BuffOnAttr_AddBuffsFromItem(CItem*)':
  63. char_item.cpp:6262: warning: comparison between signed and unsigned integer expressions
  64. char_item.cpp: In member function 'void CHARACTER::BuffOnAttr_RemoveBuffsFromItem(CItem*)':
  65. char_item.cpp:6274: warning: comparison between signed and unsigned integer expressions
  66. char_item.cpp: In member function 'bool CHARACTER::CanEquipNow(CItem*, const TItemPos&, const TItemPos&)':
  67. char_item.cpp:7460: warning: unused variable 'itemType'
  68. char_item.cpp:7461: warning: unused variable 'itemSubType'
  69. In file included from config.cpp:22:
  70. check_server.h: In static member function 'static bool CheckServer::CheckIp(const char*)':
  71. check_server.h:24: warning: comparison between signed and unsigned integer expressions
  72. config.cpp: In function 'void config_init(const std::string&)':
  73. config.cpp:435: warning: NULL used in arithmetic
  74. config.cpp:459: warning: NULL used in arithmetic
  75. config.cpp:483: warning: NULL used in arithmetic
  76. config.cpp:505: warning: unused variable 'line'
  77. cube.cpp: In function 'bool Cube_make(CHARACTER*)':
  78. cube.cpp:544: warning: comparison between signed and unsigned integer expressions
  79. cube.cpp: In function 'void Cube_MakeCubeInformationText()':
  80. cube.cpp:716: warning: unused variable 'npcVNUM'
  81. cube.cpp: In function 'bool Cube_InformationInitialize()':
  82. cube.cpp:783: warning: comparison between signed and unsigned integer expressions
  83. char_state.cpp: In member function 'virtual void CHARACTER::StateMove()':
  84. char_state.cpp:901: warning: unused variable 'rider'
  85. char_item.cpp: In member function 'bool CHARACTER::IsEmptyItemGrid(TItemPos, BYTE, int) const':
  86. char_item.cpp:683: warning: control reaches end of non-void function
  87. cmd_gm.cpp: In function 'void do_set_stat(CHARACTER*, const char*, int, int)':
  88. cmd_gm.cpp:3935: warning: NULL used in arithmetic
  89. desc_client.cpp: In member function 'void CLIENT_DESC::UpdateChannelStatus(DWORD, bool)':
  90. desc_client.cpp:301: warning: comparison between signed and unsigned integer expressions
  91. char_item.cpp: In member function 'void CHARACTER::BuffOnAttr_ValueChange(BYTE, BYTE, BYTE)':
  92. char_item.cpp:6309: warning: 'pBuff' may be used uninitialized in this function
  93. cmd_gm.cpp: In function 'void do_use_item(CHARACTER*, const char*, int, int)':
  94. cmd_gm.cpp:4357: warning: 'cell' may be used uninitialized in this function
  95. cmd_gm.cpp: In function 'void do_set_stat(CHARACTER*, const char*, int, int)':
  96. cmd_gm.cpp:3977: warning: 'n' may be used uninitialized in this function
  97. cmd_gm.cpp: In function 'void do_mob_ld(CHARACTER*, const char*, int, int)':
  98. cmd_gm.cpp:855: warning: 'x' may be used uninitialized in this function
  99. cmd_gm.cpp:855: warning: 'y' may be used uninitialized in this function
  100. In file included from input_db.cpp:13:
  101. shop_manager.h:40:7: warning: no newline at end of file
  102. input_db.cpp:2722:2: warning: no newline at end of file
  103. In file included from input_main.cpp:16:
  104. shop_manager.h:40:7: warning: no newline at end of file
  105. input_auth.cpp: In member function 'int CInputAuth::auth_OpenID(const char*, const char*, char*)':
  106. input_auth.cpp:467: warning: unused variable 'last'
  107. item.cpp:2242:2: warning: no newline at end of file
  108. In file included from item.cpp:22:
  109. belt_inventory_helper.h: In static member function 'static BYTE CBeltInventoryHelper::GetBeltGradeByRefineLevel(int)':
  110. belt_inventory_helper.h:28: warning: comparison between signed and unsigned integer expressions
  111. item.h: In constructor 'CItem::CItem(DWORD)':
  112. item.h:286: warning: 'CItem::m_pkRealTimeExpireEvent' will be initialized after
  113. item.h:283: warning:   'LPEVENT CItem::m_pkExpireEvent'
  114. item.cpp:25: warning:   when initialized here
  115. item.cpp: In member function 'void CItem::ModifyPoints(bool)':
  116. item.cpp:912: error: expected primary-expression before 'else'
  117. item.cpp:912: error: expected `;' before 'else'
  118. item.cpp: In function 'const bool CanPutIntoRing(CItem*, CItem*)':
  119. item.cpp:1883: warning: unused variable 'vnum'
  120. item.cpp: In member function 'bool CItem::CanPutInto(CItem*)':
  121. item.cpp:1916: warning: comparison between signed and unsigned integer expressions
  122. item.cpp: In member function 'int CItem::GiveMoreTime_Per(float)':
  123. item.cpp:2172: warning: comparison between signed and unsigned integer expressions
  124. item.cpp:2174: warning: comparison between signed and unsigned integer expressions
  125. item.cpp: In member function 'int CItem::GiveMoreTime_Fix(DWORD)':
  126. item.cpp:2196: warning: comparison between signed and unsigned integer expressions
  127. item.cpp: In member function 'int CItem::GetDuration()':
  128. item.cpp:2227: warning: array subscript has type 'char'
  129. gmake: *** [OBJDIR/item.o] Bł±d 1
  130. gmake: *** Oczekiwanie na niezakończone zadania....
  131. input_main.cpp:3067: error: redefinition of 'void CInputMain::Sash(CHARACTER*, const char*)'
  132. input_main.cpp:54: error: 'void CInputMain::Sash(CHARACTER*, const char*)' previously defined here
  133. input_main.cpp: In member function 'virtual int CInputMain::Analyze(DESC*, BYTE, const char*)':
  134. input_main.cpp:3393: error: 'TargetInfoLoad' was not declared in this scope
  135. item_manager.cpp: In member function 'TItemTable* ITEM_MANAGER::GetTable(DWORD)':
  136. item_manager.cpp:604: warning: comparison between signed and unsigned integer expressions
  137. gmake: *** [OBJDIR/input_main.o] Bł±d 1
  138. log.cpp:352:7: warning: no newline at end of file
RAW Paste Data
Top