Guest User

Untitled

a guest
Oct 2nd, 2019
133
Never
Not a member of Pastebin yet? Sign Up, it unlocks many cool features!
  1. make O=../KERNEL_OUT -C kernel-3.18 ARCH=arm64 CROSS_COMPILE=../aarch64-linux-android-4.9/bin/aarch64-linux-android- -j16
  2. make: Entering directory '/home/kenny/kernel-3.18'
  3. make[1]: Entering directory '/home/kenny/KERNEL_OUT'
  4. CHK include/config/kernel.release
  5. GEN ./Makefile
  6. CHK include/generated/uapi/linux/version.h
  7. Using /home/kenny/kernel-3.18 as source for kernel
  8. CHK include/generated/utsrelease.h
  9. CALL /home/kenny/kernel-3.18/scripts/checksyscalls.sh
  10. make[2]: Nothing to be done for 'dtbs'.
  11. CHK include/generated/compile.h
  12. /home/kenny/kernel-3.18/kernel/Makefile:140: *** No X.509 certificates found ***
  13. LD drivers/hsi/clients/built-in.o
  14. LD drivers/hsi/controllers/built-in.o
  15. LD drivers/hsi/built-in.o
  16. CC drivers/i2c/i2c-boardinfo.o
  17. CC drivers/i2c/i2c-core.o
  18. LD drivers/i2c/algos/built-in.o
  19. CC [M] drivers/i2c/algos/i2c-algo-bit.o
  20. CC [M] drivers/gpu/drm/udl/udl_modeset.o
  21. CC [M] drivers/gpu/drm/udl/udl_connector.o
  22. CC drivers/hid/hid-debug.o
  23. CHK kernel/config_data.h
  24. LD drivers/gpu/vga/built-in.o
  25. CC drivers/i2c/busses/i2c-mtk.o
  26. /home/kenny/kernel-3.18/drivers/gpu/drm/udl/udl_modeset.c: In function 'udl_crtc_init':
  27. /home/kenny/kernel-3.18/drivers/gpu/drm/udl/udl_modeset.c:418:2: error: implicit declaration of function 'drm_crtc_init' [-Werror=implicit-function-declaration]
  28. drm_crtc_init(dev, crtc, &udl_crtc_funcs);
  29. ^
  30. CC drivers/hid/hid-core.o
  31. CC [M] drivers/i2c/algos/i2c-algo-pca.o
  32. cc1: all warnings being treated as errors
  33. /home/kenny/kernel-3.18/scripts/Makefile.build:257: recipe for target 'drivers/gpu/drm/udl/udl_modeset.o' failed
  34. make[5]: *** [drivers/gpu/drm/udl/udl_modeset.o] Error 1
  35. make[5]: *** Waiting for unfinished jobs....
  36. /home/kenny/kernel-3.18/scripts/Makefile.build:402: recipe for target 'drivers/gpu/drm/udl' failed
  37. make[4]: *** [drivers/gpu/drm/udl] Error 2
  38. /home/kenny/kernel-3.18/scripts/Makefile.build:402: recipe for target 'drivers/gpu/drm' failed
  39. make[3]: *** [drivers/gpu/drm] Error 2
  40. /home/kenny/kernel-3.18/scripts/Makefile.build:402: recipe for target 'drivers/gpu' failed
  41. make[2]: *** [drivers/gpu] Error 2
  42. make[2]: *** Waiting for unfinished jobs....
  43. LD drivers/i2c/muxes/built-in.o
  44. CC [M] drivers/i2c/i2c-smbus.o
  45. CC drivers/hid/hid-input.o
  46. CC [M] drivers/i2c/i2c-dev.o
  47. CC drivers/hid/hidraw.o
  48. CC [M] drivers/i2c/i2c-mux.o
  49. CC drivers/hid/uhid.o
  50. CC drivers/i2c/busses/i2c_mtk_debug.o
  51. CC [M] drivers/i2c/busses/i2c-cbus-gpio.o
  52. CC [M] drivers/i2c/busses/i2c-designware-core.o
  53. CC [M] drivers/i2c/busses/i2c-designware-platdrv.o
  54. CC drivers/hid/hid-generic.o
  55. CC [M] drivers/i2c/busses/i2c-gpio.o
  56. CC [M] drivers/i2c/busses/i2c-nomadik.o
  57. CC [M] drivers/i2c/busses/i2c-ocores.o
  58. CC [M] drivers/i2c/busses/i2c-pca-platform.o
  59. CC [M] drivers/i2c/busses/i2c-rk3x.o
  60. CC [M] drivers/i2c/busses/i2c-simtec.o
  61. CC drivers/hid/usbhid/hid-core.o
  62. CC drivers/hid/usbhid/hid-quirks.o
  63. CC [M] drivers/hid/hid-a4tech.o
  64. CC drivers/hid/usbhid/hiddev.o
  65. CC [M] drivers/hid/hid-axff.o
  66. CC drivers/hid/usbhid/hid-pidff.o
  67. CC [M] drivers/i2c/busses/i2c-xiic.o
  68. CC [M] drivers/i2c/busses/i2c-diolan-u2c.o
  69. CC [M] drivers/hid/hid-apple.o
  70. CC [M] drivers/i2c/busses/i2c-parport-light.o
  71. CC [M] drivers/hid/hid-appleir.o
  72. CC [M] drivers/i2c/busses/i2c-robotfuzz-osif.o
  73. CC [M] drivers/hid/hid-aureal.o
  74. CC [M] drivers/i2c/busses/i2c-taos-evm.o
  75. CC [M] drivers/i2c/busses/i2c-tiny-usb.o
  76. CC [M] drivers/hid/hid-belkin.o
  77. CC [M] drivers/hid/hid-cherry.o
  78. CC [M] drivers/hid/hid-chicony.o
  79. CC [M] drivers/hid/hid-cp2112.o
  80. LD drivers/i2c/busses/built-in.o
  81. LD [M] drivers/i2c/busses/i2c-designware-platform.o
  82. CC [M] drivers/hid/hid-cypress.o
  83. CC [M] drivers/hid/hid-dr.o
  84. CC [M] drivers/hid/hid-emsff.o
  85. CC [M] drivers/hid/hid-elo.o
  86. CC [M] drivers/hid/hid-elecom.o
  87. CC [M] drivers/hid/hid-ezkey.o
  88. CC [M] drivers/hid/hid-gyration.o
  89. CC [M] drivers/hid/hid-gt683r.o
  90. CC [M] drivers/hid/hid-holtek-kbd.o
  91. LD drivers/i2c/built-in.o
  92. CC [M] drivers/hid/hid-holtek-mouse.o
  93. CC [M] drivers/hid/hid-holtekff.o
  94. CC [M] drivers/hid/hid-huion.o
  95. LD drivers/hid/usbhid/usbhid.o
  96. LD drivers/hid/usbhid/built-in.o
  97. CC [M] drivers/hid/hid-icade.o
  98. CC [M] drivers/hid/hid-keytouch.o
  99. CC [M] drivers/hid/hid-kensington.o
  100. CC [M] drivers/hid/hid-kye.o
  101. CC [M] drivers/hid/hid-lcpower.o
  102. CC [M] drivers/hid/hid-lenovo.o
  103. CC [M] drivers/hid/hid-lg.o
  104. CC [M] drivers/hid/hid-lgff.o
  105. CC [M] drivers/hid/hid-lg2ff.o
  106. CC [M] drivers/hid/hid-lg3ff.o
  107. CC [M] drivers/hid/hid-lg4ff.o
  108. CC [M] drivers/hid/hid-logitech-dj.o
  109. CC [M] drivers/hid/hid-logitech-hidpp.o
  110. CC [M] drivers/hid/hid-magicmouse.o
  111. CC [M] drivers/hid/hid-microsoft.o
  112. CC [M] drivers/hid/hid-monterey.o
  113. CC [M] drivers/hid/hid-multitouch.o
  114. CC [M] drivers/hid/hid-ntrig.o
  115. CC [M] drivers/hid/hid-ortek.o
  116. CC [M] drivers/hid/hid-prodikeys.o
  117. /home/kenny/kernel-3.18/drivers/hid/hid-logitech-hidpp.c:838:2: warning: initialization from incompatible pointer type
  118. .input_configured = hidpp_input_configured,
  119. ^
  120. /home/kenny/kernel-3.18/drivers/hid/hid-logitech-hidpp.c:838:2: warning: (near initialization for 'hidpp_driver.input_configured')
  121. CC [M] drivers/hid/hid-pl.o
  122. CC [M] drivers/hid/hid-penmount.o
  123. CC [M] drivers/hid/hid-petalynx.o
  124. CC [M] drivers/hid/hid-picolcd_core.o
  125. CC [M] drivers/hid/hid-picolcd_fb.o
  126. CC [M] drivers/hid/hid-picolcd_backlight.o
  127. CC [M] drivers/hid/hid-picolcd_lcd.o
  128. CC [M] drivers/hid/hid-picolcd_leds.o
  129. CC [M] drivers/hid/hid-picolcd_cir.o
  130. CC [M] drivers/hid/hid-picolcd_debugfs.o
  131. CC [M] drivers/hid/hid-primax.o
  132. CC [M] drivers/hid/hid-roccat.o
  133. CC [M] drivers/hid/hid-roccat-common.o
  134. CC [M] drivers/hid/hid-roccat-arvo.o
  135. CC [M] drivers/hid/hid-roccat-isku.o
  136. CC [M] drivers/hid/hid-roccat-kone.o
  137. CC [M] drivers/hid/hid-roccat-koneplus.o
  138. CC [M] drivers/hid/hid-roccat-konepure.o
  139. CC [M] drivers/hid/hid-roccat-kovaplus.o
  140. CC [M] drivers/hid/hid-roccat-lua.o
  141. CC [M] drivers/hid/hid-roccat-pyra.o
  142. CC [M] drivers/hid/hid-roccat-ryos.o
  143. CC [M] drivers/hid/hid-roccat-savu.o
  144. CC [M] drivers/hid/hid-rmi.o
  145. CC [M] drivers/hid/hid-saitek.o
  146. CC [M] drivers/hid/hid-samsung.o
  147. CC [M] drivers/hid/hid-sjoy.o
  148. CC [M] drivers/hid/hid-sony.o
  149. CC [M] drivers/hid/hid-speedlink.o
  150. CC [M] drivers/hid/hid-steelseries.o
  151. CC [M] drivers/hid/hid-sunplus.o
  152. CC [M] drivers/hid/hid-gaff.o
  153. CC [M] drivers/hid/hid-thingm.o
  154. CC [M] drivers/hid/hid-tmff.o
  155. CC [M] drivers/hid/hid-tivo.o
  156. CC [M] drivers/hid/hid-topseed.o
  157. CC [M] drivers/hid/hid-twinhan.o
  158. CC [M] drivers/hid/hid-uclogic.o
  159. CC [M] drivers/hid/hid-xinmo.o
  160. CC [M] drivers/hid/hid-zpff.o
  161. CC [M] drivers/hid/hid-zydacron.o
  162. CC [M] drivers/hid/wacom_wac.o
  163. CC [M] drivers/hid/wacom_sys.o
  164. CC [M] drivers/hid/hid-waltop.o
  165. CC [M] drivers/hid/hid-wiimote-core.o
  166. CC [M] drivers/hid/hid-wiimote-modules.o
  167. CC [M] drivers/hid/hid-wiimote-debug.o
  168. CC [M] drivers/hid/hid-sensor-hub.o
  169. LD drivers/hid/hid.o
  170. LD [M] drivers/hid/hid-logitech.o
  171. LD [M] drivers/hid/hid-picolcd.o
  172. LD drivers/hid/built-in.o
  173. LD [M] drivers/hid/wacom.o
  174. LD [M] drivers/hid/hid-wiimote.o
  175. /home/kenny/kernel-3.18/Makefile:939: recipe for target 'drivers' failed
  176. make[1]: *** [drivers] Error 2
  177. make[1]: Leaving directory '/home/kenny/KERNEL_OUT'
  178. Makefile:145: recipe for target 'sub-make' failed
  179. make: *** [sub-make] Error 2
  180. make: Leaving directory '/home/kenny/kernel-3.18'
RAW Paste Data