JoeBiden414

Could not compile properly

Jun 18th, 2023
150
0
Never
Not a member of Pastebin yet? Sign Up, it unlocks many cool features!
text 9.64 KB | None | 0 0
  1. Executing Gradle task: runClient
  2. Build info: MCreator 2023.2.24119, forge-1.19.4, 64-bit, 8133 MB, Windows 10, JVM 17.0.5, JAVA_HOME: C:\Program Files\Pylo\MCreator\jdk, started on: 2023-06-18-18:00:46
  3.  
  4. > Configure project :
  5. The code of this workspace uses official obfuscation mappings provided by Mojang. These mappings fall under their associated license you should be fully aware of.
  6. (c) 2020 Microsoft Corporation. These mappings are provided "as-is" and you bear the risk of using them. You may copy and use the mappings for development purposes,
  7. but you may not redistribute the mappings complete and unmodified. Microsoft makes no warranties, express or implied, with respect to the mappings provided here.
  8. Use and modification of this document or the source code (in any form) of Minecraft: Java Edition is governed by the Minecraft End User License Agreement available
  9. at https://account.mojang.com/documents/minecraft_eula.
  10.  
  11. > Task :compileJava
  12. error: error reading C:\Users\Stefa\.mcreator\gradle\caches\forge_gradle\minecraft_user_repo\net\minecraftforge\forge\1.19.4-45.1.0_mapped_official_1.19.4\forge-1.19.4-45.1.0_mapped_official_1.19.4-recomp.jar; zip END header not found
  13. C:\Users\Stefa\MCreatorWorkspaces\lucky_block_mod\src\main\java\net\mcreator\luckyblockmod\block\ComputerBlock.java:2: error: cannot access net.mcreator.luckyblockmod.block package net.mcreator.luckyblockmod.block;
  14. ^
  15. ZipException opening "forge-1.19.4-45.1.0_mapped_official_1.19.4-recomp.jar": zip END header not found
  16. C:\Users\Stefa\MCreatorWorkspaces\lucky_block_mod\src\main\java\net\mcreator\luckyblockmod\init\LuckyBlockModModBlocks.java:5: error: cannot access net.mcreator.luckyblockmod.init package net.mcreator.luckyblockmod.init;
  17. ^
  18. ZipException opening "forge-1.19.4-45.1.0_mapped_official_1.19.4-recomp.jar": zip END header not found
  19. C:\Users\Stefa\MCreatorWorkspaces\lucky_block_mod\src\main\java\net\mcreator\luckyblockmod\LuckyBlockModMod.java:14: error: cannot access net.mcreator.luckyblockmod package net.mcreator.luckyblockmod;
  20. ^
  21. ZipException opening "forge-1.19.4-45.1.0_mapped_official_1.19.4-recomp.jar": zip END header not found
  22. C:\Users\Stefa\MCreatorWorkspaces\lucky_block_mod\src\main\java\net\mcreator\luckyblockmod\init\LuckyBlockModModItems.java:11: error: cannot access net.mcreator public class LuckyBlockModModItems {
  23. ^
  24. ZipException opening "forge-1.19.4-45.1.0_mapped_official_1.19.4-recomp.jar": zip END header not found
  25. C:\Users\Stefa\MCreatorWorkspaces\lucky_block_mod\src\main\java\net\mcreator\luckyblockmod\init\LuckyBlockModModItems.java:12: error: cannot find symbol public static final DeferredRegister<Item> REGISTRY = DeferredRegister.create(ForgeRegistries.ITEMS, LuckyBlockModMod.MODID);
  26. ^
  27. symbol: class DeferredRegister
  28. location: class LuckyBlockModModItems
  29. C:\Users\Stefa\MCreatorWorkspaces\lucky_block_mod\src\main\java\net\mcreator\luckyblockmod\init\LuckyBlockModModItems.java:12: error: cannot find symbol public static final DeferredRegister<Item> REGISTRY = DeferredRegister.create(ForgeRegistries.ITEMS, LuckyBlockModMod.MODID);
  30. ^
  31. symbol: class Item
  32. location: class LuckyBlockModModItems
  33. C:\Users\Stefa\MCreatorWorkspaces\lucky_block_mod\src\main\java\net\mcreator\luckyblockmod\init\LuckyBlockModModItems.java:13: error: cannot find symbol public static final RegistryObject<Item> COMPUTER = block(LuckyBlockModModBlocks.COMPUTER);
  34. ^
  35. symbol: class RegistryObject
  36. location: class LuckyBlockModModItems
  37. C:\Users\Stefa\MCreatorWorkspaces\lucky_block_mod\src\main\java\net\mcreator\luckyblockmod\init\LuckyBlockModModItems.java:13: error: cannot find symbol public static final RegistryObject<Item> COMPUTER = block(LuckyBlockModModBlocks.COMPUTER);
  38. ^
  39. symbol: class Item
  40. location: class LuckyBlockModModItems
  41. C:\Users\Stefa\MCreatorWorkspaces\lucky_block_mod\src\main\java\net\mcreator\luckyblockmod\init\LuckyBlockModModItems.java:15: error: cannot find symbol private static RegistryObject<Item> block(RegistryObject<Block> block) {
  42. ^
  43. symbol: class RegistryObject
  44. location: class LuckyBlockModModItems
  45. C:\Users\Stefa\MCreatorWorkspaces\lucky_block_mod\src\main\java\net\mcreator\luckyblockmod\init\LuckyBlockModModItems.java:15: error: cannot find symbol private static RegistryObject<Item> block(RegistryObject<Block> block) {
  46. ^
  47. symbol: class Block
  48. location: class LuckyBlockModModItems
  49. C:\Users\Stefa\MCreatorWorkspaces\lucky_block_mod\src\main\java\net\mcreator\luckyblockmod\init\LuckyBlockModModItems.java:15: error: cannot find symbol private static RegistryObject<Item> block(RegistryObject<Block> block) {
  50. ^
  51. symbol: class RegistryObject
  52. location: class LuckyBlockModModItems
  53. C:\Users\Stefa\MCreatorWorkspaces\lucky_block_mod\src\main\java\net\mcreator\luckyblockmod\init\LuckyBlockModModItems.java:15: error: cannot find symbol private static RegistryObject<Item> block(RegistryObject<Block> block) {
  54. ^
  55. symbol: class Item
  56. location: class LuckyBlockModModItems
  57. C:\Users\Stefa\MCreatorWorkspaces\lucky_block_mod\src\main\java\net\mcreator\luckyblockmod\init\LuckyBlockModModPaintings.java:9: error: cannot access net public class LuckyBlockModModPaintings {
  58. ^
  59. ZipException opening "forge-1.19.4-45.1.0_mapped_official_1.19.4-recomp.jar": zip END header not found
  60. C:\Users\Stefa\MCreatorWorkspaces\lucky_block_mod\src\main\java\net\mcreator\luckyblockmod\init\LuckyBlockModModPaintings.java:10: error: cannot find symbol public static final DeferredRegister<PaintingVariant> REGISTRY = DeferredRegister.create(ForgeRegistries.PAINTING_VARIANTS, LuckyBlockModMod.MODID);
  61. ^
  62. symbol: class DeferredRegister
  63. location: class LuckyBlockModModPaintings
  64. C:\Users\Stefa\MCreatorWorkspaces\lucky_block_mod\src\main\java\net\mcreator\luckyblockmod\init\LuckyBlockModModPaintings.java:10: error: cannot find symbol public static final DeferredRegister<PaintingVariant> REGISTRY = DeferredRegister.create(ForgeRegistries.PAINTING_VARIANTS, LuckyBlockModMod.MODID);
  65. ^
  66. symbol: class PaintingVariant
  67. location: class LuckyBlockModModPaintings
  68. C:\Users\Stefa\MCreatorWorkspaces\lucky_block_mod\src\main\java\net\mcreator\luckyblockmod\init\LuckyBlockModModPaintings.java:11: error: cannot find symbol public static final RegistryObject<PaintingVariant> TWOFORT = REGISTRY.register("twofort", () -> new PaintingVariant(32, 16));
  69. ^
  70. symbol: class RegistryObject
  71. location: class LuckyBlockModModPaintings
  72. C:\Users\Stefa\MCreatorWorkspaces\lucky_block_mod\src\main\java\net\mcreator\luckyblockmod\init\LuckyBlockModModPaintings.java:11: error: cannot find symbol public static final RegistryObject<PaintingVariant> TWOFORT = REGISTRY.register("twofort", () -> new PaintingVariant(32, 16));
  73. ^
  74. symbol: class PaintingVariant
  75. location: class LuckyBlockModModPaintings
  76. C:\Users\Stefa\MCreatorWorkspaces\lucky_block_mod\src\main\java\net\mcreator\luckyblockmod\init\LuckyBlockModModTabs.java:7: error: cannot access net.minecraftforge import net.minecraftforge.fml.common.Mod;
  77. ^
  78. ZipException opening "forge-1.19.4-45.1.0_mapped_official_1.19.4-recomp.jar": zip END header not found
  79. C:\Users\Stefa\MCreatorWorkspaces\lucky_block_mod\src\main\java\net\mcreator\luckyblockmod\init\LuckyBlockModModTabs.java:7: error: cannot access net.minecraftforge.fml import net.minecraftforge.fml.common.Mod;
  80. ^
  81. ZipException opening "forge-1.19.4-45.1.0_mapped_official_1.19.4-recomp.jar": zip END header not found
  82. C:\Users\Stefa\MCreatorWorkspaces\lucky_block_mod\src\main\java\net\mcreator\luckyblockmod\init\LuckyBlockModModTabs.java:7: error: import requires canonical name for Mod import net.minecraftforge.fml.common.Mod;
  83. ^
  84. C:\Users\Stefa\MCreatorWorkspaces\lucky_block_mod\src\main\java\net\mcreator\luckyblockmod\init\LuckyBlockModModTabs.java:8: error: cannot access net.minecraftforge.eventbus import net.minecraftforge.eventbus.api.SubscribeEvent;
  85. ^
  86. ZipException opening "forge-1.19.4-45.1.0_mapped_official_1.19.4-recomp.jar": zip END header not found
  87. C:\Users\Stefa\MCreatorWorkspaces\lucky_block_mod\src\main\java\net\mcreator\luckyblockmod\init\LuckyBlockModModTabs.java:8: error: cannot access net.minecraftforge.eventbus.api import net.minecraftforge.eventbus.api.SubscribeEvent;
  88. ^
  89. ZipException opening "forge-1.19.4-45.1.0_mapped_official_1.19.4-recomp.jar": zip END header not found
  90. C:\Users\Stefa\MCreatorWorkspaces\lucky_block_mod\src\main\java\net\mcreator\luckyblockmod\init\LuckyBlockModModTabs.java:8: error: import requires canonical name for SubscribeEvent import net.minecraftforge.eventbus.api.SubscribeEvent;
  91. ^
  92. C:\Users\Stefa\MCreatorWorkspaces\lucky_block_mod\src\main\java\net\mcreator\luckyblockmod\init\LuckyBlockModModTabs.java:10: error: cannot access Mod @Mod.EventBusSubscriber(bus = Mod.EventBusSubscriber.Bus.MOD)
  93. ^
  94. ZipException opening "forge-1.19.4-45.1.0_mapped_official_1.19.4-recomp.jar": zip END header not found
  95. C:\Users\Stefa\MCreatorWorkspaces\lucky_block_mod\src\main\java\net\mcreator\luckyblockmod\init\LuckyBlockModModTabs.java:13: error: cannot access CreativeModeTabEvent public static void buildTabContentsVanilla(CreativeModeTabEvent.BuildContents tabData) {
  96. ^
  97. ZipException opening "forge-1.19.4-45.1.0_mapped_official_1.19.4-recomp.jar": zip END header not found
  98. 25 errors
  99. > Task :compileJava FAILED
  100. FAILURE: Build failed with an exception.
  101. * What went wrong:
  102. Execution failed for task ':compileJava'.
  103. > Compilation failed; see the compiler error output for details.
  104. * Try:
  105. > Run with --stacktrace option to get the stack trace.
  106. > Run with --info or --debug option to get more log output.
  107. > Run with --scan to get full insights.
  108. * Get more help at https://help.gradle.org
  109. BUILD FAILED in 6s
  110. 1 actionable task: 1 executed
  111.  
  112. BUILD FAILED
  113. Task completed in 13 seconds
Advertisement
Add Comment
Please, Sign In to add comment