10110111

Untitled

Oct 8th, 2012
108
0
Never
Not a member of Pastebin yet? Sign Up, it unlocks many cool features!
text 2.24 KB | None | 0 0
  1. [build CXX] unotools/source/ucbhelper/xtempfile.cxx
  2. [build MOD] animations
  3. [build LNK] Library/libplacewarelo.so
  4. [build LNK] Library/libpackage2.so
  5. [build RDB] CustomTarget/i18npool/localedata/saxparser.rdb
  6. [build LNK] Library/libi18nregexplo.so
  7. [build CXX] i18npool/source/search/levdis.cxx
  8. [build CXX] i18npool/source/search/textsearch.cxx
  9. [build MOD] i18nutil
  10. [build LNK] Library/fastsax.uno.so
  11. [build LNK] Library/libunoxmllo.so
  12. [build MOD] ure
  13. [build CMP] xmlscript/util/xmlscript
  14. [build CHK] basebmp
  15. [build CUT] comphelper_test
  16. [build LNK] CppunitTest/libtest_i18npool_test_breakiterator.so
  17. [build LNK] CppunitTest/libtest_i18npool_test_characterclassification.so
  18. [build LNK] CppunitTest/libtest_i18npool_test_ordinalsuffix.so
  19. [build LNK] CppunitTest/libtest_sax_cpputest.so
  20. terminate called after throwing an instance of 'com::sun::star::uno::RuntimeException'
  21. /bin/sh: line 1: 17878 Aborted (core dumped) $O/bin/uno -ro $O/xml/uno_services.rdb -ro $O/bin/udkapi.rdb -ro $W/UnoApiTarget/bridgetest.rdb -s com.sun.star.test.bridge.BridgeTest -- com.sun.star.test.bridge.CppTestObject
  22. make[2]: *** [/fastdocs/programmer/libreoffice/libo/workdir/unxlngi6.pro/CustomTarget/testtools/uno_test.done] Error 134
  23. make[2]: *** Waiting for unfinished jobs....
  24.  
  25. -----------------------------------------------------------------------
  26. Oh dear - something failed during the build - sorry !
  27. For more help with debugging build errors, please see the section in:
  28. http://wiki.documentfoundation.org/Development
  29.  
  30. internal build errors:
  31.  
  32. ERROR: error 512 occurred while making /fastdocs/programmer/libreoffice/libo/tail_build/prj
  33.  
  34. it seems that the error is inside 'tail_build', please re-run build
  35. inside this module to isolate the error and/or test your fix:
  36.  
  37. build_error.log should contain the captured output of the failed module(s)
  38.  
  39. -----------------------------------------------------------------------
  40. To rebuild a specific module:
  41.  
  42. make tail_build.clean # not recommended, this will re-build almost everything
  43. make tail_build
  44.  
  45. when the problem is isolated and fixed, re-run 'make'
  46. make[1]: *** [build-packimages] Error 1
  47. make[1]: Leaving directory `/fastdocs/programmer/libreoffice/libo'
  48. make: *** [all] Error 2
Advertisement
Add Comment
Please, Sign In to add comment