SHARE
TWEET

Untitled

a guest Dec 4th, 2014 186 Never
Not a member of Pastebin yet? Sign Up, it unlocks many cool features!
  1. 17:05:08: Running steps for project sahke...
  2. 17:05:08: Start SDK: Starting "MerSDK" virtual machine...
  3. 17:05:20: Starting: "/home/gogeta/.config/SailfishBeta1/mer-sdk-tools/MerSDK/SailfishOS-i486/qmake" /home/gogeta/Dev/SailFishOs/sahke/sahke.pro -r -spec linux-g++-32 CONFIG+=debug CONFIG+=declarative_debug CONFIG+=qml_debug
  4. Reading /home/mersdk/share/Dev/SailFishOs/sahke/3rdParty/tg/tg.pro [/home/mersdk/share/Dev/SailFishOs/build-sahke-MerSDK_SailfishOS_i486-Debug/3rdParty/tg]
  5. Reading /home/mersdk/share/Dev/SailFishOs/sahke/src/src.pro [/home/mersdk/share/Dev/SailFishOs/build-sahke-MerSDK_SailfishOS_i486-Debug/src]
  6. 17:05:48: The process "/home/gogeta/.config/SailfishBeta1/mer-sdk-tools/MerSDK/SailfishOS-i486/qmake" exited normally.
  7. 17:05:49: Starting: "/home/gogeta/.config/SailfishBeta1/mer-sdk-tools/MerSDK/SailfishOS-i486/make"
  8. cd 3rdParty/tg/ && ( test -e Makefile || /usr/lib/qt5/bin/qmake /home/mersdk/share/Dev/SailFishOs/sahke/3rdParty/tg/tg.pro -spec linux-g++-32 CONFIG+=debug CONFIG+=declarative_debug CONFIG+=qml_debug -o Makefile ) && make -f Makefile
  9. make[1]: Entering directory `/home/mersdk/share/Dev/SailFishOs/build-sahke-MerSDK_SailfishOS_i486-Debug/3rdParty/tg'
  10. /usr/lib/qt5/bin/qmake -spec linux-g++-32 CONFIG+=debug CONFIG+=declarative_debug CONFIG+=qml_debug -o Makefile ../../../sahke/3rdParty/tg/tg.pro
  11. make[1]: Leaving directory `/home/mersdk/share/Dev/SailFishOs/build-sahke-MerSDK_SailfishOS_i486-Debug/3rdParty/tg'
  12. make[1]: Entering directory `/home/mersdk/share/Dev/SailFishOs/build-sahke-MerSDK_SailfishOS_i486-Debug/3rdParty/tg'
  13. gcc -c -m32 -pipe -g -fno-strict-aliasing -fPIC -DPROG_NAME='"sahke"' -DLIB_TG -I/usr/share/qt5/mkspecs/linux-g++-32 -I../../../sahke/3rdParty/tg -I../../../sahke/3rdParty/tg/tg -I. -o binlog.o ../../../sahke/3rdParty/tg/tg/binlog.c
  14. gcc -c -m32 -pipe -g -fno-strict-aliasing -fPIC -DPROG_NAME='"sahke"' -DLIB_TG -I/usr/share/qt5/mkspecs/linux-g++-32 -I../../../sahke/3rdParty/tg -I../../../sahke/3rdParty/tg/tg -I. -o interface.o ../../../sahke/3rdParty/tg/tg/interface.c
  15. gcc -c -m32 -pipe -g -fno-strict-aliasing -fPIC -DPROG_NAME='"sahke"' -DLIB_TG -I/usr/share/qt5/mkspecs/linux-g++-32 -I../../../sahke/3rdParty/tg -I../../../sahke/3rdParty/tg/tg -I. -o loop.o ../../../sahke/3rdParty/tg/tg/loop.c
  16. gcc -c -m32 -pipe -g -fno-strict-aliasing -fPIC -DPROG_NAME='"sahke"' -DLIB_TG -I/usr/share/qt5/mkspecs/linux-g++-32 -I../../../sahke/3rdParty/tg -I../../../sahke/3rdParty/tg/tg -I. -o lua-tg.o ../../../sahke/3rdParty/tg/tg/lua-tg.c
  17. gcc -c -m32 -pipe -g -fno-strict-aliasing -fPIC -DPROG_NAME='"sahke"' -DLIB_TG -I/usr/share/qt5/mkspecs/linux-g++-32 -I../../../sahke/3rdParty/tg -I../../../sahke/3rdParty/tg/tg -I. -o main.o ../../../sahke/3rdParty/tg/tg/main.c
  18. ../../../sahke/3rdParty/tg/tg/main.c: In function 'get_terminal_attributes':
  19. make[1]: Leaving directory `/home/mersdk/share/Dev/SailFishOs/build-sahke-MerSDK_SailfishOS_i486-Debug/3rdParty/tg'
  20. ../../../sahke/3rdParty/tg/tg/main.c:115:18: error: 'STDIN_FILENO' undeclared (first use in this function)
  21. ../../../sahke/3rdParty/tg/tg/main.c:115:18: note: each undeclared identifier is reported only once for each function it appears in
  22. ../../../sahke/3rdParty/tg/tg/main.c:119:18: error: 'STDOUT_FILENO' undeclared (first use in this function)
  23. ../../../sahke/3rdParty/tg/tg/main.c: In function 'set_terminal_attributes':
  24. ../../../sahke/3rdParty/tg/tg/main.c:127:20: error: 'STDIN_FILENO' undeclared (first use in this function)
  25. ../../../sahke/3rdParty/tg/tg/main.c:132:20: error: 'STDOUT_FILENO' undeclared (first use in this function)
  26. ../../../sahke/3rdParty/tg/tg/main.c: In function 'args_parse':
  27. ../../../sahke/3rdParty/tg/tg/main.c:420:29: error: 'optarg' undeclared (first use in this function)
  28. make[1]: *** [main.o] Error 1
  29. make: *** [sub-3rdParty-tg-tg-pro-make_first] Error 2
  30. 17:05:59: The process "/home/gogeta/.config/SailfishBeta1/mer-sdk-tools/MerSDK/SailfishOS-i486/make" exited with code 2.
  31. Error while building/deploying project sahke (kit: MerSDK-SailfishOS-i486)
  32. When executing step 'Make'
  33. 17:05:59: Elapsed time: 00:51.
RAW Paste Data
Top