ggregory

Log4j 2.14.0 RC1 build log 1

Nov 7th, 2020
744
0
Never
Not a member of Pastebin yet? Sign Up, it unlocks many cool features!
Bash 120.71 KB | None | 0 0
  1.     at org.junit.platform.engine.support.hierarchical.NodeTestTask.executeRecursively(NodeTestTask.java:126)
  2.     at org.junit.platform.engine.support.hierarchical.NodeTestTask.execute(NodeTestTask.java:84)
  3.     at org.junit.platform.engine.support.hierarchical.SameThreadHierarchicalTestExecutorService.submit(SameThreadHierarchicalTestExecutorService.java:32)
  4.     at org.junit.platform.engine.support.hierarchical.HierarchicalTestExecutor.execute(HierarchicalTestExecutor.java:57)
  5.     at org.junit.platform.engine.support.hierarchical.HierarchicalTestEngine.execute(HierarchicalTestEngine.java:51)
  6.     at org.junit.platform.launcher.core.DefaultLauncher.execute(DefaultLauncher.java:220)
  7.     at org.junit.platform.launcher.core.DefaultLauncher.lambda$execute$6(DefaultLauncher.java:188)
  8.     at org.junit.platform.launcher.core.DefaultLauncher.withInterceptedStreams(DefaultLauncher.java:202)
  9.     at org.junit.platform.launcher.core.DefaultLauncher.execute(DefaultLauncher.java:181)
  10.     at org.junit.platform.launcher.core.DefaultLauncher.execute(DefaultLauncher.java:128)
  11.     at org.apache.maven.surefire.junitplatform.JUnitPlatformProvider.invokeAllTests(JUnitPlatformProvider.java:150)
  12.     at org.apache.maven.surefire.junitplatform.JUnitPlatformProvider.invoke(JUnitPlatformProvider.java:120)
  13.     at org.apache.maven.surefire.booter.ForkedBooter.invokeProviderInSameClassLoader(ForkedBooter.java:384)
  14.     at org.apache.maven.surefire.booter.ForkedBooter.runSuitesInProcess(ForkedBooter.java:345)
  15.     at org.apache.maven.surefire.booter.ForkedBooter.execute(ForkedBooter.java:126)
  16.     at org.apache.maven.surefire.booter.ForkedBooter.main(ForkedBooter.java:418)
  17.  
  18. 2020-11-07 10:20:36,105 main ERROR Could not create plugin of type class org.apache.logging.log4j.core.appender.FileAppender for element File: java.lang.IllegalStateException: ManagerFactory [org.apache.logging.log4j.core.appender.FileManager$FileManagerFactory@3ed242a4] unable to create manager for [/VeryLongDirectoryNameaaaaaaaaaaAAAAAAAAAAbbbbbbbbbbBBBBBBBBBBccccccccccCCCCCCCCCCddddddddddDDDDDDDDDDeeeeeeeeeeEEEEEEEEEEffffffffffFFFFFFFFFFggggggggggGGGGGGGGGGhhhhhhhhhhHHHHHHHHHHiiiiiiiiiiIIIIIIIIIIjjjjjjjjjjJJJJJJJJJJkkkkkkkkkkKKKKKKKKKKllllllllllLLLLLLLLLLmmmmmmmmmmMMMMMMMMMM/test.log] with data [org.apache.logging.log4j.core.appender.FileManager$FactoryData@1199fe66] java.lang.IllegalStateException: ManagerFactory [org.apache.logging.log4j.core.appender.FileManager$FileManagerFactory@3ed242a4] unable to create manager for [/VeryLongDirectoryNameaaaaaaaaaaAAAAAAAAAAbbbbbbbbbbBBBBBBBBBBccccccccccCCCCCCCCCCddddddddddDDDDDDDDDDeeeeeeeeeeEEEEEEEEEEffffffffffFFFFFFFFFFggggggggggGGGGGGGGGGhhhhhhhhhhHHHHHHHHHHiiiiiiiiiiIIIIIIIIIIjjjjjjjjjjJJJJJJJJJJkkkkkkkkkkKKKKKKKKKKllllllllllLLLLLLLLLLmmmmmmmmmmMMMMMMMMMM/test.log] with data [org.apache.logging.log4j.core.appender.FileManager$FactoryData@1199fe66]
  19.     at org.apache.logging.log4j.core.appender.AbstractManager.getManager(AbstractManager.java:115)
  20.     at org.apache.logging.log4j.core.appender.OutputStreamManager.getManager(OutputStreamManager.java:100)
  21.     at org.apache.logging.log4j.core.appender.FileManager.getFileManager(FileManager.java:182)
  22.     at org.apache.logging.log4j.core.appender.FileAppender$Builder.build(FileAppender.java:96)
  23.     at org.apache.logging.log4j.core.appender.FileAppender$Builder.build(FileAppender.java:52)
  24.     at org.apache.logging.log4j.core.config.plugins.util.PluginBuilder.build(PluginBuilder.java:122)
  25.     at org.apache.logging.log4j.core.config.AbstractConfiguration.createPluginObject(AbstractConfiguration.java:1002)
  26.     at org.apache.logging.log4j.core.config.AbstractConfiguration.createConfiguration(AbstractConfiguration.java:942)
  27.     at org.apache.logging.log4j.core.config.AbstractConfiguration.createConfiguration(AbstractConfiguration.java:934)
  28.     at org.apache.logging.log4j.core.config.AbstractConfiguration.doConfigure(AbstractConfiguration.java:552)
  29.     at org.apache.logging.log4j.core.config.AbstractConfiguration.initialize(AbstractConfiguration.java:241)
  30.     at org.apache.logging.log4j.core.config.AbstractConfiguration.start(AbstractConfiguration.java:288)
  31.     at org.apache.logging.log4j.core.LoggerContext.setConfiguration(LoggerContext.java:622)
  32.     at org.apache.logging.log4j.core.LoggerContext.start(LoggerContext.java:299)
  33.     at org.apache.logging.log4j.core.impl.Log4jContextFactory.getContext(Log4jContextFactory.java:242)
  34.     at org.apache.logging.log4j.core.config.Configurator.initialize(Configurator.java:159)
  35.     at org.apache.logging.log4j.core.config.Configurator.initialize(Configurator.java:131)
  36.     at org.apache.logging.log4j.core.config.Configurator.initialize(Configurator.java:101)
  37.     at org.apache.logging.log4j.core.config.Configurator.initialize(Configurator.java:210)
  38.     at org.apache.logging.log4j.core.config.TestConfigurator.testBadFileName(TestConfigurator.java:370)
  39.     at sun.reflect.NativeMethodAccessorImpl.invoke0(Native Method)
  40.     at sun.reflect.NativeMethodAccessorImpl.invoke(NativeMethodAccessorImpl.java:62)
  41.     at sun.reflect.DelegatingMethodAccessorImpl.invoke(DelegatingMethodAccessorImpl.java:43)
  42.     at java.lang.reflect.Method.invoke(Method.java:498)
  43.     at org.junit.platform.commons.util.ReflectionUtils.invokeMethod(ReflectionUtils.java:688)
  44.     at org.junit.jupiter.engine.execution.MethodInvocation.proceed(MethodInvocation.java:60)
  45.     at org.junit.jupiter.engine.execution.InvocationInterceptorChain$ValidatingInvocation.proceed(InvocationInterceptorChain.java:131)
  46.     at org.junit.jupiter.engine.extension.TimeoutExtension.intercept(TimeoutExtension.java:149)
  47.     at org.junit.jupiter.engine.extension.TimeoutExtension.interceptTestableMethod(TimeoutExtension.java:140)
  48.     at org.junit.jupiter.engine.extension.TimeoutExtension.interceptTestMethod(TimeoutExtension.java:84)
  49.     at org.junit.jupiter.engine.execution.ExecutableInvoker$ReflectiveInterceptorCall.lambda$ofVoidMethod$0(ExecutableInvoker.java:115)
  50.     at org.junit.jupiter.engine.execution.ExecutableInvoker.lambda$invoke$0(ExecutableInvoker.java:105)
  51.     at org.junit.jupiter.engine.execution.InvocationInterceptorChain$InterceptedInvocation.proceed(InvocationInterceptorChain.java:106)
  52.     at org.junit.jupiter.engine.execution.InvocationInterceptorChain.proceed(InvocationInterceptorChain.java:64)
  53.     at org.junit.jupiter.engine.execution.InvocationInterceptorChain.chainAndInvoke(InvocationInterceptorChain.java:45)
  54.     at org.junit.jupiter.engine.execution.InvocationInterceptorChain.invoke(InvocationInterceptorChain.java:37)
  55.     at org.junit.jupiter.engine.execution.ExecutableInvoker.invoke(ExecutableInvoker.java:104)
  56.     at org.junit.jupiter.engine.execution.ExecutableInvoker.invoke(ExecutableInvoker.java:98)
  57.     at org.junit.jupiter.engine.descriptor.TestMethodTestDescriptor.lambda$invokeTestMethod$6(TestMethodTestDescriptor.java:210)
  58.     at org.junit.platform.engine.support.hierarchical.ThrowableCollector.execute(ThrowableCollector.java:73)
  59.     at org.junit.jupiter.engine.descriptor.TestMethodTestDescriptor.invokeTestMethod(TestMethodTestDescriptor.java:206)
  60.     at org.junit.jupiter.engine.descriptor.TestMethodTestDescriptor.execute(TestMethodTestDescriptor.java:131)
  61.     at org.junit.jupiter.engine.descriptor.TestMethodTestDescriptor.execute(TestMethodTestDescriptor.java:65)
  62.     at org.junit.platform.engine.support.hierarchical.NodeTestTask.lambda$executeRecursively$5(NodeTestTask.java:139)
  63.     at org.junit.platform.engine.support.hierarchical.ThrowableCollector.execute(ThrowableCollector.java:73)
  64.     at org.junit.platform.engine.support.hierarchical.NodeTestTask.lambda$executeRecursively$7(NodeTestTask.java:129)
  65.     at org.junit.platform.engine.support.hierarchical.Node.around(Node.java:137)
  66.     at org.junit.platform.engine.support.hierarchical.NodeTestTask.lambda$executeRecursively$8(NodeTestTask.java:127)
  67.     at org.junit.platform.engine.support.hierarchical.ThrowableCollector.execute(ThrowableCollector.java:73)
  68.     at org.junit.platform.engine.support.hierarchical.NodeTestTask.executeRecursively(NodeTestTask.java:126)
  69.     at org.junit.platform.engine.support.hierarchical.NodeTestTask.execute(NodeTestTask.java:84)
  70.     at java.util.ArrayList.forEach(ArrayList.java:1259)
  71.     at org.junit.platform.engine.support.hierarchical.SameThreadHierarchicalTestExecutorService.invokeAll(SameThreadHierarchicalTestExecutorService.java:38)
  72.     at org.junit.platform.engine.support.hierarchical.NodeTestTask.lambda$executeRecursively$5(NodeTestTask.java:143)
  73.     at org.junit.platform.engine.support.hierarchical.ThrowableCollector.execute(ThrowableCollector.java:73)
  74.     at org.junit.platform.engine.support.hierarchical.NodeTestTask.lambda$executeRecursively$7(NodeTestTask.java:129)
  75.     at org.junit.platform.engine.support.hierarchical.Node.around(Node.java:137)
  76.     at org.junit.platform.engine.support.hierarchical.NodeTestTask.lambda$executeRecursively$8(NodeTestTask.java:127)
  77.     at org.junit.platform.engine.support.hierarchical.ThrowableCollector.execute(ThrowableCollector.java:73)
  78.     at org.junit.platform.engine.support.hierarchical.NodeTestTask.executeRecursively(NodeTestTask.java:126)
  79.     at org.junit.platform.engine.support.hierarchical.NodeTestTask.execute(NodeTestTask.java:84)
  80.     at java.util.ArrayList.forEach(ArrayList.java:1259)
  81.     at org.junit.platform.engine.support.hierarchical.SameThreadHierarchicalTestExecutorService.invokeAll(SameThreadHierarchicalTestExecutorService.java:38)
  82.     at org.junit.platform.engine.support.hierarchical.NodeTestTask.lambda$executeRecursively$5(NodeTestTask.java:143)
  83.     at org.junit.platform.engine.support.hierarchical.ThrowableCollector.execute(ThrowableCollector.java:73)
  84.     at org.junit.platform.engine.support.hierarchical.NodeTestTask.lambda$executeRecursively$7(NodeTestTask.java:129)
  85.     at org.junit.platform.engine.support.hierarchical.Node.around(Node.java:137)
  86.     at org.junit.platform.engine.support.hierarchical.NodeTestTask.lambda$executeRecursively$8(NodeTestTask.java:127)
  87.     at org.junit.platform.engine.support.hierarchical.ThrowableCollector.execute(ThrowableCollector.java:73)
  88.     at org.junit.platform.engine.support.hierarchical.NodeTestTask.executeRecursively(NodeTestTask.java:126)
  89.     at org.junit.platform.engine.support.hierarchical.NodeTestTask.execute(NodeTestTask.java:84)
  90.     at org.junit.platform.engine.support.hierarchical.SameThreadHierarchicalTestExecutorService.submit(SameThreadHierarchicalTestExecutorService.java:32)
  91.     at org.junit.platform.engine.support.hierarchical.HierarchicalTestExecutor.execute(HierarchicalTestExecutor.java:57)
  92.     at org.junit.platform.engine.support.hierarchical.HierarchicalTestEngine.execute(HierarchicalTestEngine.java:51)
  93.     at org.junit.platform.launcher.core.DefaultLauncher.execute(DefaultLauncher.java:220)
  94.     at org.junit.platform.launcher.core.DefaultLauncher.lambda$execute$6(DefaultLauncher.java:188)
  95.     at org.junit.platform.launcher.core.DefaultLauncher.withInterceptedStreams(DefaultLauncher.java:202)
  96.     at org.junit.platform.launcher.core.DefaultLauncher.execute(DefaultLauncher.java:181)
  97.     at org.junit.platform.launcher.core.DefaultLauncher.execute(DefaultLauncher.java:128)
  98.     at org.apache.maven.surefire.junitplatform.JUnitPlatformProvider.invokeAllTests(JUnitPlatformProvider.java:150)
  99.     at org.apache.maven.surefire.junitplatform.JUnitPlatformProvider.invoke(JUnitPlatformProvider.java:120)
  100.     at org.apache.maven.surefire.booter.ForkedBooter.invokeProviderInSameClassLoader(ForkedBooter.java:384)
  101.     at org.apache.maven.surefire.booter.ForkedBooter.runSuitesInProcess(ForkedBooter.java:345)
  102.     at org.apache.maven.surefire.booter.ForkedBooter.execute(ForkedBooter.java:126)
  103.     at org.apache.maven.surefire.booter.ForkedBooter.main(ForkedBooter.java:418)
  104.  
  105. 2020-11-07 10:20:36,107 main ERROR Unable to invoke factory method in class org.apache.logging.log4j.core.appender.FileAppender for element File: java.lang.IllegalStateException: No factory method found for class org.apache.logging.log4j.core.appender.FileAppender java.lang.IllegalStateException: No factory method found for class org.apache.logging.log4j.core.appender.FileAppender
  106.     at org.apache.logging.log4j.core.config.plugins.util.PluginBuilder.findFactoryMethod(PluginBuilder.java:234)
  107.     at org.apache.logging.log4j.core.config.plugins.util.PluginBuilder.build(PluginBuilder.java:134)
  108.     at org.apache.logging.log4j.core.config.AbstractConfiguration.createPluginObject(AbstractConfiguration.java:1002)
  109.     at org.apache.logging.log4j.core.config.AbstractConfiguration.createConfiguration(AbstractConfiguration.java:942)
  110.     at org.apache.logging.log4j.core.config.AbstractConfiguration.createConfiguration(AbstractConfiguration.java:934)
  111.     at org.apache.logging.log4j.core.config.AbstractConfiguration.doConfigure(AbstractConfiguration.java:552)
  112.     at org.apache.logging.log4j.core.config.AbstractConfiguration.initialize(AbstractConfiguration.java:241)
  113.     at org.apache.logging.log4j.core.config.AbstractConfiguration.start(AbstractConfiguration.java:288)
  114.     at org.apache.logging.log4j.core.LoggerContext.setConfiguration(LoggerContext.java:622)
  115.     at org.apache.logging.log4j.core.LoggerContext.start(LoggerContext.java:299)
  116.     at org.apache.logging.log4j.core.impl.Log4jContextFactory.getContext(Log4jContextFactory.java:242)
  117.     at org.apache.logging.log4j.core.config.Configurator.initialize(Configurator.java:159)
  118.     at org.apache.logging.log4j.core.config.Configurator.initialize(Configurator.java:131)
  119.     at org.apache.logging.log4j.core.config.Configurator.initialize(Configurator.java:101)
  120.     at org.apache.logging.log4j.core.config.Configurator.initialize(Configurator.java:210)
  121.     at org.apache.logging.log4j.core.config.TestConfigurator.testBadFileName(TestConfigurator.java:370)
  122.     at sun.reflect.NativeMethodAccessorImpl.invoke0(Native Method)
  123.     at sun.reflect.NativeMethodAccessorImpl.invoke(NativeMethodAccessorImpl.java:62)
  124.     at sun.reflect.DelegatingMethodAccessorImpl.invoke(DelegatingMethodAccessorImpl.java:43)
  125.     at java.lang.reflect.Method.invoke(Method.java:498)
  126.     at org.junit.platform.commons.util.ReflectionUtils.invokeMethod(ReflectionUtils.java:688)
  127.     at org.junit.jupiter.engine.execution.MethodInvocation.proceed(MethodInvocation.java:60)
  128.     at org.junit.jupiter.engine.execution.InvocationInterceptorChain$ValidatingInvocation.proceed(InvocationInterceptorChain.java:131)
  129.     at org.junit.jupiter.engine.extension.TimeoutExtension.intercept(TimeoutExtension.java:149)
  130.     at org.junit.jupiter.engine.extension.TimeoutExtension.interceptTestableMethod(TimeoutExtension.java:140)
  131.     at org.junit.jupiter.engine.extension.TimeoutExtension.interceptTestMethod(TimeoutExtension.java:84)
  132.     at org.junit.jupiter.engine.execution.ExecutableInvoker$ReflectiveInterceptorCall.lambda$ofVoidMethod$0(ExecutableInvoker.java:115)
  133.     at org.junit.jupiter.engine.execution.ExecutableInvoker.lambda$invoke$0(ExecutableInvoker.java:105)
  134.     at org.junit.jupiter.engine.execution.InvocationInterceptorChain$InterceptedInvocation.proceed(InvocationInterceptorChain.java:106)
  135.     at org.junit.jupiter.engine.execution.InvocationInterceptorChain.proceed(InvocationInterceptorChain.java:64)
  136.     at org.junit.jupiter.engine.execution.InvocationInterceptorChain.chainAndInvoke(InvocationInterceptorChain.java:45)
  137.     at org.junit.jupiter.engine.execution.InvocationInterceptorChain.invoke(InvocationInterceptorChain.java:37)
  138.     at org.junit.jupiter.engine.execution.ExecutableInvoker.invoke(ExecutableInvoker.java:104)
  139.     at org.junit.jupiter.engine.execution.ExecutableInvoker.invoke(ExecutableInvoker.java:98)
  140.     at org.junit.jupiter.engine.descriptor.TestMethodTestDescriptor.lambda$invokeTestMethod$6(TestMethodTestDescriptor.java:210)
  141.     at org.junit.platform.engine.support.hierarchical.ThrowableCollector.execute(ThrowableCollector.java:73)
  142.     at org.junit.jupiter.engine.descriptor.TestMethodTestDescriptor.invokeTestMethod(TestMethodTestDescriptor.java:206)
  143.     at org.junit.jupiter.engine.descriptor.TestMethodTestDescriptor.execute(TestMethodTestDescriptor.java:131)
  144.     at org.junit.jupiter.engine.descriptor.TestMethodTestDescriptor.execute(TestMethodTestDescriptor.java:65)
  145.     at org.junit.platform.engine.support.hierarchical.NodeTestTask.lambda$executeRecursively$5(NodeTestTask.java:139)
  146.     at org.junit.platform.engine.support.hierarchical.ThrowableCollector.execute(ThrowableCollector.java:73)
  147.     at org.junit.platform.engine.support.hierarchical.NodeTestTask.lambda$executeRecursively$7(NodeTestTask.java:129)
  148.     at org.junit.platform.engine.support.hierarchical.Node.around(Node.java:137)
  149.     at org.junit.platform.engine.support.hierarchical.NodeTestTask.lambda$executeRecursively$8(NodeTestTask.java:127)
  150.     at org.junit.platform.engine.support.hierarchical.ThrowableCollector.execute(ThrowableCollector.java:73)
  151.     at org.junit.platform.engine.support.hierarchical.NodeTestTask.executeRecursively(NodeTestTask.java:126)
  152.     at org.junit.platform.engine.support.hierarchical.NodeTestTask.execute(NodeTestTask.java:84)
  153.     at java.util.ArrayList.forEach(ArrayList.java:1259)
  154.     at org.junit.platform.engine.support.hierarchical.SameThreadHierarchicalTestExecutorService.invokeAll(SameThreadHierarchicalTestExecutorService.java:38)
  155.     at org.junit.platform.engine.support.hierarchical.NodeTestTask.lambda$executeRecursively$5(NodeTestTask.java:143)
  156.     at org.junit.platform.engine.support.hierarchical.ThrowableCollector.execute(ThrowableCollector.java:73)
  157.     at org.junit.platform.engine.support.hierarchical.NodeTestTask.lambda$executeRecursively$7(NodeTestTask.java:129)
  158.     at org.junit.platform.engine.support.hierarchical.Node.around(Node.java:137)
  159.     at org.junit.platform.engine.support.hierarchical.NodeTestTask.lambda$executeRecursively$8(NodeTestTask.java:127)
  160.     at org.junit.platform.engine.support.hierarchical.ThrowableCollector.execute(ThrowableCollector.java:73)
  161.     at org.junit.platform.engine.support.hierarchical.NodeTestTask.executeRecursively(NodeTestTask.java:126)
  162.     at org.junit.platform.engine.support.hierarchical.NodeTestTask.execute(NodeTestTask.java:84)
  163.     at java.util.ArrayList.forEach(ArrayList.java:1259)
  164.     at org.junit.platform.engine.support.hierarchical.SameThreadHierarchicalTestExecutorService.invokeAll(SameThreadHierarchicalTestExecutorService.java:38)
  165.     at org.junit.platform.engine.support.hierarchical.NodeTestTask.lambda$executeRecursively$5(NodeTestTask.java:143)
  166.     at org.junit.platform.engine.support.hierarchical.ThrowableCollector.execute(ThrowableCollector.java:73)
  167.     at org.junit.platform.engine.support.hierarchical.NodeTestTask.lambda$executeRecursively$7(NodeTestTask.java:129)
  168.     at org.junit.platform.engine.support.hierarchical.Node.around(Node.java:137)
  169.     at org.junit.platform.engine.support.hierarchical.NodeTestTask.lambda$executeRecursively$8(NodeTestTask.java:127)
  170.     at org.junit.platform.engine.support.hierarchical.ThrowableCollector.execute(ThrowableCollector.java:73)
  171.     at org.junit.platform.engine.support.hierarchical.NodeTestTask.executeRecursively(NodeTestTask.java:126)
  172.     at org.junit.platform.engine.support.hierarchical.NodeTestTask.execute(NodeTestTask.java:84)
  173.     at org.junit.platform.engine.support.hierarchical.SameThreadHierarchicalTestExecutorService.submit(SameThreadHierarchicalTestExecutorService.java:32)
  174.     at org.junit.platform.engine.support.hierarchical.HierarchicalTestExecutor.execute(HierarchicalTestExecutor.java:57)
  175.     at org.junit.platform.engine.support.hierarchical.HierarchicalTestEngine.execute(HierarchicalTestEngine.java:51)
  176.     at org.junit.platform.launcher.core.DefaultLauncher.execute(DefaultLauncher.java:220)
  177.     at org.junit.platform.launcher.core.DefaultLauncher.lambda$execute$6(DefaultLauncher.java:188)
  178.     at org.junit.platform.launcher.core.DefaultLauncher.withInterceptedStreams(DefaultLauncher.java:202)
  179.     at org.junit.platform.launcher.core.DefaultLauncher.execute(DefaultLauncher.java:181)
  180.     at org.junit.platform.launcher.core.DefaultLauncher.execute(DefaultLauncher.java:128)
  181.     at org.apache.maven.surefire.junitplatform.JUnitPlatformProvider.invokeAllTests(JUnitPlatformProvider.java:150)
  182.     at org.apache.maven.surefire.junitplatform.JUnitPlatformProvider.invoke(JUnitPlatformProvider.java:120)
  183.     at org.apache.maven.surefire.booter.ForkedBooter.invokeProviderInSameClassLoader(ForkedBooter.java:384)
  184.     at org.apache.maven.surefire.booter.ForkedBooter.runSuitesInProcess(ForkedBooter.java:345)
  185.     at org.apache.maven.surefire.booter.ForkedBooter.execute(ForkedBooter.java:126)
  186.     at org.apache.maven.surefire.booter.ForkedBooter.main(ForkedBooter.java:418)
  187.  
  188. 2020-11-07 10:20:36,109 main ERROR Null object returned for File in Appenders.
  189. 2020-11-07 10:20:36,110 main ERROR Unable to locate appender "File" for logger config "org.apache.logging.log4j.test2"
  190. 2020-11-07 10:20:41,148 main ERROR Log4j2 ConfigurationScheduler attempted to increment scheduled items after start
  191. 2020-11-07 10:20:56,194 main ERROR Unknown object "Logger" of type org.apache.logging.log4j.core.config.LoggerConfig is ignored: try nesting it inside one of: ["Appenders", "Loggers", "Properties", "Scripts", "CustomLevels"].
  192. 2020-11-07 10:20:56,195 main ERROR Unknown object "Logger" of type org.apache.logging.log4j.core.config.LoggerConfig is ignored: try nesting it inside one of: ["Appenders", "Loggers", "Properties", "Scripts", "CustomLevels"].
  193. 2020-11-07 10:20:56,195 main ERROR Unknown object "Root" of type org.apache.logging.log4j.core.config.LoggerConfig is ignored: try nesting it inside one of: ["Appenders", "Loggers", "Properties", "Scripts", "CustomLevels"].
  194. 2020-11-07 10:21:01,212 main ERROR Console contains an invalid element or attribute "TypoLayout"
  195. [ERROR] Tests run: 20, Failures: 1, Errors: 0, Skipped: 0, Time elapsed: 116.204 s <<< FAILURE! - in org.apache.logging.log4j.core.config.TestConfigurator
  196. [ERROR] testReconfiguration  Time elapsed: 15.044 s  <<< FAILURE!
  197. java.lang.AssertionError:
  198. Configuration not reset
  199. Expected: is not sameInstance(<XmlConfiguration[location=/Users/garydgregory/git/logging-log4j2/log4j-core/target/test-classes/log4j2-config.xml]>)
  200.      but: was <XmlConfiguration[location=/Users/garydgregory/git/logging-log4j2/log4j-core/target/test-classes/log4j2-config.xml]>
  201.     at org.apache.logging.log4j.core.config.TestConfigurator.testReconfiguration(TestConfigurator.java:274)
  202.  
  203. [INFO] Running org.apache.logging.log4j.core.config.ConfigurationSourceTest
  204. [INFO] Tests run: 1, Failures: 0, Errors: 0, Skipped: 0, Time elapsed: 0.027 s - in org.apache.logging.log4j.core.config.ConfigurationSourceTest
  205. [INFO] Running org.apache.logging.log4j.core.config.CustomConfigurationTest
  206. 2020-11-07 10:21:18,231 main WARN The bufferSize is set to 4000 but bufferedIo is false: false
  207. [INFO] Tests run: 1, Failures: 0, Errors: 0, Skipped: 0, Time elapsed: 5.361 s - in org.apache.logging.log4j.core.config.CustomConfigurationTest
  208. [INFO] Running org.apache.logging.log4j.core.config.ReliabilityStrategyTest
  209. [INFO] Tests run: 1, Failures: 0, Errors: 0, Skipped: 0, Time elapsed: 5.321 s - in org.apache.logging.log4j.core.config.ReliabilityStrategyTest
  210. [INFO] Running org.apache.logging.log4j.core.config.builder.ConfigurationAssemblerTest
  211. 10:21:30,973 |-INFO in ch.qos.logback.classic.LoggerContext[default] - Found resource [logback-test.xml] at [file:/Users/garydgregory/git/logging-log4j2/log4j-core/target/test-classes/logback-test.xml]
  212. 10:21:31,013 |-INFO in ch.qos.logback.classic.joran.action.ConfigurationAction - debug attribute not set
  213. 10:21:31,014 |-INFO in ch.qos.logback.core.joran.action.AppenderAction - About to instantiate appender of type [ch.qos.logback.core.FileAppender]
  214. 10:21:31,018 |-INFO in ch.qos.logback.core.joran.action.AppenderAction - Naming appender as [TestLogfile]
  215. 10:21:31,023 |-INFO in ch.qos.logback.core.joran.action.NestedComplexPropertyIA - Assuming default type [ch.qos.logback.classic.encoder.PatternLayoutEncoder] for [encoder] property
  216. 10:21:31,024 |-WARN in ch.qos.logback.classic.encoder.PatternLayoutEncoder@6ad59d92 - As of version 1.2.0 "immediateFlush" property should be set within the enclosing Appender.
  217. 10:21:31,024 |-WARN in ch.qos.logback.classic.encoder.PatternLayoutEncoder@6ad59d92 - Please move "immediateFlush" property into the enclosing appender.
  218. 10:21:31,067 |-WARN in ch.qos.logback.classic.encoder.PatternLayoutEncoder@6ad59d92 - Setting the "immediateFlush" property of the enclosing appender to false
  219. 10:21:31,067 |-INFO in ch.qos.logback.core.FileAppender[TestLogfile] - File property is set to [target/testlogback.log]
  220. 10:21:31,069 |-INFO in ch.qos.logback.classic.joran.action.RootLoggerAction - Setting level of ROOT logger to DEBUG
  221. 10:21:31,069 |-INFO in ch.qos.logback.core.joran.action.AppenderRefAction - Attaching appender named [TestLogfile] to Logger[ROOT]
  222. 10:21:31,069 |-INFO in ch.qos.logback.classic.joran.action.ConfigurationAction - End of configuration.
  223. 10:21:31,070 |-INFO in ch.qos.logback.classic.joran.JoranConfigurator@56f0cc85 - Registering current configuration as safe fallback point
  224.  
  225. 2020-11-07 10:21:31,199 [main] INFO : Welcome to Log4j!
  226. 2020-11-07 10:21:36,311 [main] INFO : Welcome to Log4j!
  227. [INFO] Tests run: 2, Failures: 0, Errors: 0, Skipped: 0, Time elapsed: 11.144 s - in org.apache.logging.log4j.core.config.builder.ConfigurationAssemblerTest
  228. [INFO] Running org.apache.logging.log4j.core.config.builder.ConfigurationBuilderTest
  229. [INFO] Tests run: 1, Failures: 0, Errors: 0, Skipped: 0, Time elapsed: 0.082 s - in org.apache.logging.log4j.core.config.builder.ConfigurationBuilderTest
  230. [INFO] Running org.apache.logging.log4j.core.jmx.ServerTest
  231. [INFO] Tests run: 10, Failures: 0, Errors: 0, Skipped: 0, Time elapsed: 0.067 s - in org.apache.logging.log4j.core.jmx.ServerTest
  232. [INFO] Running org.apache.logging.log4j.core.layout.GelfLayoutTest
  233. 10:22:04,345 |-INFO in ch.qos.logback.classic.LoggerContext[default] - Found resource [logback-test.xml] at [file:/Users/garydgregory/git/logging-log4j2/log4j-core/target/test-classes/logback-test.xml]
  234. 10:22:04,385 |-INFO in ch.qos.logback.classic.joran.action.ConfigurationAction - debug attribute not set
  235. 10:22:04,386 |-INFO in ch.qos.logback.core.joran.action.AppenderAction - About to instantiate appender of type [ch.qos.logback.core.FileAppender]
  236. 10:22:04,391 |-INFO in ch.qos.logback.core.joran.action.AppenderAction - Naming appender as [TestLogfile]
  237. 10:22:04,396 |-INFO in ch.qos.logback.core.joran.action.NestedComplexPropertyIA - Assuming default type [ch.qos.logback.classic.encoder.PatternLayoutEncoder] for [encoder] property
  238. 10:22:04,397 |-WARN in ch.qos.logback.classic.encoder.PatternLayoutEncoder@59af0466 - As of version 1.2.0 "immediateFlush" property should be set within the enclosing Appender.
  239. 10:22:04,397 |-WARN in ch.qos.logback.classic.encoder.PatternLayoutEncoder@59af0466 - Please move "immediateFlush" property into the enclosing appender.
  240. 10:22:04,412 |-WARN in ch.qos.logback.classic.encoder.PatternLayoutEncoder@59af0466 - Setting the "immediateFlush" property of the enclosing appender to false
  241. 10:22:04,412 |-INFO in ch.qos.logback.core.FileAppender[TestLogfile] - File property is set to [target/testlogback.log]
  242. 10:22:04,413 |-INFO in ch.qos.logback.classic.joran.action.RootLoggerAction - Setting level of ROOT logger to DEBUG
  243. 10:22:04,413 |-INFO in ch.qos.logback.core.joran.action.AppenderRefAction - Attaching appender named [TestLogfile] to Logger[ROOT]
  244. 10:22:04,414 |-INFO in ch.qos.logback.classic.joran.action.ConfigurationAction - End of configuration.
  245. 10:22:04,414 |-INFO in ch.qos.logback.classic.joran.JoranConfigurator@3e6ef8ad - Registering current configuration as safe fallback point
  246.  
  247. [INFO] Tests run: 12, Failures: 0, Errors: 0, Skipped: 0, Time elapsed: 35.666 s - in org.apache.logging.log4j.core.layout.GelfLayoutTest
  248. [INFO] Running org.apache.logging.log4j.core.layout.CsvLogEventLayoutTest
  249. [INFO] Tests run: 9, Failures: 0, Errors: 0, Skipped: 0, Time elapsed: 10.245 s - in org.apache.logging.log4j.core.layout.CsvLogEventLayoutTest
  250. [INFO] Running org.apache.logging.log4j.core.layout.AbstractStringLayoutTest
  251. [INFO] Tests run: 1, Failures: 0, Errors: 0, Skipped: 0, Time elapsed: 0.053 s - in org.apache.logging.log4j.core.layout.AbstractStringLayoutTest
  252. [INFO] Running org.apache.logging.log4j.core.layout.JsonLayoutTest
  253. [INFO] Tests run: 22, Failures: 0, Errors: 0, Skipped: 0, Time elapsed: 10.727 s - in org.apache.logging.log4j.core.layout.JsonLayoutTest
  254. [INFO] Running org.apache.logging.log4j.core.layout.YamlLayoutTest
  255. [INFO] Tests run: 13, Failures: 0, Errors: 0, Skipped: 0, Time elapsed: 10.659 s - in org.apache.logging.log4j.core.layout.YamlLayoutTest
  256. [INFO] Running org.apache.logging.log4j.core.layout.SyslogLayoutTest
  257. [INFO] Tests run: 1, Failures: 0, Errors: 0, Skipped: 0, Time elapsed: 15.279 s - in org.apache.logging.log4j.core.layout.SyslogLayoutTest
  258. [INFO] Running org.apache.logging.log4j.core.layout.Log4j2_2195_Test
  259. 2020-11-07 10:23:11,808 - This is a test. - java.lang.Exception: Test exception!|   at org.apache.logging.log4j.core.layout.Log4j2_2195_Test.test(Log4j2_2195_Test.java:39) ~[test-classes/:?]| at sun.reflect.NativeMethodAccessorImpl.invoke0(Native Method) ~[?:1.8.0_272]|  at sun.reflect.NativeMethodAccessorImpl.invoke(NativeMethodAccessorImpl.java:62) ~[?:1.8.0_272]|    at sun.reflect.DelegatingMethodAccessorImpl.invoke(DelegatingMethodAccessorImpl.java:43) ~[?:1.8.0_272]|    at java.lang.reflect.Method.invoke(Method.java:498) ~[?:1.8.0_272]| ... suppressed 27 lines|    at java.util.ArrayList.forEach(ArrayList.java:1259) ~[?:1.8.0_272]| ... suppressed 9 lines| at java.util.ArrayList.forEach(ArrayList.java:1259) ~[?:1.8.0_272]| ... suppressed 17 lines|    at org.apache.maven.surefire.junitplatform.JUnitPlatformProvider.invokeAllTests(JUnitPlatformProvider.java:150) [surefire-junit-platform-2.22.2.jar:2.22.2]|    at org.apache.maven.surefire.junitplatform.JUnitPlatformProvider.invoke(JUnitPlatformProvider.java:120) [surefire-junit-platform-2.22.2.jar:2.22.2]|    at org.apache.maven.surefire.booter.ForkedBooter.invokeProviderInSameClassLoader(ForkedBooter.java:384) [surefire-booter-2.22.2.jar:2.22.2]|    at org.apache.maven.surefire.booter.ForkedBooter.runSuitesInProcess(ForkedBooter.java:345) [surefire-booter-2.22.2.jar:2.22.2]| at org.apache.maven.surefire.booter.ForkedBooter.execute(ForkedBooter.java:126) [surefire-booter-2.22.2.jar:2.22.2]|    at org.apache.maven.surefire.booter.ForkedBooter.main(ForkedBooter.java:418) [surefire-booter-2.22.2.jar:2.22.2]|
  260. [INFO] Tests run: 1, Failures: 0, Errors: 0, Skipped: 0, Time elapsed: 5.347 s - in org.apache.logging.log4j.core.layout.Log4j2_2195_Test
  261. [INFO] Running org.apache.logging.log4j.core.layout.SerializedLayoutTest
  262. [INFO] Tests run: 3, Failures: 0, Errors: 0, Skipped: 0, Time elapsed: 10.295 s - in org.apache.logging.log4j.core.layout.SerializedLayoutTest
  263. [INFO] Running org.apache.logging.log4j.core.layout.PatternLayoutNoLookupDateTest
  264. [INFO] Tests run: 1, Failures: 0, Errors: 0, Skipped: 0, Time elapsed: 5.4 s - in org.apache.logging.log4j.core.layout.PatternLayoutNoLookupDateTest
  265. [INFO] Running org.apache.logging.log4j.core.layout.PatternSelectorTest
  266. [INFO] Tests run: 2, Failures: 0, Errors: 0, Skipped: 0, Time elapsed: 5.286 s - in org.apache.logging.log4j.core.layout.PatternSelectorTest
  267. [INFO] Running org.apache.logging.log4j.core.layout.PatternLayoutLookupDateTest
  268. [INFO] Tests run: 1, Failures: 0, Errors: 0, Skipped: 0, Time elapsed: 5.313 s - in org.apache.logging.log4j.core.layout.PatternLayoutLookupDateTest
  269. [INFO] Running org.apache.logging.log4j.core.layout.JsonLayoutMillisTest
  270. {"timeMillis":1604762627576,"thread":"main","level":"INFO","loggerName":"LayoutTest","message":"This is a test message","endOfBatch":false,"loggerFqcn":"org.apache.logging.log4j.spi.AbstractLogger","threadId":1,"threadPriority":5}
  271.  
  272. [INFO] Tests run: 1, Failures: 0, Errors: 0, Skipped: 0, Time elapsed: 5.477 s - in org.apache.logging.log4j.core.layout.JsonLayoutMillisTest
  273. [INFO] Running org.apache.logging.log4j.core.layout.Log4j2_1482_CoreTest
  274. [INFO] Tests run: 2, Failures: 0, Errors: 0, Skipped: 0, Time elapsed: 55.508 s - in org.apache.logging.log4j.core.layout.Log4j2_1482_CoreTest
  275. [INFO] Running org.apache.logging.log4j.core.layout.CsvParameterLayoutAllAsyncTest
  276. [INFO] Tests run: 3, Failures: 0, Errors: 0, Skipped: 0, Time elapsed: 5.359 s - in org.apache.logging.log4j.core.layout.CsvParameterLayoutAllAsyncTest
  277. [INFO] Running org.apache.logging.log4j.core.layout.XmlLayoutTest
  278. [INFO] Tests run: 12, Failures: 0, Errors: 0, Skipped: 0, Time elapsed: 10.673 s - in org.apache.logging.log4j.core.layout.XmlLayoutTest
  279. [INFO] Running org.apache.logging.log4j.core.layout.PatternLayoutMainMapLookupTest
  280. 2020-11-07 10:25:07,740 main WARN The bufferSize is set to 8192 but bufferedIo is false: false
  281. 2020-11-07 10:25:12,814 main WARN The bufferSize is set to 8192 but bufferedIo is false: false
  282. 2020-11-07 10:25:17,852 main WARN The bufferSize is set to 8192 but bufferedIo is false: false
  283. [INFO] Tests run: 2, Failures: 0, Errors: 0, Skipped: 0, Time elapsed: 15.377 s - in org.apache.logging.log4j.core.layout.PatternLayoutMainMapLookupTest
  284. [INFO] Running org.apache.logging.log4j.core.layout.ConcurrentLoggingWithGelfLayoutTest
  285. [INFO] Tests run: 1, Failures: 0, Errors: 0, Skipped: 0, Time elapsed: 5.371 s - in org.apache.logging.log4j.core.layout.ConcurrentLoggingWithGelfLayoutTest
  286. [INFO] Running org.apache.logging.log4j.core.layout.Rfc5424LayoutTest
  287. [INFO] Tests run: 9, Failures: 0, Errors: 0, Skipped: 0, Time elapsed: 105.458 s - in org.apache.logging.log4j.core.layout.Rfc5424LayoutTest
  288. [INFO] Running org.apache.logging.log4j.core.layout.StringBuilderEncoderTest
  289. [INFO] Tests run: 16, Failures: 0, Errors: 0, Skipped: 0, Time elapsed: 0.076 s - in org.apache.logging.log4j.core.layout.StringBuilderEncoderTest
  290. [INFO] Running org.apache.logging.log4j.core.layout.ConcurrentLoggingWithJsonLayoutTest
  291. [INFO] Tests run: 1, Failures: 0, Errors: 0, Skipped: 0, Time elapsed: 5.539 s - in org.apache.logging.log4j.core.layout.ConcurrentLoggingWithJsonLayoutTest
  292. [INFO] Running org.apache.logging.log4j.core.layout.HtmlLayoutTest
  293. [INFO] Tests run: 10, Failures: 0, Errors: 0, Skipped: 0, Time elapsed: 10.344 s - in org.apache.logging.log4j.core.layout.HtmlLayoutTest
  294. [INFO] Running org.apache.logging.log4j.core.layout.CsvParameterLayoutTest
  295. [INFO] Tests run: 14, Failures: 0, Errors: 0, Skipped: 0, Time elapsed: 75.586 s - in org.apache.logging.log4j.core.layout.CsvParameterLayoutTest
  296. [INFO] Running org.apache.logging.log4j.core.layout.PatternLayoutTest
  297. [INFO] Tests run: 23, Failures: 0, Errors: 0, Skipped: 0, Time elapsed: 10.299 s - in org.apache.logging.log4j.core.layout.PatternLayoutTest
  298. [INFO] Running org.apache.logging.log4j.core.LogEventFactoryTest
  299. [INFO] Tests run: 1, Failures: 0, Errors: 0, Skipped: 0, Time elapsed: 5.339 s - in org.apache.logging.log4j.core.LogEventFactoryTest
  300. [INFO] Running org.apache.logging.log4j.core.CustomLevelsTest
  301. Hello, World
  302. Hello DIAG
  303. [INFO] Tests run: 3, Failures: 0, Errors: 0, Skipped: 0, Time elapsed: 5.315 s - in org.apache.logging.log4j.core.CustomLevelsTest
  304. [INFO] Running org.apache.logging.log4j.core.StrictXmlConfigTest
  305. [INFO] Tests run: 10, Failures: 0, Errors: 0, Skipped: 0, Time elapsed: 5.364 s - in org.apache.logging.log4j.core.StrictXmlConfigTest
  306. [INFO] Running org.apache.logging.log4j.core.GcFreeAsynchronousLoggingTest
  307. [INFO] Tests run: 1, Failures: 0, Errors: 0, Skipped: 0, Time elapsed: 15.003 s - in org.apache.logging.log4j.core.GcFreeAsynchronousLoggingTest
  308. [INFO] Running org.apache.logging.log4j.core.async.AsyncLoggerConfigAutoFlushTest
  309. [INFO] Tests run: 1, Failures: 0, Errors: 0, Skipped: 0, Time elapsed: 10.524 s - in org.apache.logging.log4j.core.async.AsyncLoggerConfigAutoFlushTest
  310. [INFO] Running org.apache.logging.log4j.core.async.AsyncLoggerThreadNameStrategyTest
  311. [INFO] Tests run: 6, Failures: 0, Errors: 0, Skipped: 0, Time elapsed: 0.042 s - in org.apache.logging.log4j.core.async.AsyncLoggerThreadNameStrategyTest
  312. [INFO] Running org.apache.logging.log4j.core.async.AsyncLoggersWithAsyncLoggerConfigTest
  313. [INFO] Tests run: 1, Failures: 0, Errors: 0, Skipped: 0, Time elapsed: 5.461 s - in org.apache.logging.log4j.core.async.AsyncLoggersWithAsyncLoggerConfigTest
  314. [INFO] Running org.apache.logging.log4j.core.async.Log4j2Jira1688AsyncTest
  315. [INFO] Tests run: 1, Failures: 0, Errors: 0, Skipped: 0, Time elapsed: 5.394 s - in org.apache.logging.log4j.core.async.Log4j2Jira1688AsyncTest
  316. [INFO] Running org.apache.logging.log4j.core.async.AsyncRootReloadTest
  317. [INFO] Tests run: 1, Failures: 0, Errors: 0, Skipped: 0, Time elapsed: 20.31 s - in org.apache.logging.log4j.core.async.AsyncRootReloadTest
  318. [INFO] Running org.apache.logging.log4j.core.async.DefaultAsyncQueueFullPolicyTest
  319. [INFO] Tests run: 2, Failures: 0, Errors: 0, Skipped: 0, Time elapsed: 0.024 s - in org.apache.logging.log4j.core.async.DefaultAsyncQueueFullPolicyTest
  320. [INFO] Running org.apache.logging.log4j.core.async.Log4j2Jira1688Test
  321. [INFO] Tests run: 1, Failures: 0, Errors: 0, Skipped: 0, Time elapsed: 5.408 s - in org.apache.logging.log4j.core.async.Log4j2Jira1688Test
  322. [INFO] Running org.apache.logging.log4j.core.async.AsyncLoggerConfigThreadContextDefaultTest
  323. [INFO] Tests run: 1, Failures: 0, Errors: 0, Skipped: 0, Time elapsed: 5.478 s - in org.apache.logging.log4j.core.async.AsyncLoggerConfigThreadContextDefaultTest
  324. [INFO] Running org.apache.logging.log4j.core.async.AsyncLoggerUseAfterShutdownTest
  325. [INFO] Tests run: 1, Failures: 0, Errors: 0, Skipped: 0, Time elapsed: 10.445 s - in org.apache.logging.log4j.core.async.AsyncLoggerUseAfterShutdownTest
  326. [INFO] Running org.apache.logging.log4j.core.async.AsyncLoggerCustomSelectorLocationTest
  327. [INFO] Tests run: 1, Failures: 0, Errors: 0, Skipped: 0, Time elapsed: 5.578 s - in org.apache.logging.log4j.core.async.AsyncLoggerCustomSelectorLocationTest
  328. [INFO] Running org.apache.logging.log4j.core.async.QueueFullAsyncAppenderTest
  329. [INFO] Tests run: 1, Failures: 0, Errors: 0, Skipped: 0, Time elapsed: 5.813 s - in org.apache.logging.log4j.core.async.QueueFullAsyncAppenderTest
  330. [INFO] Running org.apache.logging.log4j.core.async.QueueFullAsyncLoggerTest
  331. [INFO] Tests run: 1, Failures: 0, Errors: 0, Skipped: 0, Time elapsed: 5.82 s - in org.apache.logging.log4j.core.async.QueueFullAsyncLoggerTest
  332. [INFO] Running org.apache.logging.log4j.core.async.AsyncLoggerConfigUseAfterShutdownTest
  333. [INFO] Tests run: 1, Failures: 0, Errors: 0, Skipped: 0, Time elapsed: 10.364 s - in org.apache.logging.log4j.core.async.AsyncLoggerConfigUseAfterShutdownTest
  334. [INFO] Running org.apache.logging.log4j.core.async.AsyncLoggersWithAsyncAppenderTest
  335. 2020-11-07 10:31:18,739 main ERROR Unable to set up error Appender. No appender named STDOUT was configured
  336. [INFO] Tests run: 1, Failures: 0, Errors: 0, Skipped: 0, Time elapsed: 5.444 s - in org.apache.logging.log4j.core.async.AsyncLoggersWithAsyncAppenderTest
  337. [INFO] Running org.apache.logging.log4j.core.async.AsyncLoggerConfigThreadContextGarbageFreeTest
  338. [INFO] Tests run: 1, Failures: 0, Errors: 0, Skipped: 0, Time elapsed: 5.465 s - in org.apache.logging.log4j.core.async.AsyncLoggerConfigThreadContextGarbageFreeTest
  339. [INFO] Running org.apache.logging.log4j.core.async.AsyncLoggerThreadContextCopyOnWriteTest
  340. [INFO] Tests run: 2, Failures: 0, Errors: 0, Skipped: 0, Time elapsed: 10.702 s - in org.apache.logging.log4j.core.async.AsyncLoggerThreadContextCopyOnWriteTest
  341. [INFO] Running org.apache.logging.log4j.core.async.AsyncLoggerThreadContextDefaultTest
  342. [INFO] Tests run: 2, Failures: 0, Errors: 0, Skipped: 0, Time elapsed: 10.711 s - in org.apache.logging.log4j.core.async.AsyncLoggerThreadContextDefaultTest
  343. [INFO] Running org.apache.logging.log4j.core.async.AsyncLoggerThreadContextTest
  344. [INFO] Tests run: 1, Failures: 0, Errors: 0, Skipped: 0, Time elapsed: 5.498 s - in org.apache.logging.log4j.core.async.AsyncLoggerThreadContextTest
  345. [INFO] Running org.apache.logging.log4j.core.async.AsyncLoggerContextSelectorInitialStateTest
  346. [INFO] Tests run: 1, Failures: 0, Errors: 0, Skipped: 0, Time elapsed: 0.038 s - in org.apache.logging.log4j.core.async.AsyncLoggerContextSelectorInitialStateTest
  347. [INFO] Running org.apache.logging.log4j.core.async.AsyncLoggerTimestampMessageTest
  348. [INFO] Tests run: 1, Failures: 0, Errors: 0, Skipped: 0, Time elapsed: 5.516 s - in org.apache.logging.log4j.core.async.AsyncLoggerTimestampMessageTest
  349. [INFO] Running org.apache.logging.log4j.core.async.AsyncLoggerLocationTest
  350. [INFO] Tests run: 1, Failures: 0, Errors: 0, Skipped: 0, Time elapsed: 5.506 s - in org.apache.logging.log4j.core.async.AsyncLoggerLocationTest
  351. [INFO] Running org.apache.logging.log4j.core.async.QueueFullAsyncLoggerConfigTest
  352. [INFO] Tests run: 1, Failures: 0, Errors: 0, Skipped: 0, Time elapsed: 5.824 s - in org.apache.logging.log4j.core.async.QueueFullAsyncLoggerConfigTest
  353. [INFO] Running org.apache.logging.log4j.core.async.AsyncQueueFullPolicyFactoryTest
  354. [INFO] Tests run: 7, Failures: 0, Errors: 0, Skipped: 0, Time elapsed: 0.043 s - in org.apache.logging.log4j.core.async.AsyncQueueFullPolicyFactoryTest
  355. [INFO] Running org.apache.logging.log4j.core.async.AsyncLoggerConfigTest
  356. [INFO] Tests run: 2, Failures: 0, Errors: 0, Skipped: 0, Time elapsed: 10.472 s - in org.apache.logging.log4j.core.async.AsyncLoggerConfigTest
  357. [INFO] Running org.apache.logging.log4j.core.async.QueueFullAsyncLoggerConfigLoggingFromToStringTest
  358. 2020-11-07 10:32:33,230 Time-limited test WARN LOG4J2-2031: Log4j2 logged an event out of order to prevent deadlock caused by domain objects logging from their toString method when the async queue is full
  359. [INFO] Tests run: 1, Failures: 0, Errors: 0, Skipped: 0, Time elapsed: 5.848 s - in org.apache.logging.log4j.core.async.QueueFullAsyncLoggerConfigLoggingFromToStringTest
  360. [INFO] Running org.apache.logging.log4j.core.async.QueueFullAsyncLoggerLoggingFromToStringTest
  361. 2020-11-07 10:32:39,962 Time-limited test WARN LOG4J2-2031: Log4j2 logged an event out of order to prevent deadlock caused by domain objects logging from their toString method when the async queue is full
  362. 2020-11-07 10:32:40,463 Time-limited test WARN LOG4J2-2031: Log4j2 logged an event out of order to prevent deadlock caused by domain objects logging from their toString method when the async queue is full
  363. [INFO] Tests run: 1, Failures: 0, Errors: 0, Skipped: 0, Time elapsed: 5.861 s - in org.apache.logging.log4j.core.async.QueueFullAsyncLoggerLoggingFromToStringTest
  364. [INFO] Running org.apache.logging.log4j.core.async.AsyncLoggerTest
  365. [INFO] Tests run: 1, Failures: 0, Errors: 0, Skipped: 0, Time elapsed: 5.521 s - in org.apache.logging.log4j.core.async.AsyncLoggerTest
  366. [INFO] Running org.apache.logging.log4j.core.async.DiscardingAsyncQueueFullPolicyTest
  367. [INFO] Tests run: 8, Failures: 0, Errors: 0, Skipped: 0, Time elapsed: 0.04 s - in org.apache.logging.log4j.core.async.DiscardingAsyncQueueFullPolicyTest
  368. [INFO] Running org.apache.logging.log4j.core.async.AsyncLoggerContextSelectorTest
  369. [INFO] Tests run: 4, Failures: 0, Errors: 0, Skipped: 0, Time elapsed: 0.159 s - in org.apache.logging.log4j.core.async.AsyncLoggerContextSelectorTest
  370. [INFO] Running org.apache.logging.log4j.core.async.AsyncAppenderExceptionHandlingTest
  371. [INFO] Tests run: 5, Failures: 0, Errors: 0, Skipped: 0, Time elapsed: 25.442 s - in org.apache.logging.log4j.core.async.AsyncAppenderExceptionHandlingTest
  372. [INFO] Running org.apache.logging.log4j.core.async.AsyncLoggerConfigThreadContextCopyOnWriteTest
  373. [INFO] Tests run: 1, Failures: 0, Errors: 0, Skipped: 0, Time elapsed: 5.477 s - in org.apache.logging.log4j.core.async.AsyncLoggerConfigThreadContextCopyOnWriteTest
  374. [INFO] Running org.apache.logging.log4j.core.async.AsyncLoggerClassLoadDeadlockTest
  375. [INFO] Tests run: 1, Failures: 0, Errors: 0, Skipped: 0, Time elapsed: 5.357 s - in org.apache.logging.log4j.core.async.AsyncLoggerClassLoadDeadlockTest
  376. [INFO] Running org.apache.logging.log4j.core.async.AsyncLoggerThreadContextGarbageFreeTest
  377. [INFO] Tests run: 2, Failures: 0, Errors: 0, Skipped: 0, Time elapsed: 10.718 s - in org.apache.logging.log4j.core.async.AsyncLoggerThreadContextGarbageFreeTest
  378. [INFO] Running org.apache.logging.log4j.core.async.AsyncLoggerConfigWithAsyncEnabledTest
  379. [INFO] Tests run: 1, Failures: 0, Errors: 0, Skipped: 0, Time elapsed: 10.469 s - in org.apache.logging.log4j.core.async.AsyncLoggerConfigWithAsyncEnabledTest
  380. [INFO] Running org.apache.logging.log4j.core.async.RingBufferLogEventTest
  381. [INFO] Tests run: 10, Failures: 0, Errors: 0, Skipped: 0, Time elapsed: 0.091 s - in org.apache.logging.log4j.core.async.RingBufferLogEventTest
  382. [INFO] Running org.apache.logging.log4j.core.async.AsyncLoggerContextTest
  383. [INFO] Tests run: 1, Failures: 0, Errors: 0, Skipped: 0, Time elapsed: 5.258 s - in org.apache.logging.log4j.core.async.AsyncLoggerContextTest
  384. [INFO] Running org.apache.logging.log4j.core.lookup.MarkerLookupConfigTest
  385. 2020-11-07 10:34:03,789 main ERROR Appenders contains an invalid element or attribute "Console"
  386. [INFO] Tests run: 1, Failures: 0, Errors: 0, Skipped: 0, Time elapsed: 5.436 s - in org.apache.logging.log4j.core.lookup.MarkerLookupConfigTest
  387. [INFO] Running org.apache.logging.log4j.core.lookup.MainLookupTest
  388. [INFO] Tests run: 1, Failures: 0, Errors: 0, Skipped: 0, Time elapsed: 0.076 s - in org.apache.logging.log4j.core.lookup.MainLookupTest
  389. [INFO] Running org.apache.logging.log4j.core.lookup.ResourceBundleLookupTest
  390. [INFO] Tests run: 3, Failures: 0, Errors: 0, Skipped: 0, Time elapsed: 0.059 s - in org.apache.logging.log4j.core.lookup.ResourceBundleLookupTest
  391. [INFO] Running org.apache.logging.log4j.core.lookup.MapLookupTest
  392. [INFO] Tests run: 8, Failures: 0, Errors: 0, Skipped: 0, Time elapsed: 0.085 s - in org.apache.logging.log4j.core.lookup.MapLookupTest
  393. [INFO] Running org.apache.logging.log4j.core.lookup.MarkerLookupTest
  394. [INFO] Tests run: 6, Failures: 0, Errors: 0, Skipped: 0, Time elapsed: 0.078 s - in org.apache.logging.log4j.core.lookup.MarkerLookupTest
  395. [INFO] Running org.apache.logging.log4j.core.lookup.StructuredDataLookupTest
  396. [INFO] Tests run: 1, Failures: 0, Errors: 0, Skipped: 0, Time elapsed: 0.073 s - in org.apache.logging.log4j.core.lookup.StructuredDataLookupTest
  397. [INFO] Running org.apache.logging.log4j.core.lookup.MainInputArgumentsJmxLookupTest
  398. [INFO] Tests run: 1, Failures: 0, Errors: 0, Skipped: 0, Time elapsed: 0.026 s - in org.apache.logging.log4j.core.lookup.MainInputArgumentsJmxLookupTest
  399. [INFO] Running org.apache.logging.log4j.core.lookup.InterpolatorTest
  400. java:version = Java version 1.8.0_272
  401. java:runtime = OpenJDK Runtime Environment (build 1.8.0_272-b10) from AdoptOpenJDK
  402. java:vm = OpenJDK 64-Bit Server VM (build 25.272-b10, mixed mode)
  403. java:os = Mac OS X 10.15.7 unknown, architecture: x86_64-64
  404. java:locale = default locale: en_US, platform encoding: UTF-8
  405. java:hw = processors: 4, architecture: x86_64-64
  406. [INFO] Tests run: 2, Failures: 0, Errors: 0, Skipped: 0, Time elapsed: 5.275 s - in org.apache.logging.log4j.core.lookup.InterpolatorTest
  407. [INFO] Running org.apache.logging.log4j.core.lookup.EnvironmentLookupTest
  408. [INFO] Tests run: 1, Failures: 0, Errors: 0, Skipped: 0, Time elapsed: 0.024 s - in org.apache.logging.log4j.core.lookup.EnvironmentLookupTest
  409. [INFO] Running org.apache.logging.log4j.core.lookup.SystemPropertiesLookupTest
  410. [INFO] Tests run: 1, Failures: 0, Errors: 0, Skipped: 0, Time elapsed: 0.055 s - in org.apache.logging.log4j.core.lookup.SystemPropertiesLookupTest
  411. [INFO] Running org.apache.logging.log4j.core.lookup.JndiLookupTest
  412. [INFO] Tests run: 2, Failures: 0, Errors: 0, Skipped: 0, Time elapsed: 5.27 s - in org.apache.logging.log4j.core.lookup.JndiLookupTest
  413. [INFO] Running org.apache.logging.log4j.core.lookup.DateLookupTest
  414. [INFO] Tests run: 1, Failures: 0, Errors: 0, Skipped: 0, Time elapsed: 0.057 s - in org.apache.logging.log4j.core.lookup.DateLookupTest
  415. [INFO] Running org.apache.logging.log4j.core.lookup.Log4jLookupTest
  416. [INFO] Tests run: 2, Failures: 0, Errors: 0, Skipped: 0, Time elapsed: 0.537 s - in org.apache.logging.log4j.core.lookup.Log4jLookupTest
  417. [INFO] Running org.apache.logging.log4j.core.lookup.Log4jLookupWithSpacesTest
  418. [INFO] Tests run: 2, Failures: 0, Errors: 0, Skipped: 0, Time elapsed: 0.566 s - in org.apache.logging.log4j.core.lookup.Log4jLookupWithSpacesTest
  419. [INFO] Running org.apache.logging.log4j.core.lookup.CaseLookupTest
  420. [INFO] Tests run: 1, Failures: 0, Errors: 0, Skipped: 0, Time elapsed: 0.024 s - in org.apache.logging.log4j.core.lookup.CaseLookupTest
  421. [INFO] Running org.apache.logging.log4j.core.lookup.StrSubstitutorTest
  422. [INFO] Tests run: 2, Failures: 0, Errors: 0, Skipped: 0, Time elapsed: 0.133 s - in org.apache.logging.log4j.core.lookup.StrSubstitutorTest
  423. [INFO] Running org.apache.logging.log4j.core.lookup.ContextMapLookupTest
  424. [INFO] Tests run: 2, Failures: 0, Errors: 0, Skipped: 0, Time elapsed: 10.331 s - in org.apache.logging.log4j.core.lookup.ContextMapLookupTest
  425. [INFO] Running org.apache.logging.log4j.core.lookup.EventLookupTest
  426. [INFO] Tests run: 6, Failures: 0, Errors: 0, Skipped: 0, Time elapsed: 0.077 s - in org.apache.logging.log4j.core.lookup.EventLookupTest
  427. [INFO] Running org.apache.logging.log4j.core.message.ExtendedThreadInformationTest
  428. [INFO] Tests run: 1, Failures: 0, Errors: 0, Skipped: 0, Time elapsed: 0.038 s - in org.apache.logging.log4j.core.message.ExtendedThreadInformationTest
  429. [INFO] Running org.apache.logging.log4j.core.ShutdownDisabledTest
  430. [INFO] Tests run: 1, Failures: 0, Errors: 0, Skipped: 0, Time elapsed: 5.309 s - in org.apache.logging.log4j.core.ShutdownDisabledTest
  431. [INFO] Running org.apache.logging.log4j.core.LoggerDateTest
  432. [INFO] Tests run: 1, Failures: 0, Errors: 0, Skipped: 0, Time elapsed: 5.323 s - in org.apache.logging.log4j.core.LoggerDateTest
  433. [INFO] Running org.apache.logging.log4j.core.parser.YamlLogEventParserTest
  434. [INFO] Tests run: 9, Failures: 0, Errors: 0, Skipped: 0, Time elapsed: 0.352 s - in org.apache.logging.log4j.core.parser.YamlLogEventParserTest
  435. [INFO] Running org.apache.logging.log4j.core.parser.XmlLogEventParserTest
  436. [INFO] Tests run: 9, Failures: 0, Errors: 0, Skipped: 0, Time elapsed: 0.391 s - in org.apache.logging.log4j.core.parser.XmlLogEventParserTest
  437. [INFO] Running org.apache.logging.log4j.core.parser.JsonLogEventParserTest
  438. [INFO] Tests run: 9, Failures: 0, Errors: 0, Skipped: 0, Time elapsed: 0.336 s - in org.apache.logging.log4j.core.parser.JsonLogEventParserTest
  439. [INFO] Running org.apache.logging.log4j.core.time.MutableInstantTest
  440. [INFO] Tests run: 19, Failures: 0, Errors: 0, Skipped: 0, Time elapsed: 0.04 s - in org.apache.logging.log4j.core.time.MutableInstantTest
  441. [INFO] Running org.apache.logging.log4j.core.CollectionLoggingTest
  442. [WARNING] Tests run: 1, Failures: 0, Errors: 0, Skipped: 1, Time elapsed: 0.001 s - in org.apache.logging.log4j.core.CollectionLoggingTest
  443. [INFO] Running org.apache.logging.log4j.core.LateConfigTest
  444. [INFO] Tests run: 1, Failures: 0, Errors: 0, Skipped: 0, Time elapsed: 10.349 s - in org.apache.logging.log4j.core.LateConfigTest
  445. [INFO] Running org.apache.logging.log4j.core.PatternSelectorTest
  446. [INFO] Tests run: 3, Failures: 0, Errors: 0, Skipped: 0, Time elapsed: 5.759 s - in org.apache.logging.log4j.core.PatternSelectorTest
  447. [INFO] Running org.apache.logging.log4j.core.PatternVariableResolverTest
  448. 2020-11-07 10:35:18,322 main DEBUG Starting LoggerContext[name=org.apache.logging.log4j.core.PatternVariableResolverTest] from configuration at log4j2-pattern-layout.xml
  449. 2020-11-07 10:35:18,324 main DEBUG Starting LoggerContext[name=org.apache.logging.log4j.core.PatternVariableResolverTest, org.apache.logging.log4j.core.LoggerContext@41ee392b] with configuration XmlConfiguration[location=/Users/garydgregory/git/logging-log4j2/log4j-core/target/test-classes/log4j2-pattern-layout.xml]...
  450. 2020-11-07 10:35:18,325 main DEBUG Shutdown hook enabled. Registering a new one.
  451. 2020-11-07 10:35:23,334 main DEBUG null null initializing configuration XmlConfiguration[location=/Users/garydgregory/git/logging-log4j2/log4j-core/target/test-classes/log4j2-pattern-layout.xml]
  452. 2020-11-07 10:35:23,338 main DEBUG Installed 3 script engines
  453. 2020-11-07 10:35:23,373 main DEBUG BeanShell Engine version: 1.0, language: BeanShell, threading: MULTITHREADED, compile: true, names: [beanshell, bsh, java], factory class: bsh.engine.BshScriptEngineFactory
  454. 2020-11-07 10:35:23,410 main DEBUG Groovy Scripting Engine version: 2.0, language: Groovy, threading: MULTITHREADED, compile: true, names: [groovy, Groovy], factory class: org.codehaus.groovy.jsr223.GroovyScriptEngineFactory
  455. 2020-11-07 10:35:23,565 main DEBUG Oracle Nashorn version: 1.8.0_272, language: ECMAScript, threading: Not Thread Safe, compile: true, names: [nashorn, Nashorn, js, JS, JavaScript, javascript, ECMAScript, ecmascript], factory class: jdk.nashorn.api.scripting.NashornScriptEngineFactory
  456. 2020-11-07 10:35:23,565 main DEBUG PluginManager 'Core' found 131 plugins
  457. 2020-11-07 10:35:23,565 main DEBUG PluginManager 'Level' found 1 plugins
  458. 2020-11-07 10:35:23,568 main DEBUG Building Plugin[name=property, class=org.apache.logging.log4j.core.config.Property].
  459. 2020-11-07 10:35:23,575 main DEBUG PluginManager 'TypeConverter' found 26 plugins
  460. 2020-11-07 10:35:23,581 main DEBUG createProperty(name="defaultPattern", value="%d{yyyyMMdd HH:mm:ss} %-5p %c{20}:%L - %m%n")
  461. 2020-11-07 10:35:23,581 main DEBUG Building Plugin[name=properties, class=org.apache.logging.log4j.core.config.PropertiesPlugin].
  462. 2020-11-07 10:35:23,584 main DEBUG configureSubstitutor(={defaultPattern=%d{yyyyMMdd HH:mm:ss} %-5p %c{20}:%L - %m%n}, Configuration(/Users/garydgregory/git/logging-log4j2/log4j-core/target/test-classes/log4j2-pattern-layout.xml))
  463. 2020-11-07 10:35:23,585 main DEBUG PluginManager 'Lookup' found 16 plugins
  464. 2020-11-07 10:35:23,585 main DEBUG Building Plugin[name=layout, class=org.apache.logging.log4j.core.layout.PatternLayout].
  465. 2020-11-07 10:35:23,589 main DEBUG PatternLayout$Builder(pattern="%d{yyyyMMdd HH:mm:ss} %-5p %c{20}:%L - %m%n", PatternSelector=null, Configuration(/Users/garydgregory/git/logging-log4j2/log4j-core/target/test-classes/log4j2-pattern-layout.xml), Replace=null, charset="null", alwaysWriteExceptions="null", disableAnsi="null", noConsoleNoAnsi="null", header="null", footer="null")
  466. 2020-11-07 10:35:23,589 main DEBUG PluginManager 'Converter' found 46 plugins
  467. 2020-11-07 10:35:23,597 main DEBUG Building Plugin[name=appender, class=org.apache.logging.log4j.test.appender.ListAppender].
  468. 2020-11-07 10:35:23,601 main DEBUG ListAppender$Builder(name="list", entryPerNewLine="null", raw="null", PatternLayout(%d{yyyyMMdd HH:mm:ss} %-5p %c{20}:%L - %m%n), Filter=null)
  469. 2020-11-07 10:35:23,601 main DEBUG Building Plugin[name=appenders, class=org.apache.logging.log4j.core.config.AppendersPlugin].
  470. 2020-11-07 10:35:23,601 main DEBUG createAppenders(={ListAppender [events=[], messages=[], data=[], newLine=false, raw=false, countDownLatch=null, getHandler()=org.apache.logging.log4j.core.appender.DefaultErrorHandler@73e22a3d, getLayout()=%d{yyyyMMdd HH:mm:ss} %-5p %c{20}:%L - %m%n, getName()=list, ignoreExceptions()=true, getFilter()=null, getState()=INITIALIZED]})
  471. 2020-11-07 10:35:23,602 main DEBUG Building Plugin[name=AppenderRef, class=org.apache.logging.log4j.core.config.AppenderRef].
  472. 2020-11-07 10:35:23,602 main DEBUG createAppenderRef(ref="list", level="null", Filter=null)
  473. 2020-11-07 10:35:23,602 main DEBUG Building Plugin[name=root, class=org.apache.logging.log4j.core.config.LoggerConfig$RootLogger].
  474. 2020-11-07 10:35:23,603 main DEBUG createLogger(additivity="null", level="INFO", includeLocation="null", ={list}, ={}, Configuration(/Users/garydgregory/git/logging-log4j2/log4j-core/target/test-classes/log4j2-pattern-layout.xml), Filter=null)
  475. 2020-11-07 10:35:23,604 main DEBUG Building Plugin[name=loggers, class=org.apache.logging.log4j.core.config.LoggersPlugin].
  476. 2020-11-07 10:35:23,605 main DEBUG createLoggers(={root})
  477. 2020-11-07 10:35:23,605 main DEBUG Configuration XmlConfiguration[location=/Users/garydgregory/git/logging-log4j2/log4j-core/target/test-classes/log4j2-pattern-layout.xml] initialized
  478. 2020-11-07 10:35:23,605 main DEBUG Starting configuration XmlConfiguration[location=/Users/garydgregory/git/logging-log4j2/log4j-core/target/test-classes/log4j2-pattern-layout.xml]
  479. 2020-11-07 10:35:23,606 main DEBUG Started configuration XmlConfiguration[location=/Users/garydgregory/git/logging-log4j2/log4j-core/target/test-classes/log4j2-pattern-layout.xml] OK.
  480. 2020-11-07 10:35:23,606 main DEBUG Shutting down OutputStreamManager SYSTEM_OUT.false.false-1
  481. 2020-11-07 10:35:23,606 main DEBUG OutputStream closed
  482. 2020-11-07 10:35:23,607 main DEBUG Shut down OutputStreamManager SYSTEM_OUT.false.false-1, all resources released: true
  483. 2020-11-07 10:35:23,607 main DEBUG Appender DefaultConsole-1 stopped with status true
  484. 2020-11-07 10:35:23,607 main DEBUG Stopped org.apache.logging.log4j.core.config.DefaultConfiguration@6b0c2d26 OK
  485. 2020-11-07 10:35:23,644 main DEBUG Registering MBean org.apache.logging.log4j2:type=org.apache.logging.log4j.core.PatternVariableResolverTest
  486. 2020-11-07 10:35:23,646 main DEBUG Registering MBean org.apache.logging.log4j2:type=org.apache.logging.log4j.core.PatternVariableResolverTest,component=StatusLogger
  487. 2020-11-07 10:35:23,648 main DEBUG Registering MBean org.apache.logging.log4j2:type=org.apache.logging.log4j.core.PatternVariableResolverTest,component=ContextSelector
  488. 2020-11-07 10:35:23,649 main DEBUG Registering MBean org.apache.logging.log4j2:type=org.apache.logging.log4j.core.PatternVariableResolverTest,component=Loggers,name=
  489. 2020-11-07 10:35:23,650 main DEBUG Registering MBean org.apache.logging.log4j2:type=org.apache.logging.log4j.core.PatternVariableResolverTest,component=Appenders,name=list
  490. 2020-11-07 10:35:23,652 main DEBUG org.apache.logging.log4j.core.util.SystemClock does not support precise timestamps.
  491. 2020-11-07 10:35:23,652 main DEBUG LoggerContext[name=org.apache.logging.log4j.core.PatternVariableResolverTest, org.apache.logging.log4j.core.LoggerContext@41ee392b] started OK with configuration XmlConfiguration[location=/Users/garydgregory/git/logging-log4j2/log4j-core/target/test-classes/log4j2-pattern-layout.xml].
  492. 2020-11-07 10:35:23,662 main DEBUG AsyncLogger.ThreadNameStrategy=UNCACHED (user specified null, default is UNCACHED)
  493. 2020-11-07 10:35:23,689 main DEBUG org.apache.logging.log4j.core.util.SystemClock does not support precise timestamps.
  494. 20201107 10:35:23 INFO  org.apache.logging.log4j.core.PatternVariableResolverTest:51 - This is a test
  495.  
  496. 2020-11-07 10:35:23,692 main DEBUG Stopping LoggerContext[name=org.apache.logging.log4j.core.PatternVariableResolverTest, org.apache.logging.log4j.core.LoggerContext@41ee392b]...
  497. 2020-11-07 10:35:23,693 main DEBUG Stopped XmlConfiguration[location=/Users/garydgregory/git/logging-log4j2/log4j-core/target/test-classes/log4j2-pattern-layout.xml] OK
  498. 2020-11-07 10:35:23,694 main DEBUG Stopped LoggerContext[name=org.apache.logging.log4j.core.PatternVariableResolverTest, org.apache.logging.log4j.core.LoggerContext@41ee392b] with status true
  499. [INFO] Tests run: 1, Failures: 0, Errors: 0, Skipped: 0, Time elapsed: 5.566 s - in org.apache.logging.log4j.core.PatternVariableResolverTest
  500. [INFO] Running org.apache.logging.log4j.core.EventParameterMemoryLeakTest
  501. [INFO] Tests run: 1, Failures: 0, Errors: 0, Skipped: 0, Time elapsed: 10.562 s - in org.apache.logging.log4j.core.EventParameterMemoryLeakTest
  502. [INFO] Running org.apache.logging.log4j.core.TimestampMessageTest
  503. [INFO] Tests run: 1, Failures: 0, Errors: 0, Skipped: 0, Time elapsed: 5.315 s - in org.apache.logging.log4j.core.TimestampMessageTest
  504. [INFO] Running org.apache.logging.log4j.core.GcFreeSynchronousLoggingTest
  505. [INFO] Tests run: 1, Failures: 0, Errors: 0, Skipped: 0, Time elapsed: 14.818 s - in org.apache.logging.log4j.core.GcFreeSynchronousLoggingTest
  506. [INFO] Running org.apache.logging.log4j.core.LevelTest
  507. [INFO] Tests run: 1, Failures: 0, Errors: 0, Skipped: 0, Time elapsed: 5.432 s - in org.apache.logging.log4j.core.LevelTest
  508. [INFO] Running org.apache.logging.log4j.core.filter.ScriptRefFilterTest
  509. [INFO] Tests run: 2, Failures: 0, Errors: 0, Skipped: 0, Time elapsed: 6.234 s - in org.apache.logging.log4j.core.filter.ScriptRefFilterTest
  510. [INFO] Running org.apache.logging.log4j.core.filter.ScriptFilterTest
  511. [INFO] Tests run: 2, Failures: 0, Errors: 0, Skipped: 0, Time elapsed: 6.256 s - in org.apache.logging.log4j.core.filter.ScriptFilterTest
  512. [INFO] Running org.apache.logging.log4j.core.filter.ScriptFileFilterPropertiesTest
  513. 2020-11-07 10:36:24,219 main ERROR ScriptFilter contains an invalid element or attribute "onMismatch"
  514. 2020-11-07 10:36:24,226 main ERROR ScriptFilter contains an invalid element or attribute "onMismatch"
  515. [INFO] Tests run: 2, Failures: 0, Errors: 0, Skipped: 0, Time elapsed: 6.2 s - in org.apache.logging.log4j.core.filter.ScriptFileFilterPropertiesTest
  516. [INFO] Running org.apache.logging.log4j.core.filter.MapFilterTest
  517. [INFO] Tests run: 2, Failures: 0, Errors: 0, Skipped: 0, Time elapsed: 5.317 s - in org.apache.logging.log4j.core.filter.MapFilterTest
  518. [INFO] Running org.apache.logging.log4j.core.filter.NoMarkerFilterTest
  519. [INFO] Tests run: 1, Failures: 0, Errors: 0, Skipped: 0, Time elapsed: 0.078 s - in org.apache.logging.log4j.core.filter.NoMarkerFilterTest
  520. [INFO] Running org.apache.logging.log4j.core.filter.TimeFilterTest
  521. [INFO] Tests run: 6, Failures: 0, Errors: 0, Skipped: 0, Time elapsed: 0.121 s - in org.apache.logging.log4j.core.filter.TimeFilterTest
  522. [INFO] Running org.apache.logging.log4j.core.filter.StructuredDataFilterTest
  523. [INFO] Tests run: 2, Failures: 0, Errors: 0, Skipped: 0, Time elapsed: 5.313 s - in org.apache.logging.log4j.core.filter.StructuredDataFilterTest
  524. [INFO] Running org.apache.logging.log4j.core.filter.BurstFilterLogDelayTest
  525. [INFO] Tests run: 1, Failures: 0, Errors: 0, Skipped: 0, Time elapsed: 0.052 s - in org.apache.logging.log4j.core.filter.BurstFilterLogDelayTest
  526. [INFO] Running org.apache.logging.log4j.core.filter.MarkerFilterTest
  527. [INFO] Tests run: 1, Failures: 0, Errors: 0, Skipped: 0, Time elapsed: 0.072 s - in org.apache.logging.log4j.core.filter.MarkerFilterTest
  528. [INFO] Running org.apache.logging.log4j.core.filter.DynamicThresholdFilterTest
  529. [INFO] Tests run: 3, Failures: 0, Errors: 0, Skipped: 0, Time elapsed: 5.31 s - in org.apache.logging.log4j.core.filter.DynamicThresholdFilterTest
  530. [INFO] Running org.apache.logging.log4j.core.filter.AbstractFilterableTest
  531. [INFO] Tests run: 17, Failures: 0, Errors: 0, Skipped: 0, Time elapsed: 0.068 s - in org.apache.logging.log4j.core.filter.AbstractFilterableTest
  532. [INFO] Running org.apache.logging.log4j.core.filter.ThresholdFilterTest
  533. [INFO] Tests run: 1, Failures: 0, Errors: 0, Skipped: 0, Time elapsed: 0.073 s - in org.apache.logging.log4j.core.filter.ThresholdFilterTest
  534. [INFO] Running org.apache.logging.log4j.core.filter.BurstFilterTest
  535. [INFO] Tests run: 1, Failures: 0, Errors: 0, Skipped: 0, Time elapsed: 12.228 s - in org.apache.logging.log4j.core.filter.BurstFilterTest
  536. [INFO] Running org.apache.logging.log4j.core.filter.RegexFilterTest
  537. [INFO] Tests run: 3, Failures: 0, Errors: 0, Skipped: 0, Time elapsed: 0.08 s - in org.apache.logging.log4j.core.filter.RegexFilterTest
  538. [INFO] Running org.apache.logging.log4j.core.filter.LevelRangeFilterTest
  539. [INFO] Tests run: 2, Failures: 0, Errors: 0, Skipped: 0, Time elapsed: 0.075 s - in org.apache.logging.log4j.core.filter.LevelRangeFilterTest
  540. [INFO] Running org.apache.logging.log4j.core.filter.AbstractFilterTest
  541. [INFO] Tests run: 1, Failures: 0, Errors: 0, Skipped: 0, Time elapsed: 0.049 s - in org.apache.logging.log4j.core.filter.AbstractFilterTest
  542. [INFO] Running org.apache.logging.log4j.core.filter.ScriptFileFilterTest
  543. [INFO] Tests run: 2, Failures: 0, Errors: 0, Skipped: 0, Time elapsed: 6.193 s - in org.apache.logging.log4j.core.filter.ScriptFileFilterTest
  544. [INFO] Running org.apache.logging.log4j.core.filter.ThreadContextMapFilterTest
  545. [INFO] Tests run: 1, Failures: 0, Errors: 0, Skipped: 0, Time elapsed: 0.071 s - in org.apache.logging.log4j.core.filter.ThreadContextMapFilterTest
  546. [INFO] Running org.apache.logging.log4j.core.pattern.ThreadIdPatternConverterTest
  547. [INFO] Tests run: 1, Failures: 0, Errors: 0, Skipped: 0, Time elapsed: 0.072 s - in org.apache.logging.log4j.core.pattern.ThreadIdPatternConverterTest
  548. [INFO] Running org.apache.logging.log4j.core.pattern.DatePatternConverterTest
  549. [INFO] Tests run: 56, Failures: 0, Errors: 0, Skipped: 0, Time elapsed: 0.131 s - in org.apache.logging.log4j.core.pattern.DatePatternConverterTest
  550. [INFO] Running org.apache.logging.log4j.core.pattern.ThreadNamePatternConverterTest
  551. [INFO] Tests run: 1, Failures: 0, Errors: 0, Skipped: 0, Time elapsed: 0.072 s - in org.apache.logging.log4j.core.pattern.ThreadNamePatternConverterTest
  552. [INFO] Running org.apache.logging.log4j.core.pattern.MessagePatternConverterTest
  553. [INFO] Tests run: 10, Failures: 0, Errors: 0, Skipped: 0, Time elapsed: 0.212 s - in org.apache.logging.log4j.core.pattern.MessagePatternConverterTest
  554. [INFO] Running org.apache.logging.log4j.core.pattern.EncodingPatternConverterTest
  555. [INFO] Tests run: 4, Failures: 0, Errors: 0, Skipped: 0, Time elapsed: 5.275 s - in org.apache.logging.log4j.core.pattern.EncodingPatternConverterTest
  556. [INFO] Running org.apache.logging.log4j.core.pattern.HighlightConverterTest
  557. [INFO] Tests run: 8, Failures: 0, Errors: 0, Skipped: 0, Time elapsed: 0.147 s - in org.apache.logging.log4j.core.pattern.HighlightConverterTest
  558. [INFO] Running org.apache.logging.log4j.core.pattern.MessageJansiConverterTest
  559. [INFO] Tests run: 1, Failures: 0, Errors: 0, Skipped: 0, Time elapsed: 5.319 s - in org.apache.logging.log4j.core.pattern.MessageJansiConverterTest
  560. [INFO] Running org.apache.logging.log4j.core.pattern.FormattingInfoTest
  561. [INFO] Tests run: 3, Failures: 0, Errors: 0, Skipped: 0, Time elapsed: 0.028 s - in org.apache.logging.log4j.core.pattern.FormattingInfoTest
  562. [INFO] Running org.apache.logging.log4j.core.pattern.NameAbbreviatorTest
  563. [INFO] Tests run: 24, Failures: 0, Errors: 0, Skipped: 0, Time elapsed: 0.018 s - in org.apache.logging.log4j.core.pattern.NameAbbreviatorTest
  564. [INFO] Running org.apache.logging.log4j.core.pattern.NoConsoleNoAnsiTest
  565. [INFO] Tests run: 1, Failures: 0, Errors: 0, Skipped: 0, Time elapsed: 5.334 s - in org.apache.logging.log4j.core.pattern.NoConsoleNoAnsiTest
  566. [INFO] Running org.apache.logging.log4j.core.pattern.EqualsIgnoreCaseReplacementConverterTest
  567. [INFO] Tests run: 3, Failures: 0, Errors: 0, Skipped: 0, Time elapsed: 5.26 s - in org.apache.logging.log4j.core.pattern.EqualsIgnoreCaseReplacementConverterTest
  568. [INFO] Running org.apache.logging.log4j.core.pattern.MarkerPatternConverterTest
  569. [INFO] Tests run: 1, Failures: 0, Errors: 0, Skipped: 0, Time elapsed: 0.074 s - in org.apache.logging.log4j.core.pattern.MarkerPatternConverterTest
  570. [INFO] Running org.apache.logging.log4j.core.pattern.RegexReplacementTest
  571. [INFO] Tests run: 2, Failures: 0, Errors: 0, Skipped: 0, Time elapsed: 5.334 s - in org.apache.logging.log4j.core.pattern.RegexReplacementTest
  572. [INFO] Running org.apache.logging.log4j.core.pattern.RootThrowableTest
  573. [INFO] Tests run: 1, Failures: 0, Errors: 0, Skipped: 0, Time elapsed: 5.324 s - in org.apache.logging.log4j.core.pattern.RootThrowableTest
  574. [INFO] Running org.apache.logging.log4j.core.pattern.CallerInformationTest
  575. [INFO] Tests run: 2, Failures: 0, Errors: 0, Skipped: 0, Time elapsed: 5.319 s - in org.apache.logging.log4j.core.pattern.CallerInformationTest
  576. [INFO] Running org.apache.logging.log4j.core.pattern.StyleConverterTest
  577. [INFO] Tests run: 2, Failures: 0, Errors: 0, Skipped: 0, Time elapsed: 5.325 s - in org.apache.logging.log4j.core.pattern.StyleConverterTest
  578. [INFO] Running org.apache.logging.log4j.core.pattern.MdcPatternConverterTest
  579. [INFO] Tests run: 9, Failures: 0, Errors: 0, Skipped: 0, Time elapsed: 0.085 s - in org.apache.logging.log4j.core.pattern.MdcPatternConverterTest
  580. [INFO] Running org.apache.logging.log4j.core.pattern.ProcessIdPatternConverterTest
  581. [INFO] Tests run: 1, Failures: 0, Errors: 0, Skipped: 0, Time elapsed: 5.064 s - in org.apache.logging.log4j.core.pattern.ProcessIdPatternConverterTest
  582. [INFO] Running org.apache.logging.log4j.core.pattern.EqualsReplacementConverterTest
  583. [INFO] Tests run: 8, Failures: 0, Errors: 0, Skipped: 0, Time elapsed: 5.275 s - in org.apache.logging.log4j.core.pattern.EqualsReplacementConverterTest
  584. [INFO] Running org.apache.logging.log4j.core.pattern.EndOfBatchPatternConverterTest
  585. [INFO] Tests run: 2, Failures: 0, Errors: 0, Skipped: 0, Time elapsed: 0.076 s - in org.apache.logging.log4j.core.pattern.EndOfBatchPatternConverterTest
  586. [INFO] Running org.apache.logging.log4j.core.pattern.RegexReplacementConverterTest
  587. [INFO] Tests run: 1, Failures: 0, Errors: 0, Skipped: 0, Time elapsed: 5.26 s - in org.apache.logging.log4j.core.pattern.RegexReplacementConverterTest
  588. [INFO] Running org.apache.logging.log4j.core.pattern.DisableAnsiTest
  589. [INFO] Tests run: 1, Failures: 0, Errors: 0, Skipped: 0, Time elapsed: 5.368 s - in org.apache.logging.log4j.core.pattern.DisableAnsiTest
  590. [INFO] Running org.apache.logging.log4j.core.pattern.NanoTimePatternConverterTest
  591. [INFO] Tests run: 1, Failures: 0, Errors: 0, Skipped: 0, Time elapsed: 0.073 s - in org.apache.logging.log4j.core.pattern.NanoTimePatternConverterTest
  592. [INFO] Running org.apache.logging.log4j.core.pattern.RootThrowablePatternConverterTest
  593. [INFO] Tests run: 5, Failures: 0, Errors: 0, Skipped: 0, Time elapsed: 0.158 s - in org.apache.logging.log4j.core.pattern.RootThrowablePatternConverterTest
  594. [INFO] Running org.apache.logging.log4j.core.pattern.SequenceNumberPatternConverterTest
  595. 2020-11-07 10:38:38,567 main ERROR Invalid status level specified: false. Defaulting to ERROR.
  596. [INFO] Tests run: 1, Failures: 0, Errors: 0, Skipped: 0, Time elapsed: 5.412 s - in org.apache.logging.log4j.core.pattern.SequenceNumberPatternConverterTest
  597. [INFO] Running org.apache.logging.log4j.core.pattern.MarkerSimpleNamePatternConverterTest
  598. [INFO] Tests run: 1, Failures: 0, Errors: 0, Skipped: 0, Time elapsed: 0.074 s - in org.apache.logging.log4j.core.pattern.MarkerSimpleNamePatternConverterTest
  599. [INFO] Running org.apache.logging.log4j.core.pattern.MaxLengthConverterTest
  600. [INFO] Tests run: 3, Failures: 0, Errors: 0, Skipped: 0, Time elapsed: 0.141 s - in org.apache.logging.log4j.core.pattern.MaxLengthConverterTest
  601. [INFO] Running org.apache.logging.log4j.core.pattern.NdcPatternConverterTest
  602. [INFO] Tests run: 4, Failures: 0, Errors: 0, Skipped: 0, Time elapsed: 0.077 s - in org.apache.logging.log4j.core.pattern.NdcPatternConverterTest
  603. [INFO] Running org.apache.logging.log4j.core.pattern.LoggerFqcnPatternConverterTest
  604. [INFO] Tests run: 1, Failures: 0, Errors: 0, Skipped: 0, Time elapsed: 0.072 s - in org.apache.logging.log4j.core.pattern.LoggerFqcnPatternConverterTest
  605. [INFO] Running org.apache.logging.log4j.core.pattern.SequenceNumberPatternConverterZeroPaddedTest
  606. 2020-11-07 10:38:48,651 main ERROR Invalid status level specified: false. Defaulting to ERROR.
  607. [INFO] Tests run: 1, Failures: 0, Errors: 0, Skipped: 0, Time elapsed: 5.399 s - in org.apache.logging.log4j.core.pattern.SequenceNumberPatternConverterZeroPaddedTest
  608. [INFO] Running org.apache.logging.log4j.core.pattern.VariablesNotEmptyReplacementConverterTest
  609. [INFO] Tests run: 6, Failures: 0, Errors: 0, Skipped: 0, Time elapsed: 5.26 s - in org.apache.logging.log4j.core.pattern.VariablesNotEmptyReplacementConverterTest
  610. [INFO] Running org.apache.logging.log4j.core.pattern.MessageStyledConverterTest
  611. [INFO] Tests run: 1, Failures: 0, Errors: 0, Skipped: 0, Time elapsed: 5.343 s - in org.apache.logging.log4j.core.pattern.MessageStyledConverterTest
  612. [INFO] Running org.apache.logging.log4j.core.pattern.LiteralPatternConverterTest
  613. [INFO] Tests run: 2, Failures: 0, Errors: 0, Skipped: 0, Time elapsed: 0.053 s - in org.apache.logging.log4j.core.pattern.LiteralPatternConverterTest
  614. [INFO] Running org.apache.logging.log4j.core.pattern.MapPatternConverterTest
  615. [INFO] Tests run: 3, Failures: 0, Errors: 0, Skipped: 0, Time elapsed: 0.076 s - in org.apache.logging.log4j.core.pattern.MapPatternConverterTest
  616. [INFO] Running org.apache.logging.log4j.core.pattern.ThrowablePatternConverterTest
  617. [INFO] Tests run: 10, Failures: 0, Errors: 0, Skipped: 0, Time elapsed: 0.149 s - in org.apache.logging.log4j.core.pattern.ThrowablePatternConverterTest
  618. [INFO] Running org.apache.logging.log4j.core.pattern.ExtendedThrowablePatternConverterTest
  619. [INFO] Tests run: 7, Failures: 0, Errors: 0, Skipped: 0, Time elapsed: 0.16 s - in org.apache.logging.log4j.core.pattern.ExtendedThrowablePatternConverterTest
  620. [INFO] Running org.apache.logging.log4j.core.pattern.LevelPatternConverterTest
  621. [INFO] Tests run: 8, Failures: 0, Errors: 0, Skipped: 0, Time elapsed: 0.078 s - in org.apache.logging.log4j.core.pattern.LevelPatternConverterTest
  622. [INFO] Running org.apache.logging.log4j.core.pattern.ExtendedThrowableTest
  623. [INFO] Tests run: 1, Failures: 0, Errors: 0, Skipped: 0, Time elapsed: 5.329 s - in org.apache.logging.log4j.core.pattern.ExtendedThrowableTest
  624. [INFO] Running org.apache.logging.log4j.core.pattern.ThrowableTest
  625. [INFO] Tests run: 1, Failures: 0, Errors: 0, Skipped: 0, Time elapsed: 5.32 s - in org.apache.logging.log4j.core.pattern.ThrowableTest
  626. [INFO] Running org.apache.logging.log4j.core.pattern.PatternParserTest
  627. [INFO] Tests run: 26, Failures: 0, Errors: 0, Skipped: 0, Time elapsed: 5.299 s - in org.apache.logging.log4j.core.pattern.PatternParserTest
  628. [INFO] Running org.apache.logging.log4j.core.pattern.ThreadPriorityPatternConverterTest
  629. [INFO] Tests run: 1, Failures: 0, Errors: 0, Skipped: 0, Time elapsed: 0.073 s - in org.apache.logging.log4j.core.pattern.ThreadPriorityPatternConverterTest
  630. [INFO] Running org.apache.logging.log4j.core.ExtendedLevelTest
  631. [INFO] Tests run: 1, Failures: 0, Errors: 0, Skipped: 0, Time elapsed: 5.323 s - in org.apache.logging.log4j.core.ExtendedLevelTest
  632. [INFO] Running org.apache.logging.log4j.core.LoggerSerializationTest
  633. [INFO] Tests run: 8, Failures: 0, Errors: 0, Skipped: 0, Time elapsed: 5.053 s - in org.apache.logging.log4j.core.LoggerSerializationTest
  634. [INFO] Running org.apache.logging.log4j.core.BasicLoggingTest
  635. 10:39:52.911 [main] ERROR org.apache.logging.log4j.core.BasicLoggingTest - Test message
  636. [INFO] Tests run: 1, Failures: 0, Errors: 0, Skipped: 0, Time elapsed: 5.271 s - in org.apache.logging.log4j.core.BasicLoggingTest
  637. [INFO] Running org.apache.logging.log4j.core.LoggerTest
  638. [INFO] Tests run: 26, Failures: 0, Errors: 0, Skipped: 0, Time elapsed: 161.88 s - in org.apache.logging.log4j.core.LoggerTest
  639. [INFO] Running org.apache.logging.log4j.core.Log4j1222Test
  640. [INFO] Tests run: 1, Failures: 0, Errors: 0, Skipped: 0, Time elapsed: 0.022 s - in org.apache.logging.log4j.core.Log4j1222Test
  641. 2020-11-07 10:42:42,080 [Thread-1] INFO : Attempt to trigger
  642. Exception in thread "Thread-1" java.lang.AssertionError: Logger is of type org.apache.logging.log4j.core.Logger
  643.     at org.junit.Assert.fail(Assert.java:89)
  644.     at org.junit.Assert.assertTrue(Assert.java:42)
  645.     at org.apache.logging.log4j.core.Log4j1222Test$ShutdownHook.trigger(Log4j1222Test.java:56)
  646.     at org.apache.logging.log4j.core.Log4j1222Test$ShutdownHook.run(Log4j1222Test.java:51)
  647. [INFO] Running org.apache.logging.log4j.core.PropertiesFileConfigTest
  648. 2020-11-07 10:42:42,744 main DEBUG Starting LoggerContext[name=PropertiesFileConfigTest] from configuration at log4j-test2.properties
  649. 2020-11-07 10:42:42,746 main DEBUG Starting LoggerContext[name=PropertiesFileConfigTest, org.apache.logging.log4j.core.LoggerContext@2f112965] with configuration org.apache.logging.log4j.core.config.properties.PropertiesConfiguration@1a04f701...
  650. 2020-11-07 10:42:42,747 main DEBUG Shutdown hook enabled. Registering a new one.
  651. 2020-11-07 10:42:47,759 main DEBUG null null initializing configuration org.apache.logging.log4j.core.config.properties.PropertiesConfiguration@1a04f701
  652. 2020-11-07 10:42:47,764 main DEBUG Installed 3 script engines
  653. 2020-11-07 10:42:47,804 main DEBUG Groovy Scripting Engine version: 2.0, language: Groovy, threading: MULTITHREADED, compile: true, names: [groovy, Groovy], factory class: org.codehaus.groovy.jsr223.GroovyScriptEngineFactory
  654. 2020-11-07 10:42:47,839 main DEBUG BeanShell Engine version: 1.0, language: BeanShell, threading: MULTITHREADED, compile: true, names: [beanshell, bsh, java], factory class: bsh.engine.BshScriptEngineFactory
  655. 2020-11-07 10:42:48,030 main DEBUG Oracle Nashorn version: 1.8.0_272, language: ECMAScript, threading: Not Thread Safe, compile: true, names: [nashorn, Nashorn, js, JS, JavaScript, javascript, ECMAScript, ecmascript], factory class: jdk.nashorn.api.scripting.NashornScriptEngineFactory
  656. 2020-11-07 10:42:48,030 main DEBUG PluginManager 'Core' found 131 plugins
  657. 2020-11-07 10:42:48,030 main DEBUG PluginManager 'Level' found 1 plugins
  658. 2020-11-07 10:42:48,034 main DEBUG Building Plugin[name=property, class=org.apache.logging.log4j.core.config.Property].
  659. 2020-11-07 10:42:48,043 main DEBUG PluginManager 'TypeConverter' found 26 plugins
  660. 2020-11-07 10:42:48,049 main DEBUG createProperty(name="filename", value="target/test-properties.log")
  661. 2020-11-07 10:42:48,050 main DEBUG Building Plugin[name=properties, class=org.apache.logging.log4j.core.config.PropertiesPlugin].
  662. 2020-11-07 10:42:48,056 main DEBUG configureSubstitutor(={filename=target/test-properties.log}, Configuration(PropertiesConfigTest))
  663. 2020-11-07 10:42:48,057 main DEBUG PluginManager 'Lookup' found 16 plugins
  664. 2020-11-07 10:42:48,058 main DEBUG Building Plugin[name=AppenderRef, class=org.apache.logging.log4j.core.config.AppenderRef].
  665. 2020-11-07 10:42:48,058 main DEBUG createAppenderRef(ref="File", level="null", Filter=null)
  666. 2020-11-07 10:42:48,058 main DEBUG Building Plugin[name=logger, class=org.apache.logging.log4j.core.config.LoggerConfig].
  667. 2020-11-07 10:42:48,063 main DEBUG createLogger(additivity="false", level="DEBUG", name="org.apache.logging.log4j.test2", includeLocation="null", ={File}, ={}, Configuration(PropertiesConfigTest), Filter=null)
  668. 2020-11-07 10:42:48,066 main DEBUG Building Plugin[name=AppenderRef, class=org.apache.logging.log4j.core.config.AppenderRef].
  669. 2020-11-07 10:42:48,066 main DEBUG createAppenderRef(ref="STDOUT", level="null", Filter=null)
  670. 2020-11-07 10:42:48,067 main DEBUG Building Plugin[name=KeyValuePair, class=org.apache.logging.log4j.core.util.KeyValuePair].
  671. 2020-11-07 10:42:48,080 main DEBUG KeyValuePair$Builder(key="test", value="123")
  672. 2020-11-07 10:42:48,081 main DEBUG Building Plugin[name=filter, class=org.apache.logging.log4j.core.filter.ThreadContextMapFilter].
  673. 2020-11-07 10:42:48,085 main DEBUG createFilter(={test=123}, operator="null", onMatch="null", onMismatch="null")
  674. 2020-11-07 10:42:48,086 main DEBUG Building Plugin[name=logger, class=org.apache.logging.log4j.core.config.LoggerConfig].
  675. 2020-11-07 10:42:48,087 main DEBUG createLogger(additivity="false", level="DEBUG", name="org.apache.logging.log4j.test1", includeLocation="null", ={STDOUT}, ={}, Configuration(PropertiesConfigTest), ThreadContextMapFilter(isAnd=true, {test=[123]}))
  676. 2020-11-07 10:42:48,087 main DEBUG Building Plugin[name=AppenderRef, class=org.apache.logging.log4j.core.config.AppenderRef].
  677. 2020-11-07 10:42:48,088 main DEBUG createAppenderRef(ref="STDOUT", level="null", Filter=null)
  678. 2020-11-07 10:42:48,088 main DEBUG Building Plugin[name=root, class=org.apache.logging.log4j.core.config.LoggerConfig$RootLogger].
  679. 2020-11-07 10:42:48,089 main DEBUG createLogger(additivity="null", level="ERROR", includeLocation="null", ={STDOUT}, ={}, Configuration(PropertiesConfigTest), Filter=null)
  680. 2020-11-07 10:42:48,090 main DEBUG Building Plugin[name=loggers, class=org.apache.logging.log4j.core.config.LoggersPlugin].
  681. 2020-11-07 10:42:48,092 main DEBUG createLoggers(={org.apache.logging.log4j.test2, org.apache.logging.log4j.test1, root})
  682. 2020-11-07 10:42:48,093 main DEBUG Building Plugin[name=layout, class=org.apache.logging.log4j.core.layout.PatternLayout].
  683. 2020-11-07 10:42:48,094 main DEBUG PatternLayout$Builder(pattern="%m%n", PatternSelector=null, Configuration(PropertiesConfigTest), Replace=null, charset="null", alwaysWriteExceptions="null", disableAnsi="null", noConsoleNoAnsi="null", header="null", footer="null")
  684. 2020-11-07 10:42:48,095 main DEBUG PluginManager 'Converter' found 46 plugins
  685. 2020-11-07 10:42:48,095 main DEBUG Building Plugin[name=appender, class=org.apache.logging.log4j.core.appender.ConsoleAppender].
  686. 2020-11-07 10:42:48,099 main DEBUG ConsoleAppender$Builder(target="null", follow="null", direct="null", bufferedIo="null", bufferSize="null", immediateFlush="null", ignoreExceptions="null", PatternLayout(%m%n), name="STDOUT", Configuration(PropertiesConfigTest), Filter=null, ={})
  687. 2020-11-07 10:42:48,101 main DEBUG Starting OutputStreamManager SYSTEM_OUT.false.false
  688. 2020-11-07 10:42:48,101 main DEBUG Building Plugin[name=layout, class=org.apache.logging.log4j.core.layout.PatternLayout].
  689. 2020-11-07 10:42:48,101 main DEBUG PatternLayout$Builder(pattern="%d %p %C{1.} [%t] %m%n", PatternSelector=null, Configuration(PropertiesConfigTest), Replace=null, charset="null", alwaysWriteExceptions="null", disableAnsi="null", noConsoleNoAnsi="null", header="null", footer="null")
  690. 2020-11-07 10:42:48,116 main DEBUG Building Plugin[name=appender, class=org.apache.logging.log4j.core.appender.FileAppender].
  691. 2020-11-07 10:42:48,118 main DEBUG FileAppender$Builder(fileName="target/test-properties.log", append="null", locking="null", advertise="null", advertiseUri="null", createOnDemand="null", filePermissions="null", fileOwner="null", fileGroup="null", bufferedIo="false", bufferSize="null", immediateFlush="null", ignoreExceptions="null", PatternLayout(%d %p %C{1.} [%t] %m%n), name="File", Configuration(PropertiesConfigTest), Filter=null, ={})
  692. 2020-11-07 10:42:48,119 main WARN The bufferSize is set to 8192 but bufferedIo is false: false
  693. 2020-11-07 10:42:48,121 main DEBUG Starting FileManager target/test-properties.log
  694. 2020-11-07 10:42:48,123 main DEBUG Building Plugin[name=filter, class=org.apache.logging.log4j.core.filter.ThresholdFilter].
  695. 2020-11-07 10:42:48,127 main DEBUG createFilter(level="ERROR", onMatch="null", onMismatch="null")
  696. 2020-11-07 10:42:48,127 main DEBUG Building Plugin[name=appender, class=org.apache.logging.log4j.test.appender.ListAppender].
  697. 2020-11-07 10:42:48,128 main DEBUG ListAppender$Builder(name="List", entryPerNewLine="null", raw="null", Layout=null, ThresholdFilter(ERROR))
  698. 2020-11-07 10:42:48,128 main DEBUG Building Plugin[name=appenders, class=org.apache.logging.log4j.core.config.AppendersPlugin].
  699. 2020-11-07 10:42:48,129 main DEBUG createAppenders(={STDOUT, File, ListAppender [events=[], messages=[], data=[], newLine=false, raw=false, countDownLatch=null, getHandler()=org.apache.logging.log4j.core.appender.DefaultErrorHandler@3b0fe47a, getLayout()=null, getName()=List, ignoreExceptions()=true, getFilter()=ERROR, getState()=INITIALIZED]})
  700. 2020-11-07 10:42:48,129 main DEBUG Building Plugin[name=filter, class=org.apache.logging.log4j.core.filter.ThresholdFilter].
  701. 2020-11-07 10:42:48,129 main DEBUG createFilter(level="DEBUG", onMatch="null", onMismatch="null")
  702. 2020-11-07 10:42:48,130 main DEBUG Configuration org.apache.logging.log4j.core.config.properties.PropertiesConfiguration@1a04f701 initialized
  703. 2020-11-07 10:42:48,130 main DEBUG Starting configuration org.apache.logging.log4j.core.config.properties.PropertiesConfiguration@1a04f701
  704. 2020-11-07 10:42:48,131 main DEBUG Log4j2 ConfigurationScheduler starting 1 threads
  705. 2020-11-07 10:42:48,132 main DEBUG Started configuration org.apache.logging.log4j.core.config.properties.PropertiesConfiguration@1a04f701 OK.
  706. 2020-11-07 10:42:48,132 main DEBUG Shutting down OutputStreamManager SYSTEM_OUT.false.false-1
  707. 2020-11-07 10:42:48,132 main DEBUG OutputStream closed
  708. 2020-11-07 10:42:48,133 main DEBUG Shut down OutputStreamManager SYSTEM_OUT.false.false-1, all resources released: true
  709. 2020-11-07 10:42:48,133 main DEBUG Appender DefaultConsole-1 stopped with status true
  710. 2020-11-07 10:42:48,133 main DEBUG Stopped org.apache.logging.log4j.core.config.DefaultConfiguration@7ea37dbf OK
  711. 2020-11-07 10:42:48,174 main DEBUG Registering MBean org.apache.logging.log4j2:type=PropertiesFileConfigTest
  712. 2020-11-07 10:42:48,177 main DEBUG Registering MBean org.apache.logging.log4j2:type=PropertiesFileConfigTest,component=StatusLogger
  713. 2020-11-07 10:42:48,178 main DEBUG Registering MBean org.apache.logging.log4j2:type=PropertiesFileConfigTest,component=ContextSelector
  714. 2020-11-07 10:42:48,180 main DEBUG Registering MBean org.apache.logging.log4j2:type=PropertiesFileConfigTest,component=Loggers,name=org.apache.logging.log4j.test1
  715. 2020-11-07 10:42:48,181 main DEBUG Registering MBean org.apache.logging.log4j2:type=PropertiesFileConfigTest,component=Loggers,name=
  716. 2020-11-07 10:42:48,181 main DEBUG Registering MBean org.apache.logging.log4j2:type=PropertiesFileConfigTest,component=Loggers,name=org.apache.logging.log4j.test2
  717. 2020-11-07 10:42:48,182 main DEBUG Registering MBean org.apache.logging.log4j2:type=PropertiesFileConfigTest,component=Appenders,name=STDOUT
  718. 2020-11-07 10:42:48,183 main DEBUG Registering MBean org.apache.logging.log4j2:type=PropertiesFileConfigTest,component=Appenders,name=List
  719. 2020-11-07 10:42:48,183 main DEBUG Registering MBean org.apache.logging.log4j2:type=PropertiesFileConfigTest,component=Appenders,name=File
  720. 2020-11-07 10:42:48,187 main DEBUG org.apache.logging.log4j.core.util.SystemClock does not support precise timestamps.
  721. 2020-11-07 10:42:48,187 main DEBUG LoggerContext[name=PropertiesFileConfigTest, org.apache.logging.log4j.core.LoggerContext@2f112965] started OK with configuration org.apache.logging.log4j.core.config.properties.PropertiesConfiguration@1a04f701.
  722. 2020-11-07 10:42:49,138 Log4j2-TF-2-Scheduled-1 INFO Source '/Users/garydgregory/git/logging-log4j2/log4j-core/target/test-classes/log4j-test2.properties' was modified on Sat Nov 07 09:39:04 EST 2020 (1604759944000), previous modification was on Sat Nov 07 09:38:54 EST 2020 (1604759934000)
  723. 2020-11-07 10:42:49,139 Log4j2-TF-1-ConfiguratonFileWatcher-2 DEBUG Reconfiguration started for context PropertiesFileConfigTest (org.apache.logging.log4j.core.LoggerContext@2f112965)
  724. 2020-11-07 10:42:49,140 Log4j2-TF-1-ConfiguratonFileWatcher-2 INFO Log4j appears to be running in a Servlet environment, but there's no log4j-web module available. If you want better web container support, please add the log4j-web JAR to your web archive or server lib directory.
  725. 2020-11-07 10:42:49,142 Log4j2-TF-1-ConfiguratonFileWatcher-2 INFO Log4j appears to be running in a Servlet environment, but there's no log4j-web module available. If you want better web container support, please add the log4j-web JAR to your web archive or server lib directory.
  726. 2020-11-07 10:42:49,143 Log4j2-TF-1-ConfiguratonFileWatcher-2 DEBUG Watching configuration '/Users/garydgregory/git/logging-log4j2/log4j-core/target/test-classes/log4j-test2.properties' for lastModified Sat Nov 07 09:39:04 EST 2020 (1604759944000)
  727. 2020-11-07 10:42:50,140 Log4j2-TF-2-Scheduled-1 INFO Source '/Users/garydgregory/git/logging-log4j2/log4j-core/target/test-classes/log4j-test2.properties' was modified on Sat Nov 07 09:39:04 EST 2020 (1604759944000), previous modification was on Sat Nov 07 09:39:04 EST 2020 (1604759944000)
  728. 2020-11-07 10:42:51,141 Log4j2-TF-2-Scheduled-1 INFO Source '/Users/garydgregory/git/logging-log4j2/log4j-core/target/test-classes/log4j-test2.properties' was modified on Sat Nov 07 09:39:04 EST 2020 (1604759944000), previous modification was on Sat Nov 07 09:39:04 EST 2020 (1604759944000)
  729. 2020-11-07 10:42:52,142 Log4j2-TF-2-Scheduled-1 INFO Source '/Users/garydgregory/git/logging-log4j2/log4j-core/target/test-classes/log4j-test2.properties' was modified on Sat Nov 07 09:39:04 EST 2020 (1604759944000), previous modification was on Sat Nov 07 09:39:04 EST 2020 (1604759944000)
  730. 2020-11-07 10:42:53,144 Log4j2-TF-2-Scheduled-1 INFO Source '/Users/garydgregory/git/logging-log4j2/log4j-core/target/test-classes/log4j-test2.properties' was modified on Sat Nov 07 09:39:04 EST 2020 (1604759944000), previous modification was on Sat Nov 07 09:39:04 EST 2020 (1604759944000)
  731. 2020-11-07 10:42:54,146 Log4j2-TF-2-Scheduled-1 INFO Source '/Users/garydgregory/git/logging-log4j2/log4j-core/target/test-classes/log4j-test2.properties' was modified on Sat Nov 07 09:39:04 EST 2020 (1604759944000), previous modification was on Sat Nov 07 09:39:04 EST 2020 (1604759944000)
  732. 2020-11-07 10:42:54,147 Log4j2-TF-1-ConfiguratonFileWatcher-2 DEBUG null null initializing configuration org.apache.logging.log4j.core.config.properties.PropertiesConfiguration@1356e080
  733. 2020-11-07 10:42:54,149 Log4j2-TF-1-ConfiguratonFileWatcher-2 DEBUG Installed 3 script engines
  734. 2020-11-07 10:42:54,154 Log4j2-TF-1-ConfiguratonFileWatcher-2 DEBUG BeanShell Engine version: 1.0, language: BeanShell, threading: MULTITHREADED, compile: true, names: [beanshell, bsh, java], factory class: bsh.engine.BshScriptEngineFactory
  735. 2020-11-07 10:42:54,154 Log4j2-TF-1-ConfiguratonFileWatcher-2 DEBUG Groovy Scripting Engine version: 2.0, language: Groovy, threading: MULTITHREADED, compile: true, names: [groovy, Groovy], factory class: org.codehaus.groovy.jsr223.GroovyScriptEngineFactory
  736. 2020-11-07 10:42:54,160 Log4j2-TF-1-ConfiguratonFileWatcher-2 DEBUG Oracle Nashorn version: 1.8.0_272, language: ECMAScript, threading: Not Thread Safe, compile: true, names: [nashorn, Nashorn, js, JS, JavaScript, javascript, ECMAScript, ecmascript], factory class: jdk.nashorn.api.scripting.NashornScriptEngineFactory
  737. 2020-11-07 10:42:54,192 Log4j2-TF-1-ConfiguratonFileWatcher-2 DEBUG PluginManager 'Core' found 131 plugins
  738. 2020-11-07 10:42:54,192 Log4j2-TF-1-ConfiguratonFileWatcher-2 DEBUG PluginManager 'Level' found 1 plugins
  739. 2020-11-07 10:42:54,193 Log4j2-TF-1-ConfiguratonFileWatcher-2 DEBUG Building Plugin[name=property, class=org.apache.logging.log4j.core.config.Property].
  740. 2020-11-07 10:42:54,194 Log4j2-TF-1-ConfiguratonFileWatcher-2 DEBUG createProperty(name="filename", value="target/test-properties.log")
  741. 2020-11-07 10:42:54,194 Log4j2-TF-1-ConfiguratonFileWatcher-2 DEBUG Building Plugin[name=properties, class=org.apache.logging.log4j.core.config.PropertiesPlugin].
  742. 2020-11-07 10:42:54,194 Log4j2-TF-1-ConfiguratonFileWatcher-2 DEBUG configureSubstitutor(={filename=target/test-properties.log}, Configuration(PropertiesConfigTest))
  743. 2020-11-07 10:42:54,194 Log4j2-TF-1-ConfiguratonFileWatcher-2 DEBUG PluginManager 'Lookup' found 16 plugins
  744. 2020-11-07 10:42:54,195 Log4j2-TF-1-ConfiguratonFileWatcher-2 DEBUG Building Plugin[name=AppenderRef, class=org.apache.logging.log4j.core.config.AppenderRef].
  745. 2020-11-07 10:42:54,195 Log4j2-TF-1-ConfiguratonFileWatcher-2 DEBUG createAppenderRef(ref="File", level="null", Filter=null)
  746. 2020-11-07 10:42:54,195 Log4j2-TF-1-ConfiguratonFileWatcher-2 DEBUG Building Plugin[name=logger, class=org.apache.logging.log4j.core.config.LoggerConfig].
  747. 2020-11-07 10:42:54,195 Log4j2-TF-1-ConfiguratonFileWatcher-2 DEBUG createLogger(additivity="false", level="DEBUG", name="org.apache.logging.log4j.test2", includeLocation="null", ={File}, ={}, Configuration(PropertiesConfigTest), Filter=null)
  748. 2020-11-07 10:42:54,196 Log4j2-TF-1-ConfiguratonFileWatcher-2 DEBUG Building Plugin[name=AppenderRef, class=org.apache.logging.log4j.core.config.AppenderRef].
  749. 2020-11-07 10:42:54,196 Log4j2-TF-1-ConfiguratonFileWatcher-2 DEBUG createAppenderRef(ref="STDOUT", level="null", Filter=null)
  750. 2020-11-07 10:42:54,196 Log4j2-TF-1-ConfiguratonFileWatcher-2 DEBUG Building Plugin[name=KeyValuePair, class=org.apache.logging.log4j.core.util.KeyValuePair].
  751. 2020-11-07 10:42:54,196 Log4j2-TF-1-ConfiguratonFileWatcher-2 DEBUG KeyValuePair$Builder(key="test", value="123")
  752. 2020-11-07 10:42:54,196 Log4j2-TF-1-ConfiguratonFileWatcher-2 DEBUG Building Plugin[name=filter, class=org.apache.logging.log4j.core.filter.ThreadContextMapFilter].
  753. 2020-11-07 10:42:54,197 Log4j2-TF-1-ConfiguratonFileWatcher-2 DEBUG createFilter(={test=123}, operator="null", onMatch="null", onMismatch="null")
  754. 2020-11-07 10:42:54,197 Log4j2-TF-1-ConfiguratonFileWatcher-2 DEBUG Building Plugin[name=logger, class=org.apache.logging.log4j.core.config.LoggerConfig].
  755. 2020-11-07 10:42:54,197 Log4j2-TF-1-ConfiguratonFileWatcher-2 DEBUG createLogger(additivity="false", level="DEBUG", name="org.apache.logging.log4j.test1", includeLocation="null", ={STDOUT}, ={}, Configuration(PropertiesConfigTest), ThreadContextMapFilter(isAnd=true, {test=[123]}))
  756. 2020-11-07 10:42:54,197 Log4j2-TF-1-ConfiguratonFileWatcher-2 DEBUG Building Plugin[name=AppenderRef, class=org.apache.logging.log4j.core.config.AppenderRef].
  757. 2020-11-07 10:42:54,198 Log4j2-TF-1-ConfiguratonFileWatcher-2 DEBUG createAppenderRef(ref="STDOUT", level="null", Filter=null)
  758. 2020-11-07 10:42:54,198 Log4j2-TF-1-ConfiguratonFileWatcher-2 DEBUG Building Plugin[name=root, class=org.apache.logging.log4j.core.config.LoggerConfig$RootLogger].
  759. 2020-11-07 10:42:54,198 Log4j2-TF-1-ConfiguratonFileWatcher-2 DEBUG createLogger(additivity="null", level="ERROR", includeLocation="null", ={STDOUT}, ={}, Configuration(PropertiesConfigTest), Filter=null)
  760. 2020-11-07 10:42:54,198 Log4j2-TF-1-ConfiguratonFileWatcher-2 DEBUG Building Plugin[name=loggers, class=org.apache.logging.log4j.core.config.LoggersPlugin].
  761. 2020-11-07 10:42:54,199 Log4j2-TF-1-ConfiguratonFileWatcher-2 DEBUG createLoggers(={org.apache.logging.log4j.test2, org.apache.logging.log4j.test1, root})
  762. 2020-11-07 10:42:54,199 Log4j2-TF-1-ConfiguratonFileWatcher-2 DEBUG Building Plugin[name=layout, class=org.apache.logging.log4j.core.layout.PatternLayout].
  763. 2020-11-07 10:42:54,199 Log4j2-TF-1-ConfiguratonFileWatcher-2 DEBUG PatternLayout$Builder(pattern="%m%n", PatternSelector=null, Configuration(PropertiesConfigTest), Replace=null, charset="null", alwaysWriteExceptions="null", disableAnsi="null", noConsoleNoAnsi="null", header="null", footer="null")
  764. 2020-11-07 10:42:54,199 Log4j2-TF-1-ConfiguratonFileWatcher-2 DEBUG PluginManager 'Converter' found 46 plugins
  765. 2020-11-07 10:42:54,199 Log4j2-TF-1-ConfiguratonFileWatcher-2 DEBUG Building Plugin[name=appender, class=org.apache.logging.log4j.core.appender.ConsoleAppender].
  766. 2020-11-07 10:42:54,200 Log4j2-TF-1-ConfiguratonFileWatcher-2 DEBUG ConsoleAppender$Builder(target="null", follow="null", direct="null", bufferedIo="null", bufferSize="null", immediateFlush="null", ignoreExceptions="null", PatternLayout(%m%n), name="STDOUT", Configuration(PropertiesConfigTest), Filter=null, ={})
  767. 2020-11-07 10:42:54,201 Log4j2-TF-1-ConfiguratonFileWatcher-2 DEBUG Building Plugin[name=layout, class=org.apache.logging.log4j.core.layout.PatternLayout].
  768. 2020-11-07 10:42:54,202 Log4j2-TF-1-ConfiguratonFileWatcher-2 DEBUG PatternLayout$Builder(pattern="%d %p %C{1.} [%t] %m%n", PatternSelector=null, Configuration(PropertiesConfigTest), Replace=null, charset="null", alwaysWriteExceptions="null", disableAnsi="null", noConsoleNoAnsi="null", header="null", footer="null")
  769. 2020-11-07 10:42:54,202 Log4j2-TF-1-ConfiguratonFileWatcher-2 DEBUG Building Plugin[name=appender, class=org.apache.logging.log4j.core.appender.FileAppender].
  770. 2020-11-07 10:42:54,203 Log4j2-TF-1-ConfiguratonFileWatcher-2 DEBUG FileAppender$Builder(fileName="target/test-properties.log", append="null", locking="null", advertise="null", advertiseUri="null", createOnDemand="null", filePermissions="null", fileOwner="null", fileGroup="null", bufferedIo="false", bufferSize="null", immediateFlush="null", ignoreExceptions="null", PatternLayout(%d %p %C{1.} [%t] %m%n), name="File", Configuration(PropertiesConfigTest), Filter=null, ={})
  771. 2020-11-07 10:42:54,203 Log4j2-TF-1-ConfiguratonFileWatcher-2 WARN The bufferSize is set to 8192 but bufferedIo is false: false
  772. 2020-11-07 10:42:54,205 Log4j2-TF-1-ConfiguratonFileWatcher-2 DEBUG Building Plugin[name=filter, class=org.apache.logging.log4j.core.filter.ThresholdFilter].
  773. 2020-11-07 10:42:54,206 Log4j2-TF-1-ConfiguratonFileWatcher-2 DEBUG createFilter(level="ERROR", onMatch="null", onMismatch="null")
  774. 2020-11-07 10:42:54,206 Log4j2-TF-1-ConfiguratonFileWatcher-2 DEBUG Building Plugin[name=appender, class=org.apache.logging.log4j.test.appender.ListAppender].
  775. 2020-11-07 10:42:54,206 Log4j2-TF-1-ConfiguratonFileWatcher-2 DEBUG ListAppender$Builder(name="List", entryPerNewLine="null", raw="null", Layout=null, ThresholdFilter(ERROR))
  776. 2020-11-07 10:42:54,206 Log4j2-TF-1-ConfiguratonFileWatcher-2 DEBUG Building Plugin[name=appenders, class=org.apache.logging.log4j.core.config.AppendersPlugin].
  777. 2020-11-07 10:42:54,207 Log4j2-TF-1-ConfiguratonFileWatcher-2 DEBUG createAppenders(={STDOUT, File, ListAppender [events=[], messages=[], data=[], newLine=false, raw=false, countDownLatch=null, getHandler()=org.apache.logging.log4j.core.appender.DefaultErrorHandler@47f8c867, getLayout()=null, getName()=List, ignoreExceptions()=true, getFilter()=ERROR, getState()=INITIALIZED]})
  778. 2020-11-07 10:42:54,207 Log4j2-TF-1-ConfiguratonFileWatcher-2 DEBUG Building Plugin[name=filter, class=org.apache.logging.log4j.core.filter.ThresholdFilter].
  779. 2020-11-07 10:42:54,207 Log4j2-TF-1-ConfiguratonFileWatcher-2 DEBUG createFilter(level="DEBUG", onMatch="null", onMismatch="null")
  780. 2020-11-07 10:42:54,207 Log4j2-TF-1-ConfiguratonFileWatcher-2 DEBUG Configuration org.apache.logging.log4j.core.config.properties.PropertiesConfiguration@1356e080 initialized
  781. 2020-11-07 10:42:54,207 Log4j2-TF-1-ConfiguratonFileWatcher-2 DEBUG Starting configuration org.apache.logging.log4j.core.config.properties.PropertiesConfiguration@1356e080
  782. 2020-11-07 10:42:54,207 Log4j2-TF-1-ConfiguratonFileWatcher-2 DEBUG Log4j2 ConfigurationScheduler starting 1 threads
  783. 2020-11-07 10:42:54,209 Log4j2-TF-1-ConfiguratonFileWatcher-2 DEBUG Started configuration org.apache.logging.log4j.core.config.properties.PropertiesConfiguration@1356e080 OK.
  784. 2020-11-07 10:42:54,210 Log4j2-TF-1-ConfiguratonFileWatcher-2 DEBUG Appender File stopped with status true
  785. 2020-11-07 10:42:54,210 Log4j2-TF-1-ConfiguratonFileWatcher-2 DEBUG Appender STDOUT stopped with status true
  786. 2020-11-07 10:42:54,211 Log4j2-TF-1-ConfiguratonFileWatcher-2 DEBUG Log4j2 ConfigurationScheduler shutting down threads in java.util.concurrent.ScheduledThreadPoolExecutor@7999d773[Running, pool size = 1, active threads = 0, queued tasks = 1, completed tasks = 6]
  787. 2020-11-07 10:42:54,211 Log4j2-TF-1-ConfiguratonFileWatcher-2 DEBUG Stopped org.apache.logging.log4j.core.config.properties.PropertiesConfiguration@1a04f701 OK
  788. 2020-11-07 10:42:54,213 Log4j2-TF-1-ConfiguratonFileWatcher-2 DEBUG Registering MBean org.apache.logging.log4j2:type=PropertiesFileConfigTest
  789. 2020-11-07 10:42:54,214 Log4j2-TF-1-ConfiguratonFileWatcher-2 DEBUG Registering MBean org.apache.logging.log4j2:type=PropertiesFileConfigTest,component=StatusLogger
  790. 2020-11-07 10:42:54,214 Log4j2-TF-1-ConfiguratonFileWatcher-2 DEBUG Registering MBean org.apache.logging.log4j2:type=PropertiesFileConfigTest,component=ContextSelector
  791. 2020-11-07 10:42:54,214 Log4j2-TF-1-ConfiguratonFileWatcher-2 DEBUG Registering MBean org.apache.logging.log4j2:type=PropertiesFileConfigTest,component=Loggers,name=org.apache.logging.log4j.test1
  792. 2020-11-07 10:42:54,214 Log4j2-TF-1-ConfiguratonFileWatcher-2 DEBUG Registering MBean org.apache.logging.log4j2:type=PropertiesFileConfigTest,component=Loggers,name=
  793. 2020-11-07 10:42:54,215 Log4j2-TF-1-ConfiguratonFileWatcher-2 DEBUG Registering MBean org.apache.logging.log4j2:type=PropertiesFileConfigTest,component=Loggers,name=org.apache.logging.log4j.test2
  794. 2020-11-07 10:42:54,215 Log4j2-TF-1-ConfiguratonFileWatcher-2 DEBUG Registering MBean org.apache.logging.log4j2:type=PropertiesFileConfigTest,component=Appenders,name=STDOUT
  795. 2020-11-07 10:42:54,215 Log4j2-TF-1-ConfiguratonFileWatcher-2 DEBUG Registering MBean org.apache.logging.log4j2:type=PropertiesFileConfigTest,component=Appenders,name=List
  796. 2020-11-07 10:42:54,215 Log4j2-TF-1-ConfiguratonFileWatcher-2 DEBUG Registering MBean org.apache.logging.log4j2:type=PropertiesFileConfigTest,component=Appenders,name=File
  797. 2020-11-07 10:42:54,216 Log4j2-TF-1-ConfiguratonFileWatcher-2 DEBUG Reconfiguration completed for PropertiesFileConfigTest (org.apache.logging.log4j.core.LoggerContext@2f112965) in 5076 milliseconds.
  798. 2020-11-07 10:42:54,217 Log4j2-TF-1-ConfiguratonFileWatcher-7 DEBUG Reconfiguration started for context PropertiesFileConfigTest (org.apache.logging.log4j.core.LoggerContext@2f112965)
  799. 2020-11-07 10:42:54,218 Log4j2-TF-1-ConfiguratonFileWatcher-7 INFO Log4j appears to be running in a Servlet environment, but there's no log4j-web module available. If you want better web container support, please add the log4j-web JAR to your web archive or server lib directory.
  800. 2020-11-07 10:42:54,220 Log4j2-TF-1-ConfiguratonFileWatcher-7 INFO Log4j appears to be running in a Servlet environment, but there's no log4j-web module available. If you want better web container support, please add the log4j-web JAR to your web archive or server lib directory.
  801. 2020-11-07 10:42:54,222 Log4j2-TF-1-ConfiguratonFileWatcher-7 DEBUG Watching configuration '/Users/garydgregory/git/logging-log4j2/log4j-core/target/test-classes/log4j-test2.properties' for lastModified Sat Nov 07 09:39:04 EST 2020 (1604759944000)
  802. 2020-11-07 10:42:54,321 main DEBUG Stopping LoggerContext[name=PropertiesFileConfigTest, org.apache.logging.log4j.core.LoggerContext@2f112965]...
  803. 2020-11-07 10:42:59,229 Log4j2-TF-1-ConfiguratonFileWatcher-7 DEBUG null null initializing configuration org.apache.logging.log4j.core.config.properties.PropertiesConfiguration@7d511036
  804. 2020-11-07 10:42:59,230 Log4j2-TF-1-ConfiguratonFileWatcher-7 DEBUG Installed 3 script engines
  805. 2020-11-07 10:42:59,233 Log4j2-TF-1-ConfiguratonFileWatcher-7 DEBUG BeanShell Engine version: 1.0, language: BeanShell, threading: MULTITHREADED, compile: true, names: [beanshell, bsh, java], factory class: bsh.engine.BshScriptEngineFactory
  806. 2020-11-07 10:42:59,234 Log4j2-TF-1-ConfiguratonFileWatcher-7 DEBUG Groovy Scripting Engine version: 2.0, language: Groovy, threading: MULTITHREADED, compile: true, names: [groovy, Groovy], factory class: org.codehaus.groovy.jsr223.GroovyScriptEngineFactory
  807. 2020-11-07 10:42:59,238 Log4j2-TF-1-ConfiguratonFileWatcher-7 DEBUG Oracle Nashorn version: 1.8.0_272, language: ECMAScript, threading: Not Thread Safe, compile: true, names: [nashorn, Nashorn, js, JS, JavaScript, javascript, ECMAScript, ecmascript], factory class: jdk.nashorn.api.scripting.NashornScriptEngineFactory
  808. 2020-11-07 10:42:59,238 Log4j2-TF-1-ConfiguratonFileWatcher-7 DEBUG PluginManager 'Core' found 131 plugins
  809. 2020-11-07 10:42:59,238 Log4j2-TF-1-ConfiguratonFileWatcher-7 DEBUG PluginManager 'Level' found 1 plugins
  810. 2020-11-07 10:42:59,239 Log4j2-TF-1-ConfiguratonFileWatcher-7 DEBUG Building Plugin[name=property, class=org.apache.logging.log4j.core.config.Property].
  811. 2020-11-07 10:42:59,239 Log4j2-TF-1-ConfiguratonFileWatcher-7 DEBUG createProperty(name="filename", value="target/test-properties.log")
  812. 2020-11-07 10:42:59,239 Log4j2-TF-1-ConfiguratonFileWatcher-7 DEBUG Building Plugin[name=properties, class=org.apache.logging.log4j.core.config.PropertiesPlugin].
  813. 2020-11-07 10:42:59,239 Log4j2-TF-1-ConfiguratonFileWatcher-7 DEBUG configureSubstitutor(={filename=target/test-properties.log}, Configuration(PropertiesConfigTest))
  814. 2020-11-07 10:42:59,239 Log4j2-TF-1-ConfiguratonFileWatcher-7 DEBUG PluginManager 'Lookup' found 16 plugins
  815. 2020-11-07 10:42:59,239 Log4j2-TF-1-ConfiguratonFileWatcher-7 DEBUG Building Plugin[name=AppenderRef, class=org.apache.logging.log4j.core.config.AppenderRef].
  816. 2020-11-07 10:42:59,240 Log4j2-TF-1-ConfiguratonFileWatcher-7 DEBUG createAppenderRef(ref="File", level="null", Filter=null)
  817. 2020-11-07 10:42:59,240 Log4j2-TF-1-ConfiguratonFileWatcher-7 DEBUG Building Plugin[name=logger, class=org.apache.logging.log4j.core.config.LoggerConfig].
  818. 2020-11-07 10:42:59,240 Log4j2-TF-1-ConfiguratonFileWatcher-7 DEBUG createLogger(additivity="false", level="DEBUG", name="org.apache.logging.log4j.test2", includeLocation="null", ={File}, ={}, Configuration(PropertiesConfigTest), Filter=null)
  819. 2020-11-07 10:42:59,240 Log4j2-TF-1-ConfiguratonFileWatcher-7 DEBUG Building Plugin[name=AppenderRef, class=org.apache.logging.log4j.core.config.AppenderRef].
  820. 2020-11-07 10:42:59,240 Log4j2-TF-1-ConfiguratonFileWatcher-7 DEBUG createAppenderRef(ref="STDOUT", level="null", Filter=null)
  821. 2020-11-07 10:42:59,240 Log4j2-TF-1-ConfiguratonFileWatcher-7 DEBUG Building Plugin[name=KeyValuePair, class=org.apache.logging.log4j.core.util.KeyValuePair].
  822. 2020-11-07 10:42:59,241 Log4j2-TF-1-ConfiguratonFileWatcher-7 DEBUG KeyValuePair$Builder(key="test", value="123")
  823. 2020-11-07 10:42:59,241 Log4j2-TF-1-ConfiguratonFileWatcher-7 DEBUG Building Plugin[name=filter, class=org.apache.logging.log4j.core.filter.ThreadContextMapFilter].
  824. 2020-11-07 10:42:59,241 Log4j2-TF-1-ConfiguratonFileWatcher-7 DEBUG createFilter(={test=123}, operator="null", onMatch="null", onMismatch="null")
  825. 2020-11-07 10:42:59,241 Log4j2-TF-1-ConfiguratonFileWatcher-7 DEBUG Building Plugin[name=logger, class=org.apache.logging.log4j.core.config.LoggerConfig].
  826. 2020-11-07 10:42:59,242 Log4j2-TF-1-ConfiguratonFileWatcher-7 DEBUG createLogger(additivity="false", level="DEBUG", name="org.apache.logging.log4j.test1", includeLocation="null", ={STDOUT}, ={}, Configuration(PropertiesConfigTest), ThreadContextMapFilter(isAnd=true, {test=[123]}))
  827. 2020-11-07 10:42:59,242 Log4j2-TF-1-ConfiguratonFileWatcher-7 DEBUG Building Plugin[name=AppenderRef, class=org.apache.logging.log4j.core.config.AppenderRef].
  828. 2020-11-07 10:42:59,242 Log4j2-TF-1-ConfiguratonFileWatcher-7 DEBUG createAppenderRef(ref="STDOUT", level="null", Filter=null)
  829. 2020-11-07 10:42:59,242 Log4j2-TF-1-ConfiguratonFileWatcher-7 DEBUG Building Plugin[name=root, class=org.apache.logging.log4j.core.config.LoggerConfig$RootLogger].
  830. 2020-11-07 10:42:59,242 Log4j2-TF-1-ConfiguratonFileWatcher-7 DEBUG createLogger(additivity="null", level="ERROR", includeLocation="null", ={STDOUT}, ={}, Configuration(PropertiesConfigTest), Filter=null)
  831. 2020-11-07 10:42:59,242 Log4j2-TF-1-ConfiguratonFileWatcher-7 DEBUG Building Plugin[name=loggers, class=org.apache.logging.log4j.core.config.LoggersPlugin].
  832. 2020-11-07 10:42:59,242 Log4j2-TF-1-ConfiguratonFileWatcher-7 DEBUG createLoggers(={org.apache.logging.log4j.test2, org.apache.logging.log4j.test1, root})
  833. 2020-11-07 10:42:59,243 Log4j2-TF-1-ConfiguratonFileWatcher-7 DEBUG Building Plugin[name=layout, class=org.apache.logging.log4j.core.layout.PatternLayout].
  834. 2020-11-07 10:42:59,243 Log4j2-TF-1-ConfiguratonFileWatcher-7 DEBUG PatternLayout$Builder(pattern="%m%n", PatternSelector=null, Configuration(PropertiesConfigTest), Replace=null, charset="null", alwaysWriteExceptions="null", disableAnsi="null", noConsoleNoAnsi="null", header="null", footer="null")
  835. 2020-11-07 10:42:59,243 Log4j2-TF-1-ConfiguratonFileWatcher-7 DEBUG PluginManager 'Converter' found 46 plugins
  836. 2020-11-07 10:42:59,243 Log4j2-TF-1-ConfiguratonFileWatcher-7 DEBUG Building Plugin[name=appender, class=org.apache.logging.log4j.core.appender.ConsoleAppender].
  837. 2020-11-07 10:42:59,243 Log4j2-TF-1-ConfiguratonFileWatcher-7 DEBUG ConsoleAppender$Builder(target="null", follow="null", direct="null", bufferedIo="null", bufferSize="null", immediateFlush="null", ignoreExceptions="null", PatternLayout(%m%n), name="STDOUT", Configuration(PropertiesConfigTest), Filter=null, ={})
  838. 2020-11-07 10:42:59,245 Log4j2-TF-1-ConfiguratonFileWatcher-7 DEBUG Building Plugin[name=layout, class=org.apache.logging.log4j.core.layout.PatternLayout].
  839. 2020-11-07 10:42:59,245 Log4j2-TF-1-ConfiguratonFileWatcher-7 DEBUG PatternLayout$Builder(pattern="%d %p %C{1.} [%t] %m%n", PatternSelector=null, Configuration(PropertiesConfigTest), Replace=null, charset="null", alwaysWriteExceptions="null", disableAnsi="null", noConsoleNoAnsi="null", header="null", footer="null")
  840. 2020-11-07 10:42:59,245 Log4j2-TF-1-ConfiguratonFileWatcher-7 DEBUG Building Plugin[name=appender, class=org.apache.logging.log4j.core.appender.FileAppender].
  841. 2020-11-07 10:42:59,245 Log4j2-TF-1-ConfiguratonFileWatcher-7 DEBUG FileAppender$Builder(fileName="target/test-properties.log", append="null", locking="null", advertise="null", advertiseUri="null", createOnDemand="null", filePermissions="null", fileOwner="null", fileGroup="null", bufferedIo="false", bufferSize="null", immediateFlush="null", ignoreExceptions="null", PatternLayout(%d %p %C{1.} [%t] %m%n), name="File", Configuration(PropertiesConfigTest), Filter=null, ={})
  842. 2020-11-07 10:42:59,246 Log4j2-TF-1-ConfiguratonFileWatcher-7 WARN The bufferSize is set to 8192 but bufferedIo is false: false
  843. 2020-11-07 10:42:59,246 Log4j2-TF-1-ConfiguratonFileWatcher-7 DEBUG Building Plugin[name=filter, class=org.apache.logging.log4j.core.filter.ThresholdFilter].
  844. 2020-11-07 10:42:59,246 Log4j2-TF-1-ConfiguratonFileWatcher-7 DEBUG createFilter(level="ERROR", onMatch="null", onMismatch="null")
  845. 2020-11-07 10:42:59,246 Log4j2-TF-1-ConfiguratonFileWatcher-7 DEBUG Building Plugin[name=appender, class=org.apache.logging.log4j.test.appender.ListAppender].
  846. 2020-11-07 10:42:59,246 Log4j2-TF-1-ConfiguratonFileWatcher-7 DEBUG ListAppender$Builder(name="List", entryPerNewLine="null", raw="null", Layout=null, ThresholdFilter(ERROR))
  847. 2020-11-07 10:42:59,246 Log4j2-TF-1-ConfiguratonFileWatcher-7 DEBUG Building Plugin[name=appenders, class=org.apache.logging.log4j.core.config.AppendersPlugin].
  848. 2020-11-07 10:42:59,247 Log4j2-TF-1-ConfiguratonFileWatcher-7 DEBUG createAppenders(={STDOUT, File, ListAppender [events=[], messages=[], data=[], newLine=false, raw=false, countDownLatch=null, getHandler()=org.apache.logging.log4j.core.appender.DefaultErrorHandler@fe5daeb, getLayout()=null, getName()=List, ignoreExceptions()=true, getFilter()=ERROR, getState()=INITIALIZED]})
  849. 2020-11-07 10:42:59,247 Log4j2-TF-1-ConfiguratonFileWatcher-7 DEBUG Building Plugin[name=filter, class=org.apache.logging.log4j.core.filter.ThresholdFilter].
  850. 2020-11-07 10:42:59,247 Log4j2-TF-1-ConfiguratonFileWatcher-7 DEBUG createFilter(level="DEBUG", onMatch="null", onMismatch="null")
  851. 2020-11-07 10:42:59,247 Log4j2-TF-1-ConfiguratonFileWatcher-7 DEBUG Configuration org.apache.logging.log4j.core.config.properties.PropertiesConfiguration@7d511036 initialized
  852. 2020-11-07 10:42:59,247 Log4j2-TF-1-ConfiguratonFileWatcher-7 DEBUG Starting configuration org.apache.logging.log4j.core.config.properties.PropertiesConfiguration@7d511036
  853. 2020-11-07 10:42:59,247 Log4j2-TF-1-ConfiguratonFileWatcher-7 DEBUG Log4j2 ConfigurationScheduler starting 1 threads
  854. 2020-11-07 10:42:59,248 Log4j2-TF-1-ConfiguratonFileWatcher-7 DEBUG Started configuration org.apache.logging.log4j.core.config.properties.PropertiesConfiguration@7d511036 OK.
  855. 2020-11-07 10:42:59,248 Log4j2-TF-1-ConfiguratonFileWatcher-7 DEBUG Appender File stopped with status true
  856. 2020-11-07 10:42:59,249 Log4j2-TF-1-ConfiguratonFileWatcher-7 DEBUG Appender STDOUT stopped with status true
  857. 2020-11-07 10:42:59,249 Log4j2-TF-1-ConfiguratonFileWatcher-7 DEBUG Log4j2 ConfigurationScheduler shutting down threads in java.util.concurrent.ScheduledThreadPoolExecutor@4456422b[Running, pool size = 1, active threads = 0, queued tasks = 1, completed tasks = 5]
  858. 2020-11-07 10:42:59,249 Log4j2-TF-1-ConfiguratonFileWatcher-7 DEBUG Stopped org.apache.logging.log4j.core.config.properties.PropertiesConfiguration@1356e080 OK
  859. 2020-11-07 10:42:59,251 Log4j2-TF-1-ConfiguratonFileWatcher-7 DEBUG Registering MBean org.apache.logging.log4j2:type=PropertiesFileConfigTest
  860. 2020-11-07 10:42:59,251 Log4j2-TF-1-ConfiguratonFileWatcher-7 DEBUG Registering MBean org.apache.logging.log4j2:type=PropertiesFileConfigTest,component=StatusLogger
  861. 2020-11-07 10:42:59,251 Log4j2-TF-1-ConfiguratonFileWatcher-7 DEBUG Registering MBean org.apache.logging.log4j2:type=PropertiesFileConfigTest,component=ContextSelector
  862. 2020-11-07 10:42:59,252 Log4j2-TF-1-ConfiguratonFileWatcher-7 DEBUG Registering MBean org.apache.logging.log4j2:type=PropertiesFileConfigTest,component=Loggers,name=org.apache.logging.log4j.test1
  863. 2020-11-07 10:42:59,252 Log4j2-TF-1-ConfiguratonFileWatcher-7 DEBUG Registering MBean org.apache.logging.log4j2:type=PropertiesFileConfigTest,component=Loggers,name=
  864. 2020-11-07 10:42:59,254 Log4j2-TF-1-ConfiguratonFileWatcher-7 DEBUG Registering MBean org.apache.logging.log4j2:type=PropertiesFileConfigTest,component=Loggers,name=org.apache.logging.log4j.test2
  865. 2020-11-07 10:42:59,254 Log4j2-TF-1-ConfiguratonFileWatcher-7 DEBUG Registering MBean org.apache.logging.log4j2:type=PropertiesFileConfigTest,component=Appenders,name=STDOUT
  866. 2020-11-07 10:42:59,254 Log4j2-TF-1-ConfiguratonFileWatcher-7 DEBUG Registering MBean org.apache.logging.log4j2:type=PropertiesFileConfigTest,component=Appenders,name=List
  867. 2020-11-07 10:42:59,255 Log4j2-TF-1-ConfiguratonFileWatcher-7 DEBUG Registering MBean org.apache.logging.log4j2:type=PropertiesFileConfigTest,component=Appenders,name=File
  868. 2020-11-07 10:42:59,255 Log4j2-TF-1-ConfiguratonFileWatcher-7 DEBUG Reconfiguration completed for PropertiesFileConfigTest (org.apache.logging.log4j.core.LoggerContext@2f112965) in 5039 milliseconds.
  869. 2020-11-07 10:42:59,255 Log4j2-TF-1-ConfiguratonFileWatcher-6 DEBUG Reconfiguration started for context PropertiesFileConfigTest (org.apache.logging.log4j.core.LoggerContext@2f112965)
  870. 2020-11-07 10:42:59,256 main DEBUG Shutting down FileManager target/test-properties.log
  871. 2020-11-07 10:42:59,256 Log4j2-TF-1-ConfiguratonFileWatcher-6 INFO Log4j appears to be running in a Servlet environment, but there's no log4j-web module available. If you want better web container support, please add the log4j-web JAR to your web archive or server lib directory.
  872. 2020-11-07 10:42:59,256 main DEBUG OutputStream closed
  873. 2020-11-07 10:42:59,256 main DEBUG Shut down FileManager target/test-properties.log, all resources released: true
  874. 2020-11-07 10:42:59,256 main DEBUG Appender File stopped with status true
  875. 2020-11-07 10:42:59,256 main DEBUG Shutting down OutputStreamManager SYSTEM_OUT.false.false
  876. 2020-11-07 10:42:59,257 main DEBUG OutputStream closed
  877. 2020-11-07 10:42:59,257 main DEBUG Shut down OutputStreamManager SYSTEM_OUT.false.false, all resources released: true
  878. 2020-11-07 10:42:59,257 main DEBUG Appender STDOUT stopped with status true
  879. 2020-11-07 10:42:59,257 main DEBUG Log4j2 ConfigurationScheduler shutting down threads in java.util.concurrent.ScheduledThreadPoolExecutor@69504ae9[Running, pool size = 1, active threads = 0, queued tasks = 1, completed tasks = 0]
  880. 2020-11-07 10:42:59,257 main DEBUG Stopped org.apache.logging.log4j.core.config.properties.PropertiesConfiguration@7d511036 OK
  881. 2020-11-07 10:42:59,257 main DEBUG Stopped LoggerContext[name=PropertiesFileConfigTest, org.apache.logging.log4j.core.LoggerContext@2f112965] with status true
  882. [INFO] Tests run: 1, Failures: 0, Errors: 0, Skipped: 0, Time elapsed: 16.712 s - in org.apache.logging.log4j.core.PropertiesFileConfigTest
  883. 2020-11-07 10:42:59,259 Log4j2-TF-1-ConfiguratonFileWatcher-6 INFO Log4j appears to be running in a Servlet environment, but there's no log4j-web module available. If you want better web container support, please add the log4j-web JAR to your web archive or server lib directory.
  884. 2020-11-07 10:42:59,260 Log4j2-TF-1-ConfiguratonFileWatcher-6 DEBUG Watching configuration '/Users/garydgregory/git/logging-log4j2/log4j-core/target/test-classes/log4j-test2.properties' for lastModified Sat Nov 07 09:39:04 EST 2020 (1604759944000)
  885. [INFO] Running org.apache.logging.log4j.core.AppenderRefLevelJsonTest
  886. [INFO] Tests run: 3, Failures: 0, Errors: 0, Skipped: 0, Time elapsed: 5.497 s - in org.apache.logging.log4j.core.AppenderRefLevelJsonTest
  887. [INFO] Running org.apache.logging.log4j.core.CustomLevelsOverrideTest
  888. Hello, World
  889. Hello DIAG
  890. [INFO] Tests run: 4, Failures: 0, Errors: 0, Skipped: 0, Time elapsed: 5.347 s - in org.apache.logging.log4j.core.CustomLevelsOverrideTest
  891. [INFO] Running org.apache.logging.log4j.core.GcFreeMixedSyncAyncLoggingTest
  892. [INFO] Tests run: 1, Failures: 0, Errors: 0, Skipped: 0, Time elapsed: 15.128 s - in org.apache.logging.log4j.core.GcFreeMixedSyncAyncLoggingTest
  893. [INFO] Running org.apache.logging.log4j.core.jackson.JacksonIssue429MyNamesTest
  894. [INFO] Tests run: 1, Failures: 0, Errors: 0, Skipped: 0, Time elapsed: 0.16 s - in org.apache.logging.log4j.core.jackson.JacksonIssue429MyNamesTest
  895. [INFO] Running org.apache.logging.log4j.core.jackson.JacksonIssue429Test
  896. [INFO] Tests run: 1, Failures: 0, Errors: 0, Skipped: 0, Time elapsed: 0.164 s - in org.apache.logging.log4j.core.jackson.JacksonIssue429Test
  897. [INFO] Running org.apache.logging.log4j.core.jackson.StackTraceElementMixInTest
  898. [INFO] Tests run: 5, Failures: 0, Errors: 0, Skipped: 0, Time elapsed: 0.273 s - in org.apache.logging.log4j.core.jackson.StackTraceElementMixInTest
  899. [INFO] Running org.apache.logging.log4j.core.jackson.LevelMixInXmlTest
  900. [WARNING] Tests run: 1, Failures: 0, Errors: 0, Skipped: 1, Time elapsed: 0.001 s - in org.apache.logging.log4j.core.jackson.LevelMixInXmlTest
  901. [INFO] Running org.apache.logging.log4j.core.jackson.LevelMixInJsonTest
  902. [INFO] Tests run: 2, Failures: 0, Errors: 0, Skipped: 0, Time elapsed: 0.201 s - in org.apache.logging.log4j.core.jackson.LevelMixInJsonTest
  903. [INFO] Running org.apache.logging.log4j.core.jackson.LevelMixInYamlTest
  904. [INFO] Tests run: 2, Failures: 0, Errors: 0, Skipped: 0, Time elapsed: 0.223 s - in org.apache.logging.log4j.core.jackson.LevelMixInYamlTest
  905. [INFO] Running org.apache.logging.log4j.message.MutableLogEventWithReusableParamMsgTest
  906. [INFO] Tests run: 1, Failures: 0, Errors: 0, Skipped: 0, Time elapsed: 0.045 s - in org.apache.logging.log4j.message.MutableLogEventWithReusableParamMsgTest
  907. [INFO] Running org.apache.logging.log4j.MarkerMixInXmlTest
  908. [INFO] Tests run: 3, Failures: 0, Errors: 0, Skipped: 0, Time elapsed: 0.256 s - in org.apache.logging.log4j.MarkerMixInXmlTest
  909. [INFO] Running org.apache.logging.log4j.MarkerMixInYamlTest
  910. [INFO] Tests run: 3, Failures: 0, Errors: 0, Skipped: 0, Time elapsed: 0.222 s - in org.apache.logging.log4j.MarkerMixInYamlTest
  911. [INFO] Running org.apache.logging.log4j.MarkerMixInJsonTest
  912. [INFO] Tests run: 3, Failures: 0, Errors: 0, Skipped: 0, Time elapsed: 0.199 s - in org.apache.logging.log4j.MarkerMixInJsonTest
  913. [INFO]
  914. [INFO] Results:
  915. [INFO]
  916. [ERROR] Failures:
  917. [ERROR]   TestConfigurator.testReconfiguration:274 Configuration not reset
  918. Expected: is not sameInstance(<XmlConfiguration[location=/Users/garydgregory/git/logging-log4j2/log4j-core/target/test-classes/log4j2-config.xml]>)
  919.      but: was <XmlConfiguration[location=/Users/garydgregory/git/logging-log4j2/log4j-core/target/test-classes/log4j2-config.xml]>
  920. [ERROR]   SocketReconnectTest.testReconnect:170 No message ==> expected: not <null>
  921. [INFO]
  922. [ERROR] Tests run: 2202, Failures: 2, Errors: 0, Skipped: 22
  923. [INFO]
  924. [INFO] ------------------------------------------------------------------------
  925. [INFO] Reactor Summary for Apache Log4j 2 2.14.0:
  926. [INFO]
  927. [INFO] Apache Log4j 2 ..................................... SUCCESS [  2.978 s]
  928. [INFO] Apache Log4j API Java 9 support .................... SUCCESS [ 14.533 s]
  929. [INFO] Apache Log4j API ................................... SUCCESS [ 36.920 s]
  930. [INFO] Apache Log4j Implementation Java 9 support ......... SUCCESS [  1.719 s]
  931. [INFO] Apache Log4j Core .................................. FAILURE [  01:04 h]
  932. [INFO] Apache Log4j Layout for JSON template .............. SKIPPED
  933. [INFO] Apache Log4j Core Integration Tests ................ SKIPPED
  934. [INFO] Apache Log4j 1.x Compatibility API ................. SKIPPED
  935. [INFO] Apache Log4j to SLF4J Adapter ...................... SKIPPED
  936. [INFO] Apache Log4j SLF4J Binding ......................... SKIPPED
  937. [INFO] Apache Log4j SLF4J 1.8+ Binding .................... SKIPPED
  938. [INFO] Apache Log4j Commons Logging Bridge ................ SKIPPED
  939. [INFO] Apache Log4j Flume Bridge .......................... SKIPPED
  940. [INFO] Apache Log4j Web ................................... SKIPPED
  941. [INFO] Apache Log4j Tag Library ........................... SKIPPED
  942. [INFO] Apache Log4j JMX GUI ............................... SKIPPED
  943. [INFO] Apache Log4j Samples ............................... SKIPPED
  944. [INFO] Apache Log4j Samples: Flume - Common ............... SKIPPED
  945. [INFO] Apache Log4j Samples: Flume - Remote ............... SKIPPED
  946. [INFO] Apache Log4j Samples: Flume - Embedded ............. SKIPPED
  947. [INFO] Apache Log4j Samples: Configuration ................ SKIPPED
  948. [INFO] Apache Log4j Samples: LoggerProperties ............. SKIPPED
  949. [INFO] Apache Log4j BOM ................................... SKIPPED
  950. [INFO] Apache Log4j JDBC DBCP 2 ........................... SKIPPED
  951. [INFO] Apache Log4j JPA ................................... SKIPPED
  952. [INFO] Apache Log4j CouchDB ............................... SKIPPED
  953. [INFO] Apache Log4j MongoDB 3 ............................. SKIPPED
  954. [INFO] Apache Log4j MongoDB 4 ............................. SKIPPED
  955. [INFO] Apache Log4j Cassandra ............................. SKIPPED
  956. [INFO] Apache Log4J Performance Tests ..................... SKIPPED
  957. [INFO] Apache Log4j Streaming Interface ................... SKIPPED
  958. [INFO] Apache Log4j JUL Adapter ........................... SKIPPED
  959. [INFO] Apache Log4j JDK Platform Logging Adapter .......... SKIPPED
  960. [INFO] Apache Log4j Liquibase Binding ..................... SKIPPED
  961. [INFO] Apache Log4j App Server Support .................... SKIPPED
  962. [INFO] Apache Log4j OSGi .................................. SKIPPED
  963. [INFO] Apache Log4j Docker Library ........................ SKIPPED
  964. [INFO] Apache Log4j Kubernetes Library .................... SKIPPED
  965. [INFO] Apache Log4j Spring Boot Support ................... SKIPPED
  966. [INFO] Apache Log4j Spring Cloud Config Support ........... SKIPPED
  967. [INFO] Apache Log4j Spring Cloud Config Client Support .... SKIPPED
  968. [INFO] Log4j Sample Configuration Service ................. SKIPPED
  969. [INFO] Apache Log4j Spring Cloud Config Samples ........... SKIPPED
  970. [INFO] Spring Cloud Config Sample Application ............. SKIPPED
  971. [INFO] ------------------------------------------------------------------------
  972. [INFO] BUILD FAILURE
  973. [INFO] ------------------------------------------------------------------------
  974. [INFO] Total time:  01:05 h
  975. [INFO] Finished at: 2020-11-07T10:43:38-05:00
  976. [INFO] ------------------------------------------------------------------------
  977. [ERROR] Failed to execute goal org.apache.maven.plugins:maven-surefire-plugin:2.22.2:test (default-test) on project log4j-core: There are test failures.
  978. [ERROR]
  979. [ERROR] Please refer to /Users/garydgregory/git/logging-log4j2/log4j-core/target/surefire-reports for the individual test results.
  980. [ERROR] Please refer to dump files (if any exist) [date].dump, [date]-jvmRun[N].dump and [date].dumpstream.
  981. [ERROR] -> [Help 1]
  982. [ERROR]
  983. [ERROR] To see the full stack trace of the errors, re-run Maven with the -e switch.
  984. [ERROR] Re-run Maven using the -X switch to enable full debug logging.
  985. [ERROR]
  986. [ERROR] For more information about the errors and possible solutions, please read the following articles:
  987. [ERROR] [Help 1] http://cwiki.apache.org/confluence/display/MAVEN/MojoFailureException
  988. [ERROR]
  989. [ERROR] After correcting the problems, you can resume the build with the command
  990. [ERROR]   mvn <args> -rf :log4j-core
Advertisement
Add Comment
Please, Sign In to add comment