Guest User

Untitled

a guest
Jun 12th, 2017
161
0
Never
Not a member of Pastebin yet? Sign Up, it unlocks many cool features!
text 27.15 KB | None | 0 0
  1. jonathanmaw@fafnir:~/workspace/buildstream/buildstream-tests$ bst --no-interactive build base-system-image.bst
  2. Loading: 152
  3. Resolving: 152/152
  4. Checking: 152/152
  5.  
  6. BuildStream Version 0.1.dev814-g73b0015
  7. Session Start: Monday, 12-06-2017 at 14:16:23
  8. Project: gnu-toolchain (/home/jonathanmaw/workspace/buildstream/buildstream-tests)
  9. Target: base-system-image.bst
  10. Machine Architecture: x86_64
  11. Variant: None
  12.  
  13. User Configuration
  14. Configuration File: Default Configuration
  15. Log Files: /home/jonathanmaw/.cache/buildstream/logs
  16. Source Mirrors: /home/jonathanmaw/.cache/buildstream/sources
  17. Build Area: /home/jonathanmaw/.cache/buildstream/build
  18. Artifact Cache: /home/jonathanmaw/.cache/buildstream/artifacts
  19. Maximum Fetch Tasks: 10
  20. Maximum Build Tasks: 4
  21.  
  22. Pipeline
  23. cached d5975d87 gnu-toolchain/base-platform.bst
  24. cached 5aa1311b gnu-toolchain/base-sdk.bst
  25. cached 6ac7a3be gnu-toolchain/stage1-binutils.bst
  26. cached 8fff5307 gnu-toolchain/stage1-gcc.bst
  27. cached 2043bd98 gnu-toolchain/stage1.bst
  28. cached 3b584d30 gnu-toolchain/stage2-fhs-dirs.bst
  29. cached febc0f42 gnu-toolchain/stage2-linux-api-headers.bst
  30. cached 6695c3b8 gnu-toolchain/stage2-glibc.bst
  31. cached 924c0bc5 gnu-toolchain/stage2-binutils.bst
  32. cached 1e1ec665 gnu-toolchain/stage2-busybox.bst
  33. cached 5e4c6701 gnu-toolchain/stage2-fake-bash.bst
  34. cached cc608913 gnu-toolchain/stage2-gawk.bst
  35. cached d8af2732 gnu-toolchain/stage2-gcc-fixed-headers.bst
  36. cached 270c31c2 gnu-toolchain/stage2-libstdcxx.bst
  37. cached 935c309c gnu-toolchain/stage2-gcc.bst
  38. cached be4c6766 gnu-toolchain/stage2-make.bst
  39. cached 76cad323 gnu-toolchain/stage2-reset-specs.bst
  40. cached 06bbc1fe gnu-toolchain/stage2.bst
  41. cached b6eeb174 gnu-toolchain/fhs-dirs.bst
  42. cached a8398611 gnu-toolchain/linux-api-headers.bst
  43. cached e3dcf8ed gnu-toolchain/glibc.bst
  44. cached 418302f7 gnu-toolchain/zlib.bst
  45. cached 2dc327ce gnu-toolchain/binutils.bst
  46. cached b662c177 gnu-toolchain/busybox.bst
  47. cached 012448b0 gnu-toolchain/ccache.bst
  48. cached f35087e2 gnu-toolchain/gawk.bst
  49. cached 6e7ba04f gnu-toolchain/m4-tarball.bst
  50. cached b3878be9 gnu-toolchain/gcc.bst
  51. cached d3c60c91 gnu-toolchain/make.bst
  52. cached fb052472 gnu-toolchain.bst
  53. cached 9bee3efb core/bzip2.bst
  54. cached baf50d9b core/gdbm.bst
  55. cached c92673fc core/libtool-tarball.bst
  56. cached ff04088c core/ncurses.bst
  57. cached 2fb62f4f core/perl.bst
  58. cached a788a9c5 core/autoconf-tarball.bst
  59. cached 86e9e8f3 core/cmake.bst
  60. cached 5c5b7591 core/openssl-new.bst
  61. cached 5391d20f core/sqlite3.bst
  62. cached ef631358 core/texinfo-tarball.bst
  63. cached 58f7760b core/automake.bst
  64. cached fc09db58 core/file.bst
  65. cached fd3bb9b7 core/help2man.bst
  66. cached d860d110 core/autoconf.bst
  67. cached 61337a8c core/bash.bst
  68. cached 5553f9dd core/curl.bst
  69. cached 9f9a85ff core/gperf.bst
  70. cached 06a02ffd core/libexpat.bst
  71. cached 4f6c7067 core/XML-Parser.bst
  72. cached 32ce1d1b core/libffi.bst
  73. cached 68591ccb core/readline.bst
  74. cached b7dbd051 core/python3.bst
  75. cached 8030fea3 core/cython.bst
  76. cached 2448db6c core/gettext-tarball.bst
  77. cached 44e74f23 core/flex.bst
  78. cached 7e1e87ac core/intltool.bst
  79. cached e4defde9 core/mini-utils.bst
  80. cached d15efcf7 core/git-minimal.bst
  81. cached b4fc43d7 core/bison.bst
  82. cached 458e232b core/patch.bst
  83. cached 05dcd528 core/xz.bst
  84. cached 577652d8 core/libtool.bst
  85. cached 70b43696 core/attr.bst
  86. cached a8c0d7fa core/acl.bst
  87. cached 8405bc97 core/bc.bst
  88. cached 1c6882b9 core/ca-certificates.bst
  89. cached 7cba258a core/libseccomp.bst
  90. cached 1fa89256 core/pkg-config.bst
  91. cached 92f965ce core/linux-pam.bst
  92. cached 81a0dce2 core/libcap2.bst
  93. cached 62516865 core/libxml2.bst
  94. cached a638f6c4 core/libxslt.bst
  95. cached 9c4693cf core/shadow.bst
  96. cached 6ab81e71 core/util-linux.bst
  97. cached 556c0863 core/e2fsprogs.bst
  98. cached 9f446120 core.bst
  99. cached 4755211f python2-core/python2.bst
  100. cached 1cdc953b python2-core/cython2.bst
  101. cached b4e31283 python2-core/python2-setuptools.bst
  102. cached 50a6ce10 python2-core/jsonschema-python2.bst
  103. cached db2702e9 python2-core/libxml2-python2.bst
  104. cached 7de90a19 python2-core/mako-python2.bst
  105. cached 55e32153 python2-core/pbr-python2.bst
  106. cached c91cfe66 python2-core/python2-lxml.bst
  107. cached f33aa024 python2-core/python2-markdown.bst
  108. cached 8ca12c63 python2-core/python2-requests.bst
  109. cached e9cd84a0 python2-core/pyyaml-python2.bst
  110. cached ee90814b python2-core/six-python2.bst
  111. cached 59a69584 python2-core.bst
  112. cached 11d78071 docutils/xml-catalog.bst
  113. cached b408fd17 docutils/docbook-xml.bst
  114. cached 1a04983e docutils/docbook-xsl.bst
  115. cached 14b204bc docutils/asciidoc.bst
  116. cached 9a0b78b5 docutils/xmlto.bst
  117. cached eef883b9 docutils.bst
  118. fetch needed 86c938e3 bsp-x86_64-generic/linux-x86-64-generic.bst
  119. waiting e9d81b18 bsp-x86_64-generic.bst
  120. cached 384eab5d debian-testing-ostree.bst
  121. cached 5b69d56d dpkg-env.bst
  122. buildable 63e93742 debian-python.bst
  123. cached 7c6601e3 coreutils-common/coreutils.bst
  124. cached d6babaae coreutils-common/diff.bst
  125. cached d8911836 coreutils-common/findutils.bst
  126. cached 2f0891b4 coreutils-common/jq.bst
  127. cached 64a2c49c coreutils-common/less.bst
  128. cached e5c2c53f coreutils-common/sed.bst
  129. cached 59f6b077 coreutils-common/tar.bst
  130. cached 1b284933 coreutils-common.bst
  131. cached f8fb72e7 foundation/bash-completion.bst
  132. cached a7f0c135 foundation/lzo.bst
  133. cached e136381d foundation/btrfs-progs.bst
  134. cached ba47a8bb foundation/dbus-pre.bst
  135. cached c89dddc7 foundation/fuse.bst
  136. cached 86d97037 foundation/groff.bst
  137. cached cbff888e foundation/kmod.bst
  138. cached 84775a61 foundation/libarchive.bst
  139. cached 56e9b7bc foundation/libgpg-error.bst
  140. cached d5f92551 foundation/libgcrypt.bst
  141. cached bc79fa5a foundation/pciutils.bst
  142. fetch needed f6ff40c1 foundation/systemd.bst
  143. fetch needed 8de7f5ce foundation/dbus.bst
  144. fetch needed 0fadad83 foundation/libusb.bst
  145. cached 8291864b foundation/openssh.bst
  146. waiting b9ea7a69 foundation/python-systemd.bst
  147. cached 0291feec foundation/rsync.bst
  148. cached 012313eb foundation/tbdiff.bst
  149. cached 4186b063 foundation/time-zone-database.bst
  150. waiting 74c9e7c2 foundation/usbutils.bst
  151. waiting d4e4a189 foundation.bst
  152. waiting 404c80d1 base-system-x86_64-generic-content.bst
  153. cached 51fc1fd2 initramfs/initramfs-scripts.bst
  154. cached fe6aad22 initramfs/initramfs.bst
  155. waiting b2158533 initramfs/initramfs-gz.bst
  156. waiting 5444846d base-system.bst
  157. fetch needed 9184efec deploy-base/mtools.bst
  158. fetch needed 0131e971 deploy-base/nasm.bst
  159. fetch needed 925c566f deploy-base/syslinux.bst
  160. fetch needed ab0ed0ea tools/device-tree-compiler.bst
  161. fetch needed 4845a5a3 tools/distcc.bst
  162. fetch needed 23c0f4c6 tools/gdb.bst
  163. fetch needed 95abc080 tools/ipmitool.bst
  164. buildable c77c262e tools/kexec-tools.bst
  165. buildable 1d10a226 tools/lsof.bst
  166. fetch needed ca9b0c52 tools/parted.bst
  167. fetch needed 8b883d1d tools/procps-ng.bst
  168. buildable 42a4dcd3 tools/strace.bst
  169. fetch needed dbc8c00d tools/sudo.bst
  170. fetch needed 6d209860 tools/u-boot.bst
  171. fetch needed cfe5641f tools/zip.bst
  172. waiting 5cc07ce7 tools.bst
  173. waiting 812066f6 deploy-base.bst
  174. waiting 2dc46d85 base-system-image.bst
  175. ~~~~~~~~~~~~~~~~~~~~~~~~~~~~~~~~~~~~~~~~~~~~~~~~~~~~~~~~~~~~~~~~~~~~~~~~~~~~~~~
  176. [--:--:--][2dc46d85][base-system-image.bst ] START Starting build
  177. [--:--:--][f6ff40c1][foundation/systemd.bst ] START gnu-toolchain/foundation-systemd/f6ff40c1-fetch.4149.log
  178. [--:--:--][f6ff40c1][foundation/systemd.bst ] START Fetching git://git.baserock.org/delta/systemd
  179. [--:--:--][0fadad83][foundation/libusb.bst ] START gnu-toolchain/foundation-libusb/0fadad83-fetch.4150.log
  180. [--:--:--][0fadad83][foundation/libusb.bst ] START Fetching git://git.baserock.org/delta/libusb
  181. [--:--:--][86c938e3][bsp-x86_64-generic/linux-x86-64-generic.bst] START gnu-toolchain/bsp-x86_64-generic-linux-x86-64-generic/86c938e3-fetch.4155.log
  182. [--:--:--][86c938e3][bsp-x86_64-generic/linux-x86-64-generic.bst] START Fetching git://git.baserock.org/delta/linux
  183. [--:--:--][ab0ed0ea][tools/device-tree-compiler.bst ] START gnu-toolchain/tools-device-tree-compiler/ab0ed0ea-fetch.4156.log
  184. [--:--:--][ab0ed0ea][tools/device-tree-compiler.bst ] START Fetching git://git.baserock.org/delta/device-tree-compiler
  185. [--:--:--][8de7f5ce][foundation/dbus.bst ] START gnu-toolchain/foundation-dbus/8de7f5ce-fetch.4152.log
  186. [--:--:--][8de7f5ce][foundation/dbus.bst ] START Fetching git://git.baserock.org/delta/dbus
  187. [--:--:--][23c0f4c6][tools/gdb.bst ] START gnu-toolchain/tools-gdb/23c0f4c6-fetch.4162.log
  188. [--:--:--][23c0f4c6][tools/gdb.bst ] START Fetching git://git.baserock.org/delta/binutils-gdb
  189. [--:--:--][4845a5a3][tools/distcc.bst ] START gnu-toolchain/tools-distcc/4845a5a3-fetch.4158.log
  190. [--:--:--][4845a5a3][tools/distcc.bst ] START Fetching git://git.baserock.org/delta/distcc
  191. [--:--:--][6d209860][tools/u-boot.bst ] START gnu-toolchain/tools-u-boot/6d209860-fetch.4164.log
  192. [--:--:--][6d209860][tools/u-boot.bst ] START Fetching git://git.baserock.org/delta/u-boot
  193. [--:--:--][ca9b0c52][tools/parted.bst ] START gnu-toolchain/tools-parted/ca9b0c52-fetch.4170.log
  194. [--:--:--][ca9b0c52][tools/parted.bst ] START Fetching git://git.baserock.org/delta/parted
  195. [--:--:--][95abc080][tools/ipmitool.bst ] START gnu-toolchain/tools-ipmitool/95abc080-fetch.4176.log
  196. [--:--:--][95abc080][tools/ipmitool.bst ] START Fetching git://git.baserock.org/delta/ipmitool
  197. [--:--:--][42a4dcd3][tools/strace.bst ] START gnu-toolchain/tools-strace/42a4dcd3-build.4181.log
  198. [--:--:--][42a4dcd3][tools/strace.bst ] START Staging dependencies
  199. [--:--:--][c77c262e][tools/kexec-tools.bst ] START gnu-toolchain/tools-kexec-tools/c77c262e-build.4184.log
  200. [--:--:--][c77c262e][tools/kexec-tools.bst ] START Staging dependencies
  201. [--:--:--][63e93742][debian-python.bst ] START gnu-toolchain/debian-python/63e93742-build.4186.log
  202. [--:--:--][63e93742][debian-python.bst ] START Staging dependencies
  203. [--:--:--][1d10a226][tools/lsof.bst ] START gnu-toolchain/tools-lsof/1d10a226-build.4189.log
  204. [--:--:--][1d10a226][tools/lsof.bst ] START Staging dependencies
  205. [00:00:03][4845a5a3][tools/distcc.bst ] SUCCESS Fetching git://git.baserock.org/delta/distcc
  206. [00:00:03][4845a5a3][tools/distcc.bst ] SUCCESS gnu-toolchain/tools-distcc/4845a5a3-fetch.4158.log
  207. [--:--:--][dbc8c00d][tools/sudo.bst ] START gnu-toolchain/tools-sudo/dbc8c00d-fetch.4223.log
  208. [--:--:--][dbc8c00d][tools/sudo.bst ] START Fetching git://git.baserock.org/delta/sudo
  209. [00:00:03][0fadad83][foundation/libusb.bst ] SUCCESS Fetching git://git.baserock.org/delta/libusb
  210. [00:00:03][0fadad83][foundation/libusb.bst ] SUCCESS gnu-toolchain/foundation-libusb/0fadad83-fetch.4150.log
  211. [--:--:--][cfe5641f][tools/zip.bst ] START gnu-toolchain/tools-zip/cfe5641f-fetch.4235.log
  212. [--:--:--][cfe5641f][tools/zip.bst ] START Fetching git://git.baserock.org/delta/zip
  213. [00:00:03][95abc080][tools/ipmitool.bst ] SUCCESS Fetching git://git.baserock.org/delta/ipmitool
  214. [00:00:03][95abc080][tools/ipmitool.bst ] SUCCESS gnu-toolchain/tools-ipmitool/95abc080-fetch.4176.log
  215. [--:--:--][8b883d1d][tools/procps-ng.bst ] START gnu-toolchain/tools-procps-ng/8b883d1d-fetch.4242.log
  216. [--:--:--][8b883d1d][tools/procps-ng.bst ] START Fetching git://git.baserock.org/delta/procps-ng
  217. [00:00:01][cfe5641f][tools/zip.bst ] SUCCESS Fetching git://git.baserock.org/delta/zip
  218. [00:00:01][cfe5641f][tools/zip.bst ] SUCCESS gnu-toolchain/tools-zip/cfe5641f-fetch.4235.log
  219. [--:--:--][0131e971][deploy-base/nasm.bst ] START gnu-toolchain/deploy-base-nasm/0131e971-fetch.4258.log
  220. [--:--:--][0131e971][deploy-base/nasm.bst ] START Fetching git://git.baserock.org/delta/nasm
  221. [--:--:--][1d10a226][tools/lsof.bst ] WARNING Overlapping files
  222.  
  223. Staged files overwrite existing files in staging area:
  224.  
  225. From core/readline.bst:
  226. /usr/share/info/dir
  227.  
  228. From core/bison.bst:
  229. /usr/share/info/dir
  230.  
  231. From core/libtool.bst:
  232. /usr/bin/libtool
  233. /usr/bin/libtoolize
  234. /usr/include/libltdl/lt_dlloader.h
  235. /usr/include/libltdl/lt_error.h
  236. /usr/include/libltdl/lt_system.h
  237. /usr/include/ltdl.h
  238. /usr/lib/debug/libltdl.so.7.3.1
  239. /usr/lib/libltdl.a
  240. /usr/lib/libltdl.la
  241. /usr/lib/libltdl.so
  242. /usr/lib/libltdl.so.7
  243. Message contains 217 additional lines
  244.  
  245. [00:00:06][1d10a226][tools/lsof.bst ] SUCCESS Staging dependencies
  246. [--:--:--][1d10a226][tools/lsof.bst ] START Integrating sandbox
  247. [--:--:--][1d10a226][tools/lsof.bst ] STATUS Running integration command
  248.  
  249. ldconfig
  250.  
  251. [--:--:--][c77c262e][tools/kexec-tools.bst ] WARNING Overlapping files
  252.  
  253. Staged files overwrite existing files in staging area:
  254.  
  255. From core/readline.bst:
  256. /usr/share/info/dir
  257.  
  258. From core/bison.bst:
  259. /usr/share/info/dir
  260.  
  261. From core/libtool.bst:
  262. /usr/bin/libtool
  263. /usr/bin/libtoolize
  264. /usr/include/libltdl/lt_dlloader.h
  265. /usr/include/libltdl/lt_error.h
  266. /usr/include/libltdl/lt_system.h
  267. /usr/include/ltdl.h
  268. /usr/lib/debug/libltdl.so.7.3.1
  269. /usr/lib/libltdl.a
  270. /usr/lib/libltdl.la
  271. /usr/lib/libltdl.so
  272. /usr/lib/libltdl.so.7
  273. Message contains 217 additional lines
  274.  
  275. [00:00:07][c77c262e][tools/kexec-tools.bst ] SUCCESS Staging dependencies
  276. [--:--:--][c77c262e][tools/kexec-tools.bst ] START Integrating sandbox
  277. [--:--:--][c77c262e][tools/kexec-tools.bst ] STATUS Running integration command
  278.  
  279. ldconfig
  280.  
  281. [--:--:--][42a4dcd3][tools/strace.bst ] WARNING Overlapping files
  282.  
  283. Staged files overwrite existing files in staging area:
  284.  
  285. From core/readline.bst:
  286. /usr/share/info/dir
  287.  
  288. From core/bison.bst:
  289. /usr/share/info/dir
  290.  
  291. From core/libtool.bst:
  292. /usr/bin/libtool
  293. /usr/bin/libtoolize
  294. /usr/include/libltdl/lt_dlloader.h
  295. /usr/include/libltdl/lt_error.h
  296. /usr/include/libltdl/lt_system.h
  297. /usr/include/ltdl.h
  298. /usr/lib/debug/libltdl.so.7.3.1
  299. /usr/lib/libltdl.a
  300. /usr/lib/libltdl.la
  301. /usr/lib/libltdl.so
  302. /usr/lib/libltdl.so.7
  303. Message contains 217 additional lines
  304.  
  305. [00:00:08][42a4dcd3][tools/strace.bst ] SUCCESS Staging dependencies
  306. [--:--:--][42a4dcd3][tools/strace.bst ] START Integrating sandbox
  307. [--:--:--][42a4dcd3][tools/strace.bst ] STATUS Running integration command
  308.  
  309. ldconfig
  310.  
  311. [00:00:09][8de7f5ce][foundation/dbus.bst ] SUCCESS Fetching git://git.baserock.org/delta/dbus
  312. [00:00:09][8de7f5ce][foundation/dbus.bst ] SUCCESS gnu-toolchain/foundation-dbus/8de7f5ce-fetch.4152.log
  313. [--:--:--][9184efec][deploy-base/mtools.bst ] START gnu-toolchain/deploy-base-mtools/9184efec-fetch.4294.log
  314. [--:--:--][9184efec][deploy-base/mtools.bst ] START Fetching git://git.baserock.org/delta/mtools
  315. [00:00:01][9184efec][deploy-base/mtools.bst ] SUCCESS Fetching git://git.baserock.org/delta/mtools
  316. [00:00:01][9184efec][deploy-base/mtools.bst ] SUCCESS gnu-toolchain/deploy-base-mtools/9184efec-fetch.4294.log
  317. [--:--:--][925c566f][deploy-base/syslinux.bst ] START gnu-toolchain/deploy-base-syslinux/925c566f-fetch.4307.log
  318. [--:--:--][925c566f][deploy-base/syslinux.bst ] START Fetching git://git.baserock.org/delta/syslinux
  319. [--:--:--][c77c262e][tools/kexec-tools.bst ] STATUS Running integration command
  320.  
  321. update-ca-certificates
  322.  
  323. [--:--:--][42a4dcd3][tools/strace.bst ] STATUS Running integration command
  324.  
  325. update-ca-certificates
  326.  
  327. [--:--:--][1d10a226][tools/lsof.bst ] STATUS Running integration command
  328.  
  329. update-ca-certificates
  330.  
  331. [--:--:--][63e93742][debian-python.bst ] WARNING Overlapping files
  332.  
  333. Staged files overwrite existing files in staging area:
  334.  
  335. From dpkg-env.bst:
  336. /usr/share/doc/libtimedate-perl/changelog.Debian.gz
  337. /usr/share/doc/libtimedate-perl/changelog.gz
  338. /usr/share/doc/libtimedate-perl/copyright
  339. /usr/share/doc/libtinfo5/TODO.Debian
  340. /usr/share/doc/libtinfo5/changelog.Debian.gz
  341. /usr/share/doc/libtinfo5/changelog.gz
  342. /usr/share/doc/libtinfo5/copyright
  343. /usr/share/man/man3/Date::Format.3pm.gz
  344. /usr/share/man/man3/Date::Language.3pm.gz
  345. /usr/share/man/man3/Date::Language::Bulgarian.3pm.gz
  346. /usr/share/man/man3/Date::Language::Hungarian.3pm.gz
  347. /usr/share/man/man3/Date::Parse.3pm.gz
  348. /usr/share/man/man3/Time::Zone.3pm.gz
  349.  
  350. From gnu-toolchain/fhs-dirs.bst:
  351. /etc/issue
  352. /etc/protocols
  353. Message contains 897 additional lines
  354.  
  355. [--:--:--][63e93742][debian-python.bst ] WARNING Ignored files
  356.  
  357. Not staging files which would replace non-empty directories:
  358.  
  359. From gnu-toolchain/fhs-dirs.bst:
  360. /bin
  361. /lib
  362. /sbin
  363. /usr/sbin
  364.  
  365. [00:00:21][63e93742][debian-python.bst ] SUCCESS Staging dependencies
  366. [--:--:--][63e93742][debian-python.bst ] START Integrating sandbox
  367. [00:00:00][63e93742][debian-python.bst ] SUCCESS Integrating sandbox
  368. [--:--:--][63e93742][debian-python.bst ] START Staging sources
  369. [00:00:00][63e93742][debian-python.bst ] SUCCESS Staging sources
  370. [--:--:--][63e93742][debian-python.bst ] START Running build-commands
  371. [--:--:--][63e93742][debian-python.bst ] STATUS Running build-commands
  372.  
  373. debian/rules build
  374.  
  375. [00:00:22][63e93742][debian-python.bst ] BUG gnu-toolchain/debian-python/63e93742-build.4186.log
  376.  
  377. An unhandled exception occured:
  378.  
  379. Traceback (most recent call last):
  380. File "/home/jonathanmaw/workspace/buildstream/buildstream/buildstream/_scheduler/job.py", line 255, in child_action
  381. result = self.action(element)
  382. File "/home/jonathanmaw/workspace/buildstream/buildstream/buildstream/_scheduler/buildqueue.py", line 34, in process
  383. element._assemble()
  384. File "/home/jonathanmaw/workspace/buildstream/buildstream/buildstream/element.py", line 768, in _assemble
  385. collect = self.assemble(sandbox)
  386. File "/home/jonathanmaw/workspace/buildstream/buildstream/buildstream/buildelement.py", line 194, in assemble
  387. SandboxFlags.ROOT_READ_ONLY)
  388. File "/home/jonathanmaw/workspace/buildstream/buildstream/buildstream/_sandboxbwrap.py", line 146, in run
  389. os.unlink(device_path)
  390. OSError: [Errno 16] Device or resource busy: '/home/jonathanmaw/.cache/buildstream/build/debian-python-q219kd56/root/dev/full'
  391.  
  392. [00:00:46][f6ff40c1][foundation/systemd.bst ] SUCCESS Fetching git://git.baserock.org/delta/systemd
  393. [00:00:46][f6ff40c1][foundation/systemd.bst ] SUCCESS gnu-toolchain/foundation-systemd/f6ff40c1-fetch.4149.log
  394. [00:00:44][0131e971][deploy-base/nasm.bst ] SUCCESS Fetching git://git.baserock.org/delta/nasm
  395. [00:00:44][0131e971][deploy-base/nasm.bst ] SUCCESS gnu-toolchain/deploy-base-nasm/0131e971-fetch.4258.log
  396. [00:00:43][925c566f][deploy-base/syslinux.bst ] SUCCESS Fetching git://git.baserock.org/delta/syslinux
  397. [00:00:43][925c566f][deploy-base/syslinux.bst ] SUCCESS gnu-toolchain/deploy-base-syslinux/925c566f-fetch.4307.log
  398. [00:01:13][ab0ed0ea][tools/device-tree-compiler.bst ] SUCCESS Fetching git://git.baserock.org/delta/device-tree-compiler
  399. [00:01:13][ab0ed0ea][tools/device-tree-compiler.bst ] SUCCESS gnu-toolchain/tools-device-tree-compiler/ab0ed0ea-fetch.4156.log
  400. [00:01:45][6d209860][tools/u-boot.bst ] SUCCESS Fetching git://git.baserock.org/delta/u-boot
  401. [00:01:45][6d209860][tools/u-boot.bst ] SUCCESS gnu-toolchain/tools-u-boot/6d209860-fetch.4164.log
  402. [00:01:37][42a4dcd3][tools/strace.bst ] SUCCESS Integrating sandbox
  403. [--:--:--][42a4dcd3][tools/strace.bst ] START Staging sources
  404. [00:01:38][c77c262e][tools/kexec-tools.bst ] SUCCESS Integrating sandbox
  405. [--:--:--][c77c262e][tools/kexec-tools.bst ] START Staging sources
  406. [00:00:00][42a4dcd3][tools/strace.bst ] SUCCESS Staging sources
  407. [--:--:--][42a4dcd3][tools/strace.bst ] START Running configure-commands
  408. [--:--:--][42a4dcd3][tools/strace.bst ] STATUS Running configure-commands
  409.  
  410. export NOCONFIGURE=1;
  411. if [ -e autogen ]; then ./autogen;
  412. elif [ -e autogen.sh ]; then ./autogen.sh;
  413. elif [ -e bootstrap ]; then ./bootstrap;
  414. elif [ -e bootstrap.sh ]; then ./bootstrap.sh;
  415. elif [ ! -e ./configure ]; then autoreconf -ivf;
  416. fi
  417.  
  418. [00:00:00][c77c262e][tools/kexec-tools.bst ] SUCCESS Staging sources
  419. [--:--:--][c77c262e][tools/kexec-tools.bst ] START Running configure-commands
  420. [--:--:--][c77c262e][tools/kexec-tools.bst ] STATUS Running configure-commands
  421.  
  422. ./bootstrap
  423.  
  424. [00:01:38][1d10a226][tools/lsof.bst ] SUCCESS Integrating sandbox
  425. [--:--:--][1d10a226][tools/lsof.bst ] START Staging sources
  426. [00:00:00][1d10a226][tools/lsof.bst ] SUCCESS Staging sources
  427. [--:--:--][1d10a226][tools/lsof.bst ] START Running configure-commands
  428. [--:--:--][1d10a226][tools/lsof.bst ] STATUS Running configure-commands
  429.  
  430. tar xf lsof_*_src.tar --no-same-owner
  431.  
  432. [00:01:46][1d10a226][tools/lsof.bst ] BUG gnu-toolchain/tools-lsof/1d10a226-build.4189.log
  433.  
  434. An unhandled exception occured:
  435.  
  436. Traceback (most recent call last):
  437. File "/home/jonathanmaw/workspace/buildstream/buildstream/buildstream/_scheduler/job.py", line 255, in child_action
  438. result = self.action(element)
  439. File "/home/jonathanmaw/workspace/buildstream/buildstream/buildstream/_scheduler/buildqueue.py", line 34, in process
  440. element._assemble()
  441. File "/home/jonathanmaw/workspace/buildstream/buildstream/buildstream/element.py", line 768, in _assemble
  442. collect = self.assemble(sandbox)
  443. File "/home/jonathanmaw/workspace/buildstream/buildstream/buildstream/buildelement.py", line 194, in assemble
  444. SandboxFlags.ROOT_READ_ONLY)
  445. File "/home/jonathanmaw/workspace/buildstream/buildstream/buildstream/_sandboxbwrap.py", line 146, in run
  446. os.unlink(device_path)
  447. OSError: [Errno 16] Device or resource busy: '/home/jonathanmaw/.cache/buildstream/build/tools-lsof-q3zdekfk/root/dev/full'
  448.  
  449. [00:01:46][c77c262e][tools/kexec-tools.bst ] BUG gnu-toolchain/tools-kexec-tools/c77c262e-build.4184.log
  450.  
  451. An unhandled exception occured:
  452.  
  453. Traceback (most recent call last):
  454. File "/home/jonathanmaw/workspace/buildstream/buildstream/buildstream/_scheduler/job.py", line 255, in child_action
  455. result = self.action(element)
  456. File "/home/jonathanmaw/workspace/buildstream/buildstream/buildstream/_scheduler/buildqueue.py", line 34, in process
  457. element._assemble()
  458. File "/home/jonathanmaw/workspace/buildstream/buildstream/buildstream/element.py", line 768, in _assemble
  459. collect = self.assemble(sandbox)
  460. File "/home/jonathanmaw/workspace/buildstream/buildstream/buildstream/buildelement.py", line 194, in assemble
  461. SandboxFlags.ROOT_READ_ONLY)
  462. File "/home/jonathanmaw/workspace/buildstream/buildstream/buildstream/_sandboxbwrap.py", line 146, in run
  463. os.unlink(device_path)
  464. OSError: [Errno 16] Device or resource busy: '/home/jonathanmaw/.cache/buildstream/build/tools-kexec-tools-_zuawx2y/root/dev/full'
  465.  
  466. [00:01:48][ca9b0c52][tools/parted.bst ] SUCCESS Fetching git://git.baserock.org/delta/parted
  467. [00:01:48][ca9b0c52][tools/parted.bst ] SUCCESS gnu-toolchain/tools-parted/ca9b0c52-fetch.4170.log
  468. [00:01:49][42a4dcd3][tools/strace.bst ] BUG gnu-toolchain/tools-strace/42a4dcd3-build.4181.log
  469.  
  470. An unhandled exception occured:
  471.  
  472. Traceback (most recent call last):
  473. File "/home/jonathanmaw/workspace/buildstream/buildstream/buildstream/_scheduler/job.py", line 255, in child_action
  474. result = self.action(element)
  475. File "/home/jonathanmaw/workspace/buildstream/buildstream/buildstream/_scheduler/buildqueue.py", line 34, in process
  476. element._assemble()
  477. File "/home/jonathanmaw/workspace/buildstream/buildstream/buildstream/element.py", line 768, in _assemble
  478. collect = self.assemble(sandbox)
  479. File "/home/jonathanmaw/workspace/buildstream/buildstream/buildstream/buildelement.py", line 194, in assemble
  480. SandboxFlags.ROOT_READ_ONLY)
  481. File "/home/jonathanmaw/workspace/buildstream/buildstream/buildstream/_sandboxbwrap.py", line 146, in run
  482. os.unlink(device_path)
  483. OSError: [Errno 16] Device or resource busy: '/home/jonathanmaw/.cache/buildstream/build/tools-strace-xa177v5u/root/dev/full'
  484.  
  485. [00:01:59][dbc8c00d][tools/sudo.bst ] SUCCESS Fetching git://git.baserock.org/delta/sudo
  486. [00:01:59][dbc8c00d][tools/sudo.bst ] SUCCESS gnu-toolchain/tools-sudo/dbc8c00d-fetch.4223.log
  487. [00:03:08][8b883d1d][tools/procps-ng.bst ] SUCCESS Fetching git://git.baserock.org/delta/procps-ng
  488. [00:03:08][8b883d1d][tools/procps-ng.bst ] SUCCESS gnu-toolchain/tools-procps-ng/8b883d1d-fetch.4242.log
  489. [00:03:13][23c0f4c6][tools/gdb.bst ] SUCCESS Fetching git://git.baserock.org/delta/binutils-gdb
  490. [00:03:13][23c0f4c6][tools/gdb.bst ] SUCCESS gnu-toolchain/tools-gdb/23c0f4c6-fetch.4162.log
  491. [00:13:23][86c938e3][bsp-x86_64-generic/linux-x86-64-generic.bst] SUCCESS Fetching git://git.baserock.org/delta/linux
  492. [00:13:23][86c938e3][bsp-x86_64-generic/linux-x86-64-generic.bst] SUCCESS gnu-toolchain/bsp-x86_64-generic-linux-x86-64-generic/86c938e3-fetch.4155.log
  493. [00:13:23][2dc46d85][base-system-image.bst ] FAILURE Build failed
Advertisement
Add Comment
Please, Sign In to add comment