Guest User

Untitled

a guest
Sep 26th, 2013
137
Never
Not a member of Pastebin yet? Sign Up, it unlocks many cool features!
  1. /home/valentin/GSMCrack/gr-osmosdr/lib/uhd/uhd_sink_c.cc: In member function ‘virtual double uhd_sink_c::set_bandwidth(double, size_t)’:
  2. /home/valentin/GSMCrack/gr-osmosdr/lib/uhd/uhd_sink_c.cc:289:16: error: ‘class uhd_usrp_sink’ has no member named ‘get_bandwidth’
  3. /home/valentin/GSMCrack/gr-osmosdr/lib/uhd/uhd_sink_c.cc: In member function ‘virtual double uhd_sink_c::get_bandwidth(size_t)’:
  4. /home/valentin/GSMCrack/gr-osmosdr/lib/uhd/uhd_sink_c.cc:294:16: error: ‘class uhd_usrp_sink’ has no member named ‘get_bandwidth’
  5. /home/valentin/GSMCrack/gr-osmosdr/lib/uhd/uhd_sink_c.cc: In member function ‘virtual osmosdr::freq_range_t uhd_sink_c::get_bandwidth_range(size_t)’:
  6. /home/valentin/GSMCrack/gr-osmosdr/lib/uhd/uhd_sink_c.cc:301:3: error: ‘class uhd_usrp_sink’ has no member named ‘get_bandwidth_range’
  7. /home/valentin/GSMCrack/gr-osmosdr/lib/uhd/uhd_sink_c.cc:301:3: error: ‘class uhd_usrp_sink’ has no member named ‘get_bandwidth_range’
  8. /home/valentin/GSMCrack/gr-osmosdr/lib/uhd/uhd_sink_c.cc:301:3: error: ‘class uhd_usrp_sink’ has no member named ‘get_bandwidth_range’
  9. /home/valentin/GSMCrack/gr-osmosdr/lib/uhd/uhd_sink_c.cc:301:3: error: ‘class uhd_usrp_sink’ has no member named ‘get_bandwidth_range’
  10. /home/valentin/GSMCrack/gr-osmosdr/lib/uhd/uhd_sink_c.cc:301:3: error: ‘class uhd_usrp_sink’ has no member named ‘get_bandwidth_range’
  11. /home/valentin/GSMCrack/gr-osmosdr/lib/uhd/uhd_sink_c.cc:301:3: error: ‘class uhd_usrp_sink’ has no member named ‘get_bandwidth_range’
  12. /home/valentin/GSMCrack/gr-osmosdr/lib/uhd/uhd_sink_c.cc:301:3: error: ‘class uhd_usrp_sink’ has no member named ‘get_bandwidth_range’
  13. /home/valentin/GSMCrack/gr-osmosdr/lib/uhd/uhd_sink_c.cc:301:3: error: ‘class uhd_usrp_sink’ has no member named ‘get_bandwidth_range’
  14. /home/valentin/GSMCrack/gr-osmosdr/lib/uhd/uhd_sink_c.cc:301:3: error: ‘class uhd_usrp_sink’ has no member named ‘get_bandwidth_range’
  15. /home/valentin/GSMCrack/gr-osmosdr/lib/uhd/uhd_sink_c.cc:301:3: error: ‘class uhd_usrp_sink’ has no member named ‘get_bandwidth_range’
  16. /home/valentin/GSMCrack/gr-osmosdr/lib/uhd/uhd_sink_c.cc:301:3: error: ‘class uhd_usrp_sink’ has no member named ‘get_bandwidth_range’
  17. /home/valentin/GSMCrack/gr-osmosdr/lib/uhd/uhd_sink_c.cc:301:3: error: ‘class uhd_usrp_sink’ has no member named ‘get_bandwidth_range’
  18. /home/valentin/GSMCrack/gr-osmosdr/lib/uhd/uhd_sink_c.cc:301:3: error: ‘class uhd_usrp_sink’ has no member named ‘get_bandwidth_range’
  19. /home/valentin/GSMCrack/gr-osmosdr/lib/uhd/uhd_sink_c.cc:301:3: error: ‘class uhd_usrp_sink’ has no member named ‘get_bandwidth_range’
  20. /home/valentin/GSMCrack/gr-osmosdr/lib/uhd/uhd_sink_c.cc:301:3: error: ‘class uhd_usrp_sink’ has no member named ‘get_bandwidth_range’
  21. /home/valentin/GSMCrack/gr-osmosdr/lib/uhd/uhd_sink_c.cc:301:3: error: ‘class uhd_usrp_sink’ has no member named ‘get_bandwidth_range’
  22. /home/valentin/GSMCrack/gr-osmosdr/lib/uhd/uhd_sink_c.cc:301:3: error: ‘class uhd_usrp_sink’ has no member named ‘get_bandwidth_range’
  23. /home/valentin/GSMCrack/gr-osmosdr/lib/uhd/uhd_sink_c.cc:301:3: error: ‘class uhd_usrp_sink’ has no member named ‘get_bandwidth_range’
  24. /home/valentin/GSMCrack/gr-osmosdr/lib/uhd/uhd_sink_c.cc:301:3: error: ‘class uhd_usrp_sink’ has no member named ‘get_bandwidth_range’
  25. /home/valentin/GSMCrack/gr-osmosdr/lib/uhd/uhd_sink_c.cc:301:3: error: ‘class uhd_usrp_sink’ has no member named ‘get_bandwidth_range’
  26. /home/valentin/GSMCrack/gr-osmosdr/lib/uhd/uhd_sink_c.cc:301:3: error: ‘class uhd_usrp_sink’ has no member named ‘get_bandwidth_range’
  27. /home/valentin/GSMCrack/gr-osmosdr/lib/uhd/uhd_sink_c.cc:301:3: error: ‘class uhd_usrp_sink’ has no member named ‘get_bandwidth_range’
  28. /home/valentin/GSMCrack/gr-osmosdr/lib/uhd/uhd_sink_c.cc:301:3: error: ‘class uhd_usrp_sink’ has no member named ‘get_bandwidth_range’
  29. /home/valentin/GSMCrack/gr-osmosdr/lib/uhd/uhd_sink_c.cc:301:3: error: ‘class uhd_usrp_sink’ has no member named ‘get_bandwidth_range’
  30. /home/valentin/GSMCrack/gr-osmosdr/lib/uhd/uhd_sink_c.cc:301:3: error: ‘class uhd_usrp_sink’ has no member named ‘get_bandwidth_range’
  31. /home/valentin/GSMCrack/gr-osmosdr/lib/uhd/uhd_sink_c.cc:301:3: error: ‘class uhd_usrp_sink’ has no member named ‘get_bandwidth_range’
  32. /home/valentin/GSMCrack/gr-osmosdr/lib/uhd/uhd_sink_c.cc:301:3: error: ‘class uhd_usrp_sink’ has no member named ‘get_bandwidth_range’
  33. /home/valentin/GSMCrack/gr-osmosdr/lib/uhd/uhd_sink_c.cc: In member function ‘virtual double uhd_sink_c::get_bandwidth(size_t)’:
  34. /home/valentin/GSMCrack/gr-osmosdr/lib/uhd/uhd_sink_c.cc:295:1: warning: control reaches end of non-void function [-Wreturn-type]
  35. /home/valentin/GSMCrack/gr-osmosdr/lib/uhd/uhd_sink_c.cc: In member function ‘virtual double uhd_sink_c::set_bandwidth(double, size_t)’:
  36. /home/valentin/GSMCrack/gr-osmosdr/lib/uhd/uhd_sink_c.cc:290:1: warning: control reaches end of non-void function [-Wreturn-type]
  37. make[2]: *** [lib/CMakeFiles/gnuradio-osmosdr.dir/uhd/uhd_sink_c.cc.o] Error 1
  38. make[1]: *** [lib/CMakeFiles/gnuradio-osmosdr.dir/all] Error 2
  39. make: *** [all] Error 2
RAW Paste Data