SHARE
TWEET

Untitled

a guest May 23rd, 2014 197 Never
Not a member of Pastebin yet? Sign Up, it unlocks many cool features!
  1. DEBUG: Executing shell function do_compile
  2. NOTE: make -j 8
  3. make[1]: Entering directory '/home/anarky/i.MX6Q-SabreSD/yocto/poky/build/tmp/work/x86_64-linux/binutils-native/2.24-r0/binutils-2.24/build.x86_64-linux.x86_64-linux'
  4. make[1]: Nothing to be done for 'all-target'.
  5. make[2]: Entering directory '/home/anarky/i.MX6Q-SabreSD/yocto/poky/build/tmp/work/x86_64-linux/binutils-native/2.24-r0/binutils-2.24/build.x86_64-linux.x86_64-linux/intl'
  6. make[2]: Nothing to be done for 'all'.
  7. make[2]: Leaving directory '/home/anarky/i.MX6Q-SabreSD/yocto/poky/build/tmp/work/x86_64-linux/binutils-native/2.24-r0/binutils-2.24/build.x86_64-linux.x86_64-linux/intl'
  8. make[2]: Entering directory '/home/anarky/i.MX6Q-SabreSD/yocto/poky/build/tmp/work/x86_64-linux/binutils-native/2.24-r0/binutils-2.24/build.x86_64-linux.x86_64-linux/etc'
  9. for f in standards.info configure.info; do \
  10.   if test -f /home/anarky/i.MX6Q-SabreSD/yocto/poky/build/tmp/work/x86_64-linux/binutils-native/2.24-r0/binutils-2.24/etc/`echo $f | sed -e 's/.info$/.texi/'`; then \
  11.     if make "MAKEINFO=makeinfo --split-size=5000000 --split-size=5000000" $f; then \
  12.       true; \
  13.     else \
  14.       exit 1; \
  15.     fi; \
  16.   fi; \
  17. done
  18. make[2]: Entering directory '/home/anarky/i.MX6Q-SabreSD/yocto/poky/build/tmp/work/x86_64-linux/binutils-native/2.24-r0/binutils-2.24/build.x86_64-linux.x86_64-linux/libiberty'
  19. make[3]: Entering directory '/home/anarky/i.MX6Q-SabreSD/yocto/poky/build/tmp/work/x86_64-linux/binutils-native/2.24-r0/binutils-2.24/build.x86_64-linux.x86_64-linux/etc'
  20. make[3]: '/home/anarky/i.MX6Q-SabreSD/yocto/poky/build/tmp/work/x86_64-linux/binutils-native/2.24-r0/binutils-2.24/etc/standards.info' is up to date.
  21. make[3]: Leaving directory '/home/anarky/i.MX6Q-SabreSD/yocto/poky/build/tmp/work/x86_64-linux/binutils-native/2.24-r0/binutils-2.24/build.x86_64-linux.x86_64-linux/etc'
  22. make[3]: Entering directory '/home/anarky/i.MX6Q-SabreSD/yocto/poky/build/tmp/work/x86_64-linux/binutils-native/2.24-r0/binutils-2.24/build.x86_64-linux.x86_64-linux/libiberty/testsuite'
  23. make[3]: Nothing to be done for 'all'.
  24. make[3]: Leaving directory '/home/anarky/i.MX6Q-SabreSD/yocto/poky/build/tmp/work/x86_64-linux/binutils-native/2.24-r0/binutils-2.24/build.x86_64-linux.x86_64-linux/libiberty/testsuite'
  25. make[2]: Leaving directory '/home/anarky/i.MX6Q-SabreSD/yocto/poky/build/tmp/work/x86_64-linux/binutils-native/2.24-r0/binutils-2.24/build.x86_64-linux.x86_64-linux/libiberty'
  26. make[3]: Entering directory '/home/anarky/i.MX6Q-SabreSD/yocto/poky/build/tmp/work/x86_64-linux/binutils-native/2.24-r0/binutils-2.24/build.x86_64-linux.x86_64-linux/etc'
  27. make[3]: '/home/anarky/i.MX6Q-SabreSD/yocto/poky/build/tmp/work/x86_64-linux/binutils-native/2.24-r0/binutils-2.24/etc/configure.info' is up to date.
  28. make[3]: Leaving directory '/home/anarky/i.MX6Q-SabreSD/yocto/poky/build/tmp/work/x86_64-linux/binutils-native/2.24-r0/binutils-2.24/build.x86_64-linux.x86_64-linux/etc'
  29. make[2]: Leaving directory '/home/anarky/i.MX6Q-SabreSD/yocto/poky/build/tmp/work/x86_64-linux/binutils-native/2.24-r0/binutils-2.24/build.x86_64-linux.x86_64-linux/etc'
  30. make[2]: Entering directory '/home/anarky/i.MX6Q-SabreSD/yocto/poky/build/tmp/work/x86_64-linux/binutils-native/2.24-r0/binutils-2.24/build.x86_64-linux.x86_64-linux/bfd'
  31. Making info in doc
  32. make[3]: Entering directory '/home/anarky/i.MX6Q-SabreSD/yocto/poky/build/tmp/work/x86_64-linux/binutils-native/2.24-r0/binutils-2.24/build.x86_64-linux.x86_64-linux/bfd/doc'
  33. make[3]: Nothing to be done for 'info'.
  34. make[3]: Leaving directory '/home/anarky/i.MX6Q-SabreSD/yocto/poky/build/tmp/work/x86_64-linux/binutils-native/2.24-r0/binutils-2.24/build.x86_64-linux.x86_64-linux/bfd/doc'
  35. Making info in po
  36. make[3]: Entering directory '/home/anarky/i.MX6Q-SabreSD/yocto/poky/build/tmp/work/x86_64-linux/binutils-native/2.24-r0/binutils-2.24/build.x86_64-linux.x86_64-linux/bfd/po'
  37. make[3]: Nothing to be done for 'info'.
  38. make[3]: Leaving directory '/home/anarky/i.MX6Q-SabreSD/yocto/poky/build/tmp/work/x86_64-linux/binutils-native/2.24-r0/binutils-2.24/build.x86_64-linux.x86_64-linux/bfd/po'
  39. make[3]: Entering directory '/home/anarky/i.MX6Q-SabreSD/yocto/poky/build/tmp/work/x86_64-linux/binutils-native/2.24-r0/binutils-2.24/build.x86_64-linux.x86_64-linux/bfd'
  40. make[3]: Nothing to be done for 'info-am'.
  41. make[3]: Leaving directory '/home/anarky/i.MX6Q-SabreSD/yocto/poky/build/tmp/work/x86_64-linux/binutils-native/2.24-r0/binutils-2.24/build.x86_64-linux.x86_64-linux/bfd'
  42. make  all-recursive
  43. make[3]: Entering directory '/home/anarky/i.MX6Q-SabreSD/yocto/poky/build/tmp/work/x86_64-linux/binutils-native/2.24-r0/binutils-2.24/build.x86_64-linux.x86_64-linux/bfd'
  44. Making all in doc
  45. make[4]: Entering directory '/home/anarky/i.MX6Q-SabreSD/yocto/poky/build/tmp/work/x86_64-linux/binutils-native/2.24-r0/binutils-2.24/build.x86_64-linux.x86_64-linux/bfd/doc'
  46. make[4]: Nothing to be done for 'all'.
  47. make[4]: Leaving directory '/home/anarky/i.MX6Q-SabreSD/yocto/poky/build/tmp/work/x86_64-linux/binutils-native/2.24-r0/binutils-2.24/build.x86_64-linux.x86_64-linux/bfd/doc'
  48. Making all in po
  49. make[4]: Entering directory '/home/anarky/i.MX6Q-SabreSD/yocto/poky/build/tmp/work/x86_64-linux/binutils-native/2.24-r0/binutils-2.24/build.x86_64-linux.x86_64-linux/bfd/po'
  50. make[4]: Nothing to be done for 'all'.
  51. make[4]: Leaving directory '/home/anarky/i.MX6Q-SabreSD/yocto/poky/build/tmp/work/x86_64-linux/binutils-native/2.24-r0/binutils-2.24/build.x86_64-linux.x86_64-linux/bfd/po'
  52. make[4]: Entering directory '/home/anarky/i.MX6Q-SabreSD/yocto/poky/build/tmp/work/x86_64-linux/binutils-native/2.24-r0/binutils-2.24/build.x86_64-linux.x86_64-linux/bfd'
  53. make[4]: Leaving directory '/home/anarky/i.MX6Q-SabreSD/yocto/poky/build/tmp/work/x86_64-linux/binutils-native/2.24-r0/binutils-2.24/build.x86_64-linux.x86_64-linux/bfd'
  54. make[3]: Leaving directory '/home/anarky/i.MX6Q-SabreSD/yocto/poky/build/tmp/work/x86_64-linux/binutils-native/2.24-r0/binutils-2.24/build.x86_64-linux.x86_64-linux/bfd'
  55. make[2]: Leaving directory '/home/anarky/i.MX6Q-SabreSD/yocto/poky/build/tmp/work/x86_64-linux/binutils-native/2.24-r0/binutils-2.24/build.x86_64-linux.x86_64-linux/bfd'
  56. make[2]: Entering directory '/home/anarky/i.MX6Q-SabreSD/yocto/poky/build/tmp/work/x86_64-linux/binutils-native/2.24-r0/binutils-2.24/build.x86_64-linux.x86_64-linux/opcodes'
  57. make  all-recursive
  58. make[3]: Entering directory '/home/anarky/i.MX6Q-SabreSD/yocto/poky/build/tmp/work/x86_64-linux/binutils-native/2.24-r0/binutils-2.24/build.x86_64-linux.x86_64-linux/opcodes'
  59. Making all in .
  60. make[4]: Entering directory '/home/anarky/i.MX6Q-SabreSD/yocto/poky/build/tmp/work/x86_64-linux/binutils-native/2.24-r0/binutils-2.24/build.x86_64-linux.x86_64-linux/opcodes'
  61. /home/anarky/i.MX6Q-SabreSD/yocto/poky/build/tmp/work/x86_64-linux/binutils-native/2.24-r0/binutils-2.24/opcodes/i386-tbl.h
  62. make[4]: Leaving directory '/home/anarky/i.MX6Q-SabreSD/yocto/poky/build/tmp/work/x86_64-linux/binutils-native/2.24-r0/binutils-2.24/build.x86_64-linux.x86_64-linux/opcodes'
  63. Making all in po
  64. make[4]: Entering directory '/home/anarky/i.MX6Q-SabreSD/yocto/poky/build/tmp/work/x86_64-linux/binutils-native/2.24-r0/binutils-2.24/build.x86_64-linux.x86_64-linux/opcodes/po'
  65. make[4]: Nothing to be done for 'all'.
  66. make[4]: Leaving directory '/home/anarky/i.MX6Q-SabreSD/yocto/poky/build/tmp/work/x86_64-linux/binutils-native/2.24-r0/binutils-2.24/build.x86_64-linux.x86_64-linux/opcodes/po'
  67. make[3]: Leaving directory '/home/anarky/i.MX6Q-SabreSD/yocto/poky/build/tmp/work/x86_64-linux/binutils-native/2.24-r0/binutils-2.24/build.x86_64-linux.x86_64-linux/opcodes'
  68. make[2]: Leaving directory '/home/anarky/i.MX6Q-SabreSD/yocto/poky/build/tmp/work/x86_64-linux/binutils-native/2.24-r0/binutils-2.24/build.x86_64-linux.x86_64-linux/opcodes'
  69. make[2]: Entering directory '/home/anarky/i.MX6Q-SabreSD/yocto/poky/build/tmp/work/x86_64-linux/binutils-native/2.24-r0/binutils-2.24/build.x86_64-linux.x86_64-linux/gas'
  70. make  all-recursive
  71. make[3]: Entering directory '/home/anarky/i.MX6Q-SabreSD/yocto/poky/build/tmp/work/x86_64-linux/binutils-native/2.24-r0/binutils-2.24/build.x86_64-linux.x86_64-linux/gas'
  72. Making all in doc
  73. make[4]: Entering directory '/home/anarky/i.MX6Q-SabreSD/yocto/poky/build/tmp/work/x86_64-linux/binutils-native/2.24-r0/binutils-2.24/build.x86_64-linux.x86_64-linux/gas/doc'
  74. make[4]: Nothing to be done for 'all'.
  75. make[4]: Leaving directory '/home/anarky/i.MX6Q-SabreSD/yocto/poky/build/tmp/work/x86_64-linux/binutils-native/2.24-r0/binutils-2.24/build.x86_64-linux.x86_64-linux/gas/doc'
  76. Making all in po
  77. make[4]: Entering directory '/home/anarky/i.MX6Q-SabreSD/yocto/poky/build/tmp/work/x86_64-linux/binutils-native/2.24-r0/binutils-2.24/build.x86_64-linux.x86_64-linux/gas/po'
  78. make[4]: Nothing to be done for 'all'.
  79. make[4]: Leaving directory '/home/anarky/i.MX6Q-SabreSD/yocto/poky/build/tmp/work/x86_64-linux/binutils-native/2.24-r0/binutils-2.24/build.x86_64-linux.x86_64-linux/gas/po'
  80. make[4]: Entering directory '/home/anarky/i.MX6Q-SabreSD/yocto/poky/build/tmp/work/x86_64-linux/binutils-native/2.24-r0/binutils-2.24/build.x86_64-linux.x86_64-linux/gas'
  81. gcc  -DHAVE_CONFIG_H -I. -I/home/anarky/i.MX6Q-SabreSD/yocto/poky/build/tmp/work/x86_64-linux/binutils-native/2.24-r0/binutils-2.24/gas  -I. -I/home/anarky/i.MX6Q-SabreSD/yocto/poky/build/tmp/work/x86_64-linux/binutils-native/2.24-r0/binutils-2.24/gas -I../bfd -I/home/anarky/i.MX6Q-SabreSD/yocto/poky/build/tmp/work/x86_64-linux/binutils-native/2.24-r0/binutils-2.24/gas/config -I/home/anarky/i.MX6Q-SabreSD/yocto/poky/build/tmp/work/x86_64-linux/binutils-native/2.24-r0/binutils-2.24/gas/../include -I/home/anarky/i.MX6Q-SabreSD/yocto/poky/build/tmp/work/x86_64-linux/binutils-native/2.24-r0/binutils-2.24/gas/.. -I/home/anarky/i.MX6Q-SabreSD/yocto/poky/build/tmp/work/x86_64-linux/binutils-native/2.24-r0/binutils-2.24/gas/../bfd -DLOCALEDIR="\"/home/anarky/i.MX6Q-SabreSD/yocto/poky/build/tmp/sysroots/x86_64-linux/usr/share/locale\"" -isystem/home/anarky/i.MX6Q-SabreSD/yocto/poky/build/tmp/sysroots/x86_64-linux/usr/include -W -Wall -Wstrict-prototypes -Wmissing-prototypes -Wshadow -Werror -isystem/home/anarky/i.MX6Q-SabreSD/yocto/poky/build/tmp/sysroots/x86_64-linux/usr/include -O2 -pipe -c /home/anarky/i.MX6Q-SabreSD/yocto/poky/build/tmp/work/x86_64-linux/binutils-native/2.24-r0/binutils-2.24/gas/subsegs.c
  82. gcc  -DHAVE_CONFIG_H -I. -I/home/anarky/i.MX6Q-SabreSD/yocto/poky/build/tmp/work/x86_64-linux/binutils-native/2.24-r0/binutils-2.24/gas  -I. -I/home/anarky/i.MX6Q-SabreSD/yocto/poky/build/tmp/work/x86_64-linux/binutils-native/2.24-r0/binutils-2.24/gas -I../bfd -I/home/anarky/i.MX6Q-SabreSD/yocto/poky/build/tmp/work/x86_64-linux/binutils-native/2.24-r0/binutils-2.24/gas/config -I/home/anarky/i.MX6Q-SabreSD/yocto/poky/build/tmp/work/x86_64-linux/binutils-native/2.24-r0/binutils-2.24/gas/../include -I/home/anarky/i.MX6Q-SabreSD/yocto/poky/build/tmp/work/x86_64-linux/binutils-native/2.24-r0/binutils-2.24/gas/.. -I/home/anarky/i.MX6Q-SabreSD/yocto/poky/build/tmp/work/x86_64-linux/binutils-native/2.24-r0/binutils-2.24/gas/../bfd -DLOCALEDIR="\"/home/anarky/i.MX6Q-SabreSD/yocto/poky/build/tmp/sysroots/x86_64-linux/usr/share/locale\"" -isystem/home/anarky/i.MX6Q-SabreSD/yocto/poky/build/tmp/sysroots/x86_64-linux/usr/include -W -Wall -Wstrict-prototypes -Wmissing-prototypes -Wshadow -Werror -isystem/home/anarky/i.MX6Q-SabreSD/yocto/poky/build/tmp/sysroots/x86_64-linux/usr/include -O2 -pipe -c /home/anarky/i.MX6Q-SabreSD/yocto/poky/build/tmp/work/x86_64-linux/binutils-native/2.24-r0/binutils-2.24/gas/write.c
  83. gcc  -DHAVE_CONFIG_H -I. -I/home/anarky/i.MX6Q-SabreSD/yocto/poky/build/tmp/work/x86_64-linux/binutils-native/2.24-r0/binutils-2.24/gas  -I. -I/home/anarky/i.MX6Q-SabreSD/yocto/poky/build/tmp/work/x86_64-linux/binutils-native/2.24-r0/binutils-2.24/gas -I../bfd -I/home/anarky/i.MX6Q-SabreSD/yocto/poky/build/tmp/work/x86_64-linux/binutils-native/2.24-r0/binutils-2.24/gas/config -I/home/anarky/i.MX6Q-SabreSD/yocto/poky/build/tmp/work/x86_64-linux/binutils-native/2.24-r0/binutils-2.24/gas/../include -I/home/anarky/i.MX6Q-SabreSD/yocto/poky/build/tmp/work/x86_64-linux/binutils-native/2.24-r0/binutils-2.24/gas/.. -I/home/anarky/i.MX6Q-SabreSD/yocto/poky/build/tmp/work/x86_64-linux/binutils-native/2.24-r0/binutils-2.24/gas/../bfd -DLOCALEDIR="\"/home/anarky/i.MX6Q-SabreSD/yocto/poky/build/tmp/sysroots/x86_64-linux/usr/share/locale\"" -isystem/home/anarky/i.MX6Q-SabreSD/yocto/poky/build/tmp/sysroots/x86_64-linux/usr/include -W -Wall -Wstrict-prototypes -Wmissing-prototypes -Wshadow -Werror -isystem/home/anarky/i.MX6Q-SabreSD/yocto/poky/build/tmp/sysroots/x86_64-linux/usr/include -O2 -pipe -c -o obj-elf.o `test -f 'config/obj-elf.c' || echo '/home/anarky/i.MX6Q-SabreSD/yocto/poky/build/tmp/work/x86_64-linux/binutils-native/2.24-r0/binutils-2.24/gas/'`config/obj-elf.c
  84. In file included from /home/anarky/i.MX6Q-SabreSD/yocto/poky/build/tmp/work/x86_64-linux/binutils-native/2.24-r0/binutils-2.24/gas/as.h:95:0,
  85.                  from /home/anarky/i.MX6Q-SabreSD/yocto/poky/build/tmp/work/x86_64-linux/binutils-native/2.24-r0/binutils-2.24/gas/write.c:25:
  86. /home/anarky/i.MX6Q-SabreSD/yocto/poky/build/tmp/work/x86_64-linux/binutils-native/2.24-r0/binutils-2.24/gas/write.c: In function 'record_alignment':
  87. ../bfd/bfd.h:303:83: error: right-hand operand of comma expression has no effect [-Werror=unused-value]
  88.  #define bfd_set_section_alignment(bfd, ptr, val) (((ptr)->alignment_power = (val)),TRUE)
  89.                                                                                    ^
  90. /home/anarky/i.MX6Q-SabreSD/yocto/poky/build/tmp/work/x86_64-linux/binutils-native/2.24-r0/binutils-2.24/gas/write.c:366:5: note: in expansion of macro 'bfd_set_section_alignment'
  91.      bfd_set_section_alignment (stdoutput, seg, align);
  92.      ^
  93. In file included from /home/anarky/i.MX6Q-SabreSD/yocto/poky/build/tmp/work/x86_64-linux/binutils-native/2.24-r0/binutils-2.24/gas/as.h:95:0,
  94.                  from /home/anarky/i.MX6Q-SabreSD/yocto/poky/build/tmp/work/x86_64-linux/binutils-native/2.24-r0/binutils-2.24/gas/subsegs.c:25:
  95. /home/anarky/i.MX6Q-SabreSD/yocto/poky/build/tmp/work/x86_64-linux/binutils-native/2.24-r0/binutils-2.24/gas/subsegs.c: In function 'subseg_change':
  96. ../bfd/bfd.h:304:75: error: right-hand operand of comma expression has no effect [-Werror=unused-value]
  97.  #define bfd_set_section_userdata(bfd, ptr, val) (((ptr)->userdata = (val)),TRUE)
  98.                                                                            ^
  99. /home/anarky/i.MX6Q-SabreSD/yocto/poky/build/tmp/work/x86_64-linux/binutils-native/2.24-r0/binutils-2.24/gas/subsegs.c:70:7: note: in expansion of macro 'bfd_set_section_userdata'
  100.        bfd_set_section_userdata (stdoutput, seg, seginfo);
  101.        ^
  102. /home/anarky/i.MX6Q-SabreSD/yocto/poky/build/tmp/work/x86_64-linux/binutils-native/2.24-r0/binutils-2.24/gas/subsegs.c: In function 'subseg_get':
  103. ../bfd/bfd.h:304:75: error: right-hand operand of comma expression has no effect [-Werror=unused-value]
  104.  #define bfd_set_section_userdata(bfd, ptr, val) (((ptr)->userdata = (val)),TRUE)
  105.                                                                            ^
  106. /home/anarky/i.MX6Q-SabreSD/yocto/poky/build/tmp/work/x86_64-linux/binutils-native/2.24-r0/binutils-2.24/gas/subsegs.c:172:7: note: in expansion of macro 'bfd_set_section_userdata'
  107.        bfd_set_section_userdata (stdoutput, secptr, seginfo);
  108.        ^
  109. In file included from /home/anarky/i.MX6Q-SabreSD/yocto/poky/build/tmp/work/x86_64-linux/binutils-native/2.24-r0/binutils-2.24/gas/as.h:95:0,
  110.                  from /home/anarky/i.MX6Q-SabreSD/yocto/poky/build/tmp/work/x86_64-linux/binutils-native/2.24-r0/binutils-2.24/gas/config/obj-elf.c:24:
  111. /home/anarky/i.MX6Q-SabreSD/yocto/poky/build/tmp/work/x86_64-linux/binutils-native/2.24-r0/binutils-2.24/gas/config/obj-elf.c: In function 'obj_elf_init_stab_section':
  112. ../bfd/bfd.h:303:83: error: right-hand operand of comma expression has no effect [-Werror=unused-value]
  113.  #define bfd_set_section_alignment(bfd, ptr, val) (((ptr)->alignment_power = (val)),TRUE)
  114.                                                                                    ^
  115. /home/anarky/i.MX6Q-SabreSD/yocto/poky/build/tmp/work/x86_64-linux/binutils-native/2.24-r0/binutils-2.24/gas/config/obj-elf.c:1940:3: note: in expansion of macro 'bfd_set_section_alignment'
  116.    bfd_set_section_alignment (stdoutput, seg, 2);
  117.    ^
  118. cc1: all warnings being treated as errors
  119. Makefile:895: recipe for target 'subsegs.o' failed
  120. make[4]: *** [subsegs.o] Error 1
  121. make[4]: *** Waiting for unfinished jobs....
  122. cc1: all warnings being treated as errors
  123. Makefile:895: recipe for target 'write.o' failed
  124. make[4]: *** [write.o] Error 1
  125. cc1: all warnings being treated as errors
  126. Makefile:1938: recipe for target 'obj-elf.o' failed
  127. make[4]: *** [obj-elf.o] Error 1
  128. make[4]: Leaving directory '/home/anarky/i.MX6Q-SabreSD/yocto/poky/build/tmp/work/x86_64-linux/binutils-native/2.24-r0/binutils-2.24/build.x86_64-linux.x86_64-linux/gas'
  129. Makefile:2165: recipe for target 'all-recursive' failed
  130. make[3]: *** [all-recursive] Error 1
  131. make[3]: Leaving directory '/home/anarky/i.MX6Q-SabreSD/yocto/poky/build/tmp/work/x86_64-linux/binutils-native/2.24-r0/binutils-2.24/build.x86_64-linux.x86_64-linux/gas'
  132. Makefile:682: recipe for target 'all' failed
  133. make[2]: *** [all] Error 2
  134. make[2]: Leaving directory '/home/anarky/i.MX6Q-SabreSD/yocto/poky/build/tmp/work/x86_64-linux/binutils-native/2.24-r0/binutils-2.24/build.x86_64-linux.x86_64-linux/gas'
  135. Makefile:4710: recipe for target 'all-gas' failed
  136. make[1]: *** [all-gas] Error 2
  137. make[1]: Leaving directory '/home/anarky/i.MX6Q-SabreSD/yocto/poky/build/tmp/work/x86_64-linux/binutils-native/2.24-r0/binutils-2.24/build.x86_64-linux.x86_64-linux'
  138. Makefile:830: recipe for target 'all' failed
  139. make: *** [all] Error 2
  140. ERROR: oe_runmake failed
  141. WARNING: /home/anarky/i.MX6Q-SabreSD/yocto/poky/build/tmp/work/x86_64-linux/binutils-native/2.24-r0/temp/run.do_compile.25261:1 exit 1 from
  142.   exit 1
  143. ERROR: Function failed: do_compile (log file is located at /home/anarky/i.MX6Q-SabreSD/yocto/poky/build/tmp/work/x86_64-linux/binutils-native/2.24-r0/temp/log.do_compile.25261)
RAW Paste Data
We use cookies for various purposes including analytics. By continuing to use Pastebin, you agree to our use of cookies as described in the Cookies Policy. OK, I Understand
 
Top