SergOmarov

Untitled

Apr 19th, 2017
80
Never
Not a member of Pastebin yet? Sign Up, it unlocks many cool features!
  1. :decompileMc FAILED
  2.  
  3. FAILURE: Build failed with an exception.
  4.  
  5. * What went wrong:
  6. Execution failed for task ':decompileMc'.
  7. > Java heap space
  8.  
  9. * Try:
  10. Run with --stacktrace option to get the stack trace. Run with --info or --debug
  11. option to get more log output.
  12.  
  13. BUILD FAILED
  14.  
  15. Total time: 16 hrs 17 mins 32.341 secs
RAW Paste Data