daily pastebin goal
75%
SHARE
TWEET

Untitled

a guest Dec 7th, 2017 49 Never
Not a member of Pastebin yet? Sign Up, it unlocks many cool features!
  1. -bash-4.0# cat CMakeError.log
  2. Determining if the Q_WS_WIN exist failed with the following output:
  3. Change Dir: /home/neil/eos/eos-movrec-0.3.1_beta/build/CMakeFiles/CMakeTmp
  4.  
  5. Run Build Command:/usr/bin/gmake "cmTryCompileExec/fast"
  6. /usr/bin/gmake -f CMakeFiles/cmTryCompileExec.dir/build.make CMakeFiles/cmTryCompileExec.dir/build
  7. gmake[1]: Entering directory `/home/neil/eos/eos-movrec-0.3.1_beta/build/CMakeFiles/CMakeTmp'
  8. /usr/bin/cmake -E cmake_progress_report /home/neil/eos/eos-movrec-0.3.1_beta/build/CMakeFiles/CMakeTmp/CMakeFiles 1
  9. Building C object CMakeFiles/cmTryCompileExec.dir/CheckSymbolExists.c.o
  10. /usr/lib64/ccache/gcc    -o CMakeFiles/cmTryCompileExec.dir/CheckSymbolExists.c.o   -c /home/neil/eos/eos-movrec-0.3.1_beta/build/CMakeFiles/CMakeTmp/CheckSymbolExists.c
  11. /home/neil/eos/eos-movrec-0.3.1_beta/build/CMakeFiles/CMakeTmp/CheckSymbolExists.c: In function ‘main’:
  12. /home/neil/eos/eos-movrec-0.3.1_beta/build/CMakeFiles/CMakeTmp/CheckSymbolExists.c:8: error: ‘Q_WS_WIN’ undeclared (first use in this function)
  13. /home/neil/eos/eos-movrec-0.3.1_beta/build/CMakeFiles/CMakeTmp/CheckSymbolExists.c:8: error: (Each undeclared identifier is reported only once
  14. /home/neil/eos/eos-movrec-0.3.1_beta/build/CMakeFiles/CMakeTmp/CheckSymbolExists.c:8: error: for each function it appears in.)
  15. gmake[1]: *** [CMakeFiles/cmTryCompileExec.dir/CheckSymbolExists.c.o] Error 1
  16. gmake[1]: Leaving directory `/home/neil/eos/eos-movrec-0.3.1_beta/build/CMakeFiles/CMakeTmp'
  17. gmake: *** [cmTryCompileExec/fast] Error 2
  18.  
  19. File /home/neil/eos/eos-movrec-0.3.1_beta/build/CMakeFiles/CMakeTmp/CheckSymbolExists.c:
  20. /* */
  21. #include <QtCore/qglobal.h>
  22.  
  23. void cmakeRequireSymbol(int dummy,...){(void)dummy;}
  24. int main()
  25. {
  26. #ifndef Q_WS_WIN
  27.   cmakeRequireSymbol(0,&Q_WS_WIN);
  28. #endif
  29.   return 0;
  30. }
  31.  
  32. Determining if the Q_WS_QWS exist failed with the following output:
  33. Change Dir: /home/neil/eos/eos-movrec-0.3.1_beta/build/CMakeFiles/CMakeTmp
  34.  
  35. Run Build Command:/usr/bin/gmake "cmTryCompileExec/fast"
  36. /usr/bin/gmake -f CMakeFiles/cmTryCompileExec.dir/build.make CMakeFiles/cmTryCompileExec.dir/build
  37. gmake[1]: Entering directory `/home/neil/eos/eos-movrec-0.3.1_beta/build/CMakeFiles/CMakeTmp'
  38. /usr/bin/cmake -E cmake_progress_report /home/neil/eos/eos-movrec-0.3.1_beta/build/CMakeFiles/CMakeTmp/CMakeFiles 1
  39. Building C object CMakeFiles/cmTryCompileExec.dir/CheckSymbolExists.c.o
  40. /usr/lib64/ccache/gcc    -o CMakeFiles/cmTryCompileExec.dir/CheckSymbolExists.c.o   -c /home/neil/eos/eos-movrec-0.3.1_beta/build/CMakeFiles/CMakeTmp/CheckSymbolExists.c
  41. /home/neil/eos/eos-movrec-0.3.1_beta/build/CMakeFiles/CMakeTmp/CheckSymbolExists.c: In function ‘main’:
  42. /home/neil/eos/eos-movrec-0.3.1_beta/build/CMakeFiles/CMakeTmp/CheckSymbolExists.c:8: error: ‘Q_WS_QWS’ undeclared (first use in this function)
  43. /home/neil/eos/eos-movrec-0.3.1_beta/build/CMakeFiles/CMakeTmp/CheckSymbolExists.c:8: error: (Each undeclared identifier is reported only once
  44. /home/neil/eos/eos-movrec-0.3.1_beta/build/CMakeFiles/CMakeTmp/CheckSymbolExists.c:8: error: for each function it appears in.)
  45. gmake[1]: *** [CMakeFiles/cmTryCompileExec.dir/CheckSymbolExists.c.o] Error 1
  46. gmake[1]: Leaving directory `/home/neil/eos/eos-movrec-0.3.1_beta/build/CMakeFiles/CMakeTmp'
  47. gmake: *** [cmTryCompileExec/fast] Error 2
  48.  
  49. File /home/neil/eos/eos-movrec-0.3.1_beta/build/CMakeFiles/CMakeTmp/CheckSymbolExists.c:
  50. /* */
  51. #include <QtCore/qglobal.h>
  52.  
  53. void cmakeRequireSymbol(int dummy,...){(void)dummy;}
  54. int main()
  55. {
  56. #ifndef Q_WS_QWS
  57.   cmakeRequireSymbol(0,&Q_WS_QWS);
  58. #endif
  59.   return 0;
  60. }
RAW Paste Data
Top