Advertisement
Guest User

Untitled

a guest
Dec 18th, 2015
180
0
Never
Not a member of Pastebin yet? Sign Up, it unlocks many cool features!
text 2.86 KB | None | 0 0
  1. DKMS make.log for nvidia-340.96 for kernel 4.2.7-300.fc23.x86_64 (x86_64)
  2. Thu Dec 17 21:55:51 PST 2015
  3.  
  4. gcc-version-check failed:
  5.  
  6. The compiler used to compile the kernel (gcc
  7. 5.1) does not exactly match the current compiler
  8. (gcc 5.3). The Linux 2.6 kernel module loader
  9. rejects kernel modules built with a version of gcc
  10. that does not exactly match that of the compiler
  11. used to build the running kernel.
  12.  
  13. If you know what you are doing and want to override
  14. the gcc version check, you can do so by setting the
  15. IGNORE_CC_MISMATCH environment variable to "1".
  16.  
  17. In any other case, set the CC environment variable
  18. to the name of the compiler that was used to compile
  19. the kernel.
  20.  
  21. *** Failed CC version check. Bailing out! ***
  22.  
  23. nvidia-modules-common.mk:201: recipe for target 'build-sanity-checks' failed
  24. make: *** [build-sanity-checks] Error 1
  25. make: Entering directory '/var/lib/dkms/nvidia/340.96/build/uvm'
  26. cd ./..; make module SYSSRC=/lib/modules/4.2.7-300.fc23.x86_64/source SYSOUT=/lib/modules/4.2.7-300.fc23.x86_64/build KBUILD_EXTMOD=./..
  27. make[1]: Entering directory '/var/lib/dkms/nvidia/340.96/build'
  28. NVIDIA: calling KBUILD...
  29. make[2]: Entering directory '/usr/src/kernels/4.2.7-300.fc23.x86_64'
  30. make -C /lib/modules/4.2.7-300.fc23.x86_64/build KBUILD_SRC=/usr/src/kernels/4.2.7-300.fc23.x86_64 \
  31. -f /usr/src/kernels/4.2.7-300.fc23.x86_64/Makefile modules
  32. make[3]: Entering directory '/usr/src/kernels/4.2.7-300.fc23.x86_64'
  33. test -e include/generated/autoconf.h -a -e include/config/auto.conf || ( \
  34. echo >&2; \
  35. echo >&2 " ERROR: Kernel configuration is invalid."; \
  36. echo >&2 " include/generated/autoconf.h or include/config/auto.conf are missing.";\
  37. echo >&2 " Run 'make oldconfig && make prepare' on kernel src to fix it."; \
  38. echo >&2 ; \
  39. /bin/false)
  40. mkdir -p ./../.tmp_versions ; rm -f ./../.tmp_versions/*
  41. make -f /usr/src/kernels/4.2.7-300.fc23.x86_64/scripts/Makefile.build obj=./..
  42. /usr/src/kernels/4.2.7-300.fc23.x86_64/scripts/Makefile.build:44: /usr/src/kernels/4.2.7-300.fc23.x86_64/./../Makefile: No such file or directory
  43. make[4]: *** No rule to make target '/usr/src/kernels/4.2.7-300.fc23.x86_64/./../Makefile'. Stop.
  44. /usr/src/kernels/4.2.7-300.fc23.x86_64/Makefile:1390: recipe for target '_module_./..' failed
  45. make[3]: *** [_module_./..] Error 2
  46. make[3]: Leaving directory '/usr/src/kernels/4.2.7-300.fc23.x86_64'
  47. Makefile:146: recipe for target 'sub-make' failed
  48. make[2]: *** [sub-make] Error 2
  49. make[2]: Leaving directory '/usr/src/kernels/4.2.7-300.fc23.x86_64'
  50. NVIDIA: left KBUILD.
  51. nvidia.ko failed to build!
  52. Makefile:184: recipe for target 'nvidia.ko' failed
  53. make[1]: *** [nvidia.ko] Error 1
  54. make[1]: Leaving directory '/var/lib/dkms/nvidia/340.96/build'
  55. Makefile:219: recipe for target '../Module.symvers' failed
  56. make: *** [../Module.symvers] Error 2
  57. make: Leaving directory '/var/lib/dkms/nvidia/340.96/build/uvm'
Advertisement
Add Comment
Please, Sign In to add comment
Advertisement