Advertisement
Guest User

peps-error

a guest
Oct 8th, 2015
213
0
Never
Not a member of Pastebin yet? Sign Up, it unlocks many cool features!
text 41.96 KB | None | 0 0
  1. ---> Running in 0eb066bdab6f
  2. npm http GET https://registry.npmjs.org/simplesmtp
  3. npm http GET https://registry.npmjs.org/rai
  4. npm http GET https://registry.npmjs.org/nodemailer
  5. npm http GET https://registry.npmjs.org/ldapjs
  6. npm http GET https://registry.npmjs.org/iconv
  7. npm http GET https://registry.npmjs.org/nodemailer-smtp-transport
  8. npm http GET https://registry.npmjs.org/mailparser
  9. npm http GET https://registry.npmjs.org/html-to-text
  10. npm http GET https://registry.npmjs.org/tweetnacl
  11. npm http GET https://registry.npmjs.org/intl-messageformat
  12. npm http GET https://registry.npmjs.org/intl
  13. npm http GET https://registry.npmjs.org/ursa
  14. npm http 200 https://registry.npmjs.org/nodemailer
  15. npm http GET https://registry.npmjs.org/nodemailer/-/nodemailer-1.8.0.tgz
  16. npm http 200 https://registry.npmjs.org/iconv
  17. npm http 200 https://registry.npmjs.org/ldapjs
  18. npm http 200 https://registry.npmjs.org/simplesmtp
  19. npm http 200 https://registry.npmjs.org/nodemailer/-/nodemailer-1.8.0.tgz
  20. npm http GET https://registry.npmjs.org/iconv/-/iconv-2.1.11.tgz
  21. npm http GET https://registry.npmjs.org/ldapjs/-/ldapjs-0.7.1.tgz
  22. npm http GET https://registry.npmjs.org/simplesmtp/-/simplesmtp-0.3.35.tgz
  23. npm http 200 https://registry.npmjs.org/iconv/-/iconv-2.1.11.tgz
  24. npm http 200 https://registry.npmjs.org/nodemailer-smtp-transport
  25. npm http 200 https://registry.npmjs.org/simplesmtp/-/simplesmtp-0.3.35.tgz
  26. npm http GET https://registry.npmjs.org/nodemailer-smtp-transport/-/nodemailer-smtp-transport-1.0.3.tgz
  27. npm http 200 https://registry.npmjs.org/intl-messageformat
  28. npm http 200 https://registry.npmjs.org/nodemailer-smtp-transport/-/nodemailer-smtp-transport-1.0.3.tgz
  29. npm http 200 https://registry.npmjs.org/tweetnacl
  30. npm http 200 https://registry.npmjs.org/ldapjs/-/ldapjs-0.7.1.tgz
  31. npm http GET https://registry.npmjs.org/intl-messageformat/-/intl-messageformat-1.1.0.tgz
  32. npm http 200 https://registry.npmjs.org/rai
  33. npm http GET https://registry.npmjs.org/tweetnacl/-/tweetnacl-0.13.2.tgz
  34. npm http 200 https://registry.npmjs.org/intl-messageformat/-/intl-messageformat-1.1.0.tgz
  35. npm http GET https://registry.npmjs.org/rai/-/rai-0.1.12.tgz
  36. npm http 200 https://registry.npmjs.org/tweetnacl/-/tweetnacl-0.13.2.tgz
  37. npm http 200 https://registry.npmjs.org/rai/-/rai-0.1.12.tgz
  38. npm http 200 https://registry.npmjs.org/ursa
  39. npm http 200 https://registry.npmjs.org/mailparser
  40. npm http GET https://registry.npmjs.org/ursa/-/ursa-0.9.0.tgz
  41. npm http GET https://registry.npmjs.org/mailparser/-/mailparser-0.5.2.tgz
  42. npm http 200 https://registry.npmjs.org/mailparser/-/mailparser-0.5.2.tgz
  43. npm http 200 https://registry.npmjs.org/ursa/-/ursa-0.9.0.tgz
  44. npm http 200 https://registry.npmjs.org/html-to-text
  45. npm http GET https://registry.npmjs.org/html-to-text/-/html-to-text-1.3.2.tgz
  46. npm http 200 https://registry.npmjs.org/html-to-text/-/html-to-text-1.3.2.tgz
  47. npm http 200 https://registry.npmjs.org/intl
  48. npm http GET https://registry.npmjs.org/intl/-/intl-1.0.0.tgz
  49. npm http 200 https://registry.npmjs.org/intl/-/intl-1.0.0.tgz
  50. npm http GET https://registry.npmjs.org/smtp-connection
  51. npm http GET https://registry.npmjs.org/clone
  52. npm http GET https://registry.npmjs.org/nodemailer-wellknown
  53. npm http 200 https://registry.npmjs.org/clone
  54. npm http GET https://registry.npmjs.org/clone/-/clone-1.0.2.tgz
  55. npm http GET https://registry.npmjs.org/nodemailer-direct-transport
  56. npm http GET https://registry.npmjs.org/needle
  57. npm http GET https://registry.npmjs.org/libmime
  58. npm http GET https://registry.npmjs.org/mailcomposer
  59. npm http GET https://registry.npmjs.org/htmlparser
  60. npm http GET https://registry.npmjs.org/underscore
  61. npm http GET https://registry.npmjs.org/underscore.string
  62. npm http GET https://registry.npmjs.org/optimist
  63. npm http 200 https://registry.npmjs.org/clone/-/clone-1.0.2.tgz
  64. npm http GET https://registry.npmjs.org/xoauth2
  65. npm http GET https://registry.npmjs.org/mimelib
  66. npm http GET https://registry.npmjs.org/encoding
  67. npm http GET https://registry.npmjs.org/uue
  68. npm http GET https://registry.npmjs.org/mime
  69. npm http 200 https://registry.npmjs.org/needle
  70. npm http GET https://registry.npmjs.org/needle/-/needle-0.10.0.tgz
  71. npm http GET https://registry.npmjs.org/bindings
  72. npm http GET https://registry.npmjs.org/nan
  73. npm http 200 https://registry.npmjs.org/needle/-/needle-0.10.0.tgz
  74. npm http 200 https://registry.npmjs.org/nodemailer-wellknown
  75. npm http 200 https://registry.npmjs.org/smtp-connection
  76. npm http GET https://registry.npmjs.org/nodemailer-wellknown/-/nodemailer-wellknown-0.1.7.tgz
  77. npm http GET https://registry.npmjs.org/smtp-connection/-/smtp-connection-1.3.1.tgz
  78. npm http 200 https://registry.npmjs.org/nodemailer-direct-transport
  79. npm http GET https://registry.npmjs.org/nodemailer-direct-transport/-/nodemailer-direct-transport-1.1.0.tgz
  80. npm http 200 https://registry.npmjs.org/underscore
  81. npm http GET https://registry.npmjs.org/underscore/-/underscore-1.8.3.tgz
  82. npm http 200 https://registry.npmjs.org/smtp-connection/-/smtp-connection-1.3.1.tgz
  83. npm http 200 https://registry.npmjs.org/optimist
  84. npm http GET https://registry.npmjs.org/optimist/-/optimist-0.6.1.tgz
  85. npm http 200 https://registry.npmjs.org/nodemailer-direct-transport/-/nodemailer-direct-transport-1.1.0.tgz
  86. npm http 200 https://registry.npmjs.org/xoauth2
  87. npm http 200 https://registry.npmjs.org/underscore/-/underscore-1.8.3.tgz
  88. npm http 200 https://registry.npmjs.org/optimist/-/optimist-0.6.1.tgz
  89. npm http GET https://registry.npmjs.org/xoauth2/-/xoauth2-0.1.8.tgz
  90. npm http 200 https://registry.npmjs.org/nodemailer-wellknown/-/nodemailer-wellknown-0.1.7.tgz
  91. npm http 200 https://registry.npmjs.org/mailcomposer
  92. npm http 200 https://registry.npmjs.org/htmlparser
  93. npm http GET https://registry.npmjs.org/mailcomposer/-/mailcomposer-2.0.0.tgz
  94. npm http GET https://registry.npmjs.org/htmlparser/-/htmlparser-1.7.7.tgz
  95. npm http 200 https://registry.npmjs.org/mimelib
  96. npm http 200 https://registry.npmjs.org/mime
  97. npm http GET https://registry.npmjs.org/mimelib/-/mimelib-0.2.19.tgz
  98. npm http 200 https://registry.npmjs.org/xoauth2/-/xoauth2-0.1.8.tgz
  99. npm http 200 https://registry.npmjs.org/bindings
  100. npm http 200 https://registry.npmjs.org/htmlparser/-/htmlparser-1.7.7.tgz
  101. npm http 200 https://registry.npmjs.org/mimelib/-/mimelib-0.2.19.tgz
  102. npm http GET https://registry.npmjs.org/mime/-/mime-1.3.4.tgz
  103. npm http 200 https://registry.npmjs.org/mailcomposer/-/mailcomposer-2.0.0.tgz
  104. npm http GET https://registry.npmjs.org/dtrace-provider/0.2.8
  105. npm http GET https://registry.npmjs.org/pooling/0.4.6
  106. npm http 200 https://registry.npmjs.org/libmime
  107. npm http GET https://registry.npmjs.org/bindings/-/bindings-1.2.1.tgz
  108. npm http GET https://registry.npmjs.org/asn1/0.2.1
  109. npm http GET https://registry.npmjs.org/assert-plus/0.1.5
  110. npm http GET https://registry.npmjs.org/bunyan/0.22.1
  111. npm http GET https://registry.npmjs.org/nopt/2.1.1
  112. npm http 200 https://registry.npmjs.org/nan
  113. npm http 200 https://registry.npmjs.org/encoding
  114. npm http 200 https://registry.npmjs.org/mime/-/mime-1.3.4.tgz
  115. npm http GET https://registry.npmjs.org/libmime/-/libmime-1.2.0.tgz
  116. npm http GET https://registry.npmjs.org/nan/-/nan-2.1.0.tgz
  117. npm http 200 https://registry.npmjs.org/bindings/-/bindings-1.2.1.tgz
  118. npm http GET https://registry.npmjs.org/encoding/-/encoding-0.1.11.tgz
  119. npm http 200 https://registry.npmjs.org/dtrace-provider/0.2.8
  120. npm http 200 https://registry.npmjs.org/libmime/-/libmime-1.2.0.tgz
  121. npm http 200 https://registry.npmjs.org/asn1/0.2.1
  122. npm http GET https://registry.npmjs.org/dtrace-provider/-/dtrace-provider-0.2.8.tgz
  123. npm http 200 https://registry.npmjs.org/nan/-/nan-2.1.0.tgz
  124. npm http 200 https://registry.npmjs.org/encoding/-/encoding-0.1.11.tgz
  125. npm http GET https://registry.npmjs.org/asn1/-/asn1-0.2.1.tgz
  126. npm http 200 https://registry.npmjs.org/dtrace-provider/-/dtrace-provider-0.2.8.tgz
  127. npm http 200 https://registry.npmjs.org/asn1/-/asn1-0.2.1.tgz
  128. npm http 200 https://registry.npmjs.org/uue
  129. npm http GET https://registry.npmjs.org/uue/-/uue-2.1.1.tgz
  130. npm http 200 https://registry.npmjs.org/uue/-/uue-2.1.1.tgz
  131. npm http 200 https://registry.npmjs.org/underscore.string
  132. npm http GET https://registry.npmjs.org/underscore.string/-/underscore.string-2.4.0.tgz
  133. npm http 200 https://registry.npmjs.org/bunyan/0.22.1
  134. npm http GET https://registry.npmjs.org/bunyan/-/bunyan-0.22.1.tgz
  135. npm http 200 https://registry.npmjs.org/underscore.string/-/underscore.string-2.4.0.tgz
  136. npm http 200 https://registry.npmjs.org/bunyan/-/bunyan-0.22.1.tgz
  137. npm http 200 https://registry.npmjs.org/nopt/2.1.1
  138. npm http 200 https://registry.npmjs.org/pooling/0.4.6
  139. npm http GET https://registry.npmjs.org/nopt/-/nopt-2.1.1.tgz
  140. npm http GET https://registry.npmjs.org/pooling/-/pooling-0.4.6.tgz
  141. npm http 200 https://registry.npmjs.org/assert-plus/0.1.5
  142. npm http 200 https://registry.npmjs.org/pooling/-/pooling-0.4.6.tgz
  143. npm http GET https://registry.npmjs.org/assert-plus/-/assert-plus-0.1.5.tgz
  144. npm http 200 https://registry.npmjs.org/nopt/-/nopt-2.1.1.tgz
  145. npm http 200 https://registry.npmjs.org/assert-plus/-/assert-plus-0.1.5.tgz
  146. npm http GET https://registry.npmjs.org/iconv-lite
  147. npm http GET https://registry.npmjs.org/extend
  148. npm http GET https://registry.npmjs.org/array.prototype.findindex
  149. npm http GET https://registry.npmjs.org/addressparser
  150. npm http 200 https://registry.npmjs.org/extend
  151. npm http GET https://registry.npmjs.org/extend/-/extend-3.0.0.tgz
  152. npm http 200 https://registry.npmjs.org/extend/-/extend-3.0.0.tgz
  153. npm http 200 https://registry.npmjs.org/iconv-lite
  154. npm http GET https://registry.npmjs.org/iconv-lite/-/iconv-lite-0.4.13.tgz
  155. npm http 200 https://registry.npmjs.org/iconv-lite/-/iconv-lite-0.4.13.tgz
  156. npm http 200 https://registry.npmjs.org/array.prototype.findindex
  157. npm http GET https://registry.npmjs.org/array.prototype.findindex/-/array.prototype.findindex-1.0.0.tgz
  158. npm http 200 https://registry.npmjs.org/array.prototype.findindex/-/array.prototype.findindex-1.0.0.tgz
  159. npm http 200 https://registry.npmjs.org/addressparser
  160. npm http GET https://registry.npmjs.org/addressparser/-/addressparser-0.3.2.tgz
  161. npm http 200 https://registry.npmjs.org/addressparser/-/addressparser-0.3.2.tgz
  162. npm http GET https://registry.npmjs.org/buildmail
  163. npm http 200 https://registry.npmjs.org/buildmail
  164. npm http GET https://registry.npmjs.org/buildmail/-/buildmail-2.0.0.tgz
  165. npm http 200 https://registry.npmjs.org/buildmail/-/buildmail-2.0.0.tgz
  166. npm http GET https://registry.npmjs.org/libqp
  167. npm http GET https://registry.npmjs.org/libbase64
  168. npm http 200 https://registry.npmjs.org/libqp
  169. npm http GET https://registry.npmjs.org/debug
  170. npm http GET https://registry.npmjs.org/libqp/-/libqp-1.1.0.tgz
  171. npm http 200 https://registry.npmjs.org/libqp/-/libqp-1.1.0.tgz
  172. npm http 200 https://registry.npmjs.org/debug
  173. npm http GET https://registry.npmjs.org/debug/-/debug-2.2.0.tgz
  174. npm http 200 https://registry.npmjs.org/debug/-/debug-2.2.0.tgz
  175. npm http GET https://registry.npmjs.org/wordwrap
  176. npm http GET https://registry.npmjs.org/minimist
  177. npm http 200 https://registry.npmjs.org/wordwrap
  178. npm http 200 https://registry.npmjs.org/libbase64
  179. npm http GET https://registry.npmjs.org/wordwrap/-/wordwrap-0.0.3.tgz
  180. npm http GET https://registry.npmjs.org/libbase64/-/libbase64-0.1.0.tgz
  181. npm http 200 https://registry.npmjs.org/libbase64/-/libbase64-0.1.0.tgz
  182. npm http 200 https://registry.npmjs.org/minimist
  183. npm http GET https://registry.npmjs.org/minimist/-/minimist-0.0.10.tgz
  184. npm http 200 https://registry.npmjs.org/wordwrap/-/wordwrap-0.0.3.tgz
  185. npm http 200 https://registry.npmjs.org/minimist/-/minimist-0.0.10.tgz
  186. /usr/local/bin/html-to-text -> /usr/local/lib/node_modules/html-to-text/bin/cli.js
  187. npm http GET https://registry.npmjs.org/once/1.3.0
  188. npm http GET https://registry.npmjs.org/vasync/1.4.0
  189. npm http GET https://registry.npmjs.org/abbrev
  190. npm http GET https://registry.npmjs.org/ms/0.7.1
  191. npm http 200 https://registry.npmjs.org/once/1.3.0
  192. npm http 200 https://registry.npmjs.org/abbrev
  193. npm http GET https://registry.npmjs.org/once/-/once-1.3.0.tgz
  194. npm http 200 https://registry.npmjs.org/ms/0.7.1
  195. npm http GET https://registry.npmjs.org/abbrev/-/abbrev-1.0.7.tgz
  196. npm http GET https://registry.npmjs.org/ms/-/ms-0.7.1.tgz
  197. npm http 200 https://registry.npmjs.org/ms/-/ms-0.7.1.tgz
  198. npm http GET https://registry.npmjs.org/intl-messageformat-parser/1.1.0
  199. npm http 200 https://registry.npmjs.org/once/-/once-1.3.0.tgz
  200. npm http 200 https://registry.npmjs.org/abbrev/-/abbrev-1.0.7.tgz
  201. npm http 200 https://registry.npmjs.org/vasync/1.4.0
  202. npm http 200 https://registry.npmjs.org/intl-messageformat-parser/1.1.0
  203. npm http GET https://registry.npmjs.org/vasync/-/vasync-1.4.0.tgz
  204. npm http GET https://registry.npmjs.org/intl-messageformat-parser/-/intl-messageformat-parser-1.1.0.tgz
  205. npm http 200 https://registry.npmjs.org/vasync/-/vasync-1.4.0.tgz
  206.  
  207. > ursa@0.9.0 install /usr/local/lib/node_modules/ursa
  208. > node-gyp rebuild
  209.  
  210. npm http 200 https://registry.npmjs.org/intl-messageformat-parser/-/intl-messageformat-parser-1.1.0.tgz
  211.  
  212. > dtrace-provider@0.2.8 install /usr/local/lib/node_modules/ldapjs/node_modules/dtrace-provider
  213. > node-gyp rebuild
  214.  
  215. npm http GET https://registry.npmjs.org/mv/0.0.5
  216. npm http 200 https://registry.npmjs.org/mv/0.0.5
  217. npm http GET https://registry.npmjs.org/mv/-/mv-0.0.5.tgz
  218. npm http 200 https://registry.npmjs.org/mv/-/mv-0.0.5.tgz
  219. npm http GET https://registry.npmjs.org/jsprim/0.3.0
  220. npm http GET https://registry.npmjs.org/verror/1.1.0
  221. make: Entering directory `/usr/local/lib/node_modules/ldapjs/node_modules/dtrace-provider/build'
  222. TOUCH Release/obj.target/DTraceProviderStub.stamp
  223. npm http 200 https://registry.npmjs.org/jsprim/0.3.0
  224. npm http GET https://registry.npmjs.org/jsprim/-/jsprim-0.3.0.tgz
  225. make: Leaving directory `/usr/local/lib/node_modules/ldapjs/node_modules/dtrace-provider/build'
  226. make: Entering directory `/usr/local/lib/node_modules/ursa/build'
  227. CXX(target) Release/obj.target/ursaNative/src/ursaNative.o
  228. npm http 200 https://registry.npmjs.org/jsprim/-/jsprim-0.3.0.tgz
  229. npm http 200 https://registry.npmjs.org/verror/1.1.0
  230. npm http GET https://registry.npmjs.org/verror/-/verror-1.1.0.tgz
  231. npm http 200 https://registry.npmjs.org/verror/-/verror-1.1.0.tgz
  232. npm http GET https://registry.npmjs.org/extsprintf/1.0.0
  233. npm http GET https://registry.npmjs.org/json-schema/0.2.2
  234. npm http GET https://registry.npmjs.org/verror/1.3.3
  235. ../src/ursaNative.cc: In static member function 'static void RsaWrap::InitClass(v8::Handle<v8::Object>)':
  236. ../src/ursaNative.cc:354:17: error: 'class v8::Persistent<v8::Function>' has no member named 'Reset'
  237. constructor.Reset(target->GetIsolate(), tpl->GetFunction());
  238. ^
  239. ../src/ursaNative.cc:354:31: error: 'class v8::Object' has no member named 'GetIsolate'
  240. constructor.Reset(target->GetIsolate(), tpl->GetFunction());
  241. ^
  242. ../src/ursaNative.cc: In static member function 'static Nan::NAN_METHOD_RETURN_TYPE RsaWrap::GetExponent(Nan::NAN_METHOD_ARGS_TYPE)':
  243. ../src/ursaNative.cc:45:64: error: no matching function for call to 'Nan::ReturnValue<v8::Value>::Set(v8::Handle<v8::Value>)'
  244. #define NanReturnValue(value) { info.GetReturnValue().Set(value); return; }
  245. ^
  246. ../src/ursaNative.cc:545:5: note: in expansion of macro 'NanReturnValue'
  247. NanReturnValue(bignumToBuffer(obj->rsa->e));
  248. ^
  249. ../src/ursaNative.cc:45:64: note: candidates are:
  250. #define NanReturnValue(value) { info.GetReturnValue().Set(value); return; }
  251. ^
  252. ../src/ursaNative.cc:545:5: note: in expansion of macro 'NanReturnValue'
  253. NanReturnValue(bignumToBuffer(obj->rsa->e));
  254. ^
  255. In file included from ../node_modules/nan/nan_callbacks.h:85:0,
  256. from ../node_modules/nan/nan.h:150,
  257. from ../src/ursaNative.h:10,
  258. from ../src/ursaNative.cc:3:
  259. ../node_modules/nan/nan_callbacks_pre_12_inl.h:33:37: note: template<class S> void Nan::ReturnValue<T>::Set(const v8::Local<S>&) [with S = S; T = v8::Value]
  260. template <typename S> inline void Set(const v8::Local<S> &handle) {
  261. ^
  262. ../node_modules/nan/nan_callbacks_pre_12_inl.h:33:37: note: template argument deduction/substitution failed:
  263. ../src/ursaNative.cc:45:64: note: 'v8::Handle<v8::Value>' is not derived from 'const v8::Local<T>'
  264. #define NanReturnValue(value) { info.GetReturnValue().Set(value); return; }
  265. ^
  266. ../src/ursaNative.cc:545:5: note: in expansion of macro 'NanReturnValue'
  267. NanReturnValue(bignumToBuffer(obj->rsa->e));
  268. ^
  269. In file included from ../node_modules/nan/nan_callbacks.h:85:0,
  270. from ../node_modules/nan/nan.h:150,
  271. from ../src/ursaNative.h:10,
  272. from ../src/ursaNative.cc:3:
  273. ../node_modules/nan/nan_callbacks_pre_12_inl.h:39:37: note: template<class S> void Nan::ReturnValue<T>::Set(const Nan::Global<S>&) [with S = S; T = v8::Value]
  274. template <typename S> inline void Set(const Global<S> &handle) {
  275. ^
  276. ../node_modules/nan/nan_callbacks_pre_12_inl.h:39:37: note: template argument deduction/substitution failed:
  277. ../src/ursaNative.cc:45:64: note: 'v8::Handle<v8::Value>' is not derived from 'const Nan::Global<S>'
  278. #define NanReturnValue(value) { info.GetReturnValue().Set(value); return; }
  279. ^
  280. ../src/ursaNative.cc:545:5: note: in expansion of macro 'NanReturnValue'
  281. NanReturnValue(bignumToBuffer(obj->rsa->e));
  282. ^
  283. In file included from ../node_modules/nan/nan_callbacks.h:85:0,
  284. from ../node_modules/nan/nan.h:150,
  285. from ../src/ursaNative.h:10,
  286. from ../src/ursaNative.cc:3:
  287. ../node_modules/nan/nan_callbacks_pre_12_inl.h:47:15: note: void Nan::ReturnValue<T>::Set(bool) [with T = v8::Value]
  288. inline void Set(bool value) {
  289. ^
  290. ../node_modules/nan/nan_callbacks_pre_12_inl.h:47:15: note: no known conversion for argument 1 from 'v8::Handle<v8::Value>' to 'bool'
  291. ../node_modules/nan/nan_callbacks_pre_12_inl.h:53:15: note: void Nan::ReturnValue<T>::Set(double) [with T = v8::Value]
  292. inline void Set(double i) {
  293. ^
  294. ../node_modules/nan/nan_callbacks_pre_12_inl.h:53:15: note: no known conversion for argument 1 from 'v8::Handle<v8::Value>' to 'double'
  295. ../node_modules/nan/nan_callbacks_pre_12_inl.h:59:15: note: void Nan::ReturnValue<T>::Set(int32_t) [with T = v8::Value; int32_t = int]
  296. inline void Set(int32_t i) {
  297. ^
  298. ../node_modules/nan/nan_callbacks_pre_12_inl.h:59:15: note: no known conversion for argument 1 from 'v8::Handle<v8::Value>' to 'int32_t {aka int}'
  299. ../node_modules/nan/nan_callbacks_pre_12_inl.h:65:15: note: void Nan::ReturnValue<T>::Set(uint32_t) [with T = v8::Value; uint32_t = unsigned int]
  300. inline void Set(uint32_t i) {
  301. ^
  302. ../node_modules/nan/nan_callbacks_pre_12_inl.h:65:15: note: no known conversion for argument 1 from 'v8::Handle<v8::Value>' to 'uint32_t {aka unsigned int}'
  303. ../node_modules/nan/nan_callbacks_pre_12_inl.h:97:15: note: template<class S> void Nan::ReturnValue<T>::Set(S*) [with S = S; T = v8::Value]
  304. inline void Set(S *whatever) { TYPE_CHECK(S*, v8::Primitive); }
  305. ^
  306. ../node_modules/nan/nan_callbacks_pre_12_inl.h:97:15: note: template argument deduction/substitution failed:
  307. ../src/ursaNative.cc:45:64: note: mismatched types 'S*' and 'v8::Handle<v8::Value>'
  308. #define NanReturnValue(value) { info.GetReturnValue().Set(value); return; }
  309. ^
  310. ../src/ursaNative.cc:545:5: note: in expansion of macro 'NanReturnValue'
  311. NanReturnValue(bignumToBuffer(obj->rsa->e));
  312. ^
  313. ../src/ursaNative.cc: In static member function 'static Nan::NAN_METHOD_RETURN_TYPE RsaWrap::GetPrivateExponent(Nan::NAN_METHOD_ARGS_TYPE)':
  314. ../src/ursaNative.cc:45:64: error: no matching function for call to 'Nan::ReturnValue<v8::Value>::Set(v8::Handle<v8::Value>)'
  315. #define NanReturnValue(value) { info.GetReturnValue().Set(value); return; }
  316. ^
  317. ../src/ursaNative.cc:561:5: note: in expansion of macro 'NanReturnValue'
  318. NanReturnValue(bignumToBuffer(obj->rsa->d));
  319. ^
  320. ../src/ursaNative.cc:45:64: note: candidates are:
  321. #define NanReturnValue(value) { info.GetReturnValue().Set(value); return; }
  322. ^
  323. ../src/ursaNative.cc:561:5: note: in expansion of macro 'NanReturnValue'
  324. NanReturnValue(bignumToBuffer(obj->rsa->d));
  325. ^
  326. In file included from ../node_modules/nan/nan_callbacks.h:85:0,
  327. from ../node_modules/nan/nan.h:150,
  328. from ../src/ursaNative.h:10,
  329. from ../src/ursaNative.cc:3:
  330. ../node_modules/nan/nan_callbacks_pre_12_inl.h:33:37: note: template<class S> void Nan::ReturnValue<T>::Set(const v8::Local<S>&) [with S = S; T = v8::Value]
  331. template <typename S> inline void Set(const v8::Local<S> &handle) {
  332. ^
  333. ../node_modules/nan/nan_callbacks_pre_12_inl.h:33:37: note: template argument deduction/substitution failed:
  334. ../src/ursaNative.cc:45:64: note: 'v8::Handle<v8::Value>' is not derived from 'const v8::Local<T>'
  335. #define NanReturnValue(value) { info.GetReturnValue().Set(value); return; }
  336. ^
  337. ../src/ursaNative.cc:561:5: note: in expansion of macro 'NanReturnValue'
  338. NanReturnValue(bignumToBuffer(obj->rsa->d));
  339. ^
  340. In file included from ../node_modules/nan/nan_callbacks.h:85:0,
  341. from ../node_modules/nan/nan.h:150,
  342. from ../src/ursaNative.h:10,
  343. from ../src/ursaNative.cc:3:
  344. ../node_modules/nan/nan_callbacks_pre_12_inl.h:39:37: note: template<class S> void Nan::ReturnValue<T>::Set(const Nan::Global<S>&) [with S = S; T = v8::Value]
  345. template <typename S> inline void Set(const Global<S> &handle) {
  346. ^
  347. ../node_modules/nan/nan_callbacks_pre_12_inl.h:39:37: note: template argument deduction/substitution failed:
  348. ../src/ursaNative.cc:45:64: note: 'v8::Handle<v8::Value>' is not derived from 'const Nan::Global<S>'
  349. #define NanReturnValue(value) { info.GetReturnValue().Set(value); return; }
  350. ^
  351. ../src/ursaNative.cc:561:5: note: in expansion of macro 'NanReturnValue'
  352. NanReturnValue(bignumToBuffer(obj->rsa->d));
  353. ^
  354. In file included from ../node_modules/nan/nan_callbacks.h:85:0,
  355. from ../node_modules/nan/nan.h:150,
  356. from ../src/ursaNative.h:10,
  357. from ../src/ursaNative.cc:3:
  358. ../node_modules/nan/nan_callbacks_pre_12_inl.h:47:15: note: void Nan::ReturnValue<T>::Set(bool) [with T = v8::Value]
  359. inline void Set(bool value) {
  360. ^
  361. ../node_modules/nan/nan_callbacks_pre_12_inl.h:47:15: note: no known conversion for argument 1 from 'v8::Handle<v8::Value>' to 'bool'
  362. ../node_modules/nan/nan_callbacks_pre_12_inl.h:53:15: note: void Nan::ReturnValue<T>::Set(double) [with T = v8::Value]
  363. inline void Set(double i) {
  364. ^
  365. ../node_modules/nan/nan_callbacks_pre_12_inl.h:53:15: note: no known conversion for argument 1 from 'v8::Handle<v8::Value>' to 'double'
  366. ../node_modules/nan/nan_callbacks_pre_12_inl.h:59:15: note: void Nan::ReturnValue<T>::Set(int32_t) [with T = v8::Value; int32_t = int]
  367. inline void Set(int32_t i) {
  368. ^
  369. ../node_modules/nan/nan_callbacks_pre_12_inl.h:59:15: note: no known conversion for argument 1 from 'v8::Handle<v8::Value>' to 'int32_t {aka int}'
  370. ../node_modules/nan/nan_callbacks_pre_12_inl.h:65:15: note: void Nan::ReturnValue<T>::Set(uint32_t) [with T = v8::Value; uint32_t = unsigned int]
  371. inline void Set(uint32_t i) {
  372. ^
  373. ../node_modules/nan/nan_callbacks_pre_12_inl.h:65:15: note: no known conversion for argument 1 from 'v8::Handle<v8::Value>' to 'uint32_t {aka unsigned int}'
  374. ../node_modules/nan/nan_callbacks_pre_12_inl.h:97:15: note: template<class S> void Nan::ReturnValue<T>::Set(S*) [with S = S; T = v8::Value]
  375. inline void Set(S *whatever) { TYPE_CHECK(S*, v8::Primitive); }
  376. ^
  377. ../node_modules/nan/nan_callbacks_pre_12_inl.h:97:15: note: template argument deduction/substitution failed:
  378. ../src/ursaNative.cc:45:64: note: mismatched types 'S*' and 'v8::Handle<v8::Value>'
  379. #define NanReturnValue(value) { info.GetReturnValue().Set(value); return; }
  380. ^
  381. ../src/ursaNative.cc:561:5: note: in expansion of macro 'NanReturnValue'
  382. NanReturnValue(bignumToBuffer(obj->rsa->d));
  383. ^
  384. ../src/ursaNative.cc: In static member function 'static Nan::NAN_METHOD_RETURN_TYPE RsaWrap::GetModulus(Nan::NAN_METHOD_ARGS_TYPE)':
  385. ../src/ursaNative.cc:45:64: error: no matching function for call to 'Nan::ReturnValue<v8::Value>::Set(v8::Handle<v8::Value>)'
  386. #define NanReturnValue(value) { info.GetReturnValue().Set(value); return; }
  387. ^
  388. ../src/ursaNative.cc:576:5: note: in expansion of macro 'NanReturnValue'
  389. NanReturnValue(bignumToBuffer(obj->rsa->n));
  390. ^
  391. ../src/ursaNative.cc:45:64: note: candidates are:
  392. #define NanReturnValue(value) { info.GetReturnValue().Set(value); return; }
  393. ^
  394. ../src/ursaNative.cc:576:5: note: in expansion of macro 'NanReturnValue'
  395. NanReturnValue(bignumToBuffer(obj->rsa->n));
  396. ^
  397. In file included from ../node_modules/nan/nan_callbacks.h:85:0,
  398. from ../node_modules/nan/nan.h:150,
  399. from ../src/ursaNative.h:10,
  400. from ../src/ursaNative.cc:3:
  401. ../node_modules/nan/nan_callbacks_pre_12_inl.h:33:37: note: template<class S> void Nan::ReturnValue<T>::Set(const v8::Local<S>&) [with S = S; T = v8::Value]
  402. template <typename S> inline void Set(const v8::Local<S> &handle) {
  403. ^
  404. ../node_modules/nan/nan_callbacks_pre_12_inl.h:33:37: note: template argument deduction/substitution failed:
  405. ../src/ursaNative.cc:45:64: note: 'v8::Handle<v8::Value>' is not derived from 'const v8::Local<T>'
  406. #define NanReturnValue(value) { info.GetReturnValue().Set(value); return; }
  407. ^
  408. ../src/ursaNative.cc:576:5: note: in expansion of macro 'NanReturnValue'
  409. NanReturnValue(bignumToBuffer(obj->rsa->n));
  410. ^
  411. In file included from ../node_modules/nan/nan_callbacks.h:85:0,
  412. from ../node_modules/nan/nan.h:150,
  413. from ../src/ursaNative.h:10,
  414. from ../src/ursaNative.cc:3:
  415. ../node_modules/nan/nan_callbacks_pre_12_inl.h:39:37: note: template<class S> void Nan::ReturnValue<T>::Set(const Nan::Global<S>&) [with S = S; T = v8::Value]
  416. template <typename S> inline void Set(const Global<S> &handle) {
  417. ^
  418. ../node_modules/nan/nan_callbacks_pre_12_inl.h:39:37: note: template argument deduction/substitution failed:
  419. ../src/ursaNative.cc:45:64: note: 'v8::Handle<v8::Value>' is not derived from 'const Nan::Global<S>'
  420. #define NanReturnValue(value) { info.GetReturnValue().Set(value); return; }
  421. ^
  422. ../src/ursaNative.cc:576:5: note: in expansion of macro 'NanReturnValue'
  423. NanReturnValue(bignumToBuffer(obj->rsa->n));
  424. ^
  425. In file included from ../node_modules/nan/nan_callbacks.h:85:0,
  426. from ../node_modules/nan/nan.h:150,
  427. from ../src/ursaNative.h:10,
  428. from ../src/ursaNative.cc:3:
  429. ../node_modules/nan/nan_callbacks_pre_12_inl.h:47:15: note: void Nan::ReturnValue<T>::Set(bool) [with T = v8::Value]
  430. inline void Set(bool value) {
  431. ^
  432. ../node_modules/nan/nan_callbacks_pre_12_inl.h:47:15: note: no known conversion for argument 1 from 'v8::Handle<v8::Value>' to 'bool'
  433. ../node_modules/nan/nan_callbacks_pre_12_inl.h:53:15: note: void Nan::ReturnValue<T>::Set(double) [with T = v8::Value]
  434. inline void Set(double i) {
  435. ^
  436. ../node_modules/nan/nan_callbacks_pre_12_inl.h:53:15: note: no known conversion for argument 1 from 'v8::Handle<v8::Value>' to 'double'
  437. ../node_modules/nan/nan_callbacks_pre_12_inl.h:59:15: note: void Nan::ReturnValue<T>::Set(int32_t) [with T = v8::Value; int32_t = int]
  438. inline void Set(int32_t i) {
  439. ^
  440. ../node_modules/nan/nan_callbacks_pre_12_inl.h:59:15: note: no known conversion for argument 1 from 'v8::Handle<v8::Value>' to 'int32_t {aka int}'
  441. ../node_modules/nan/nan_callbacks_pre_12_inl.h:65:15: note: void Nan::ReturnValue<T>::Set(uint32_t) [with T = v8::Value; uint32_t = unsigned int]
  442. inline void Set(uint32_t i) {
  443. ^
  444. ../node_modules/nan/nan_callbacks_pre_12_inl.h:65:15: note: no known conversion for argument 1 from 'v8::Handle<v8::Value>' to 'uint32_t {aka unsigned int}'
  445. ../node_modules/nan/nan_callbacks_pre_12_inl.h:97:15: note: template<class S> void Nan::ReturnValue<T>::Set(S*) [with S = S; T = v8::Value]
  446. inline void Set(S *whatever) { TYPE_CHECK(S*, v8::Primitive); }
  447. ^
  448. ../node_modules/nan/nan_callbacks_pre_12_inl.h:97:15: note: template argument deduction/substitution failed:
  449. ../src/ursaNative.cc:45:64: note: mismatched types 'S*' and 'v8::Handle<v8::Value>'
  450. #define NanReturnValue(value) { info.GetReturnValue().Set(value); return; }
  451. ^
  452. ../src/ursaNative.cc:576:5: note: in expansion of macro 'NanReturnValue'
  453. NanReturnValue(bignumToBuffer(obj->rsa->n));
  454. ^
  455. ../src/ursaNative.cc: In static member function 'static Nan::NAN_METHOD_RETURN_TYPE RsaWrap::GetPrivateKeyPem(Nan::NAN_METHOD_ARGS_TYPE)':
  456. ../src/ursaNative.cc:45:64: error: no matching function for call to 'Nan::ReturnValue<v8::Value>::Set(v8::Handle<v8::Value>)'
  457. #define NanReturnValue(value) { info.GetReturnValue().Set(value); return; }
  458. ^
  459. ../src/ursaNative.cc:628:5: note: in expansion of macro 'NanReturnValue'
  460. NanReturnValue(bioToBuffer(bio));
  461. ^
  462. ../src/ursaNative.cc:45:64: note: candidates are:
  463. #define NanReturnValue(value) { info.GetReturnValue().Set(value); return; }
  464. ^
  465. ../src/ursaNative.cc:628:5: note: in expansion of macro 'NanReturnValue'
  466. NanReturnValue(bioToBuffer(bio));
  467. ^
  468. In file included from ../node_modules/nan/nan_callbacks.h:85:0,
  469. from ../node_modules/nan/nan.h:150,
  470. from ../src/ursaNative.h:10,
  471. from ../src/ursaNative.cc:3:
  472. ../node_modules/nan/nan_callbacks_pre_12_inl.h:33:37: note: template<class S> void Nan::ReturnValue<T>::Set(const v8::Local<S>&) [with S = S; T = v8::Value]
  473. template <typename S> inline void Set(const v8::Local<S> &handle) {
  474. ^
  475. ../node_modules/nan/nan_callbacks_pre_12_inl.h:33:37: note: template argument deduction/substitution failed:
  476. ../src/ursaNative.cc:45:64: note: 'v8::Handle<v8::Value>' is not derived from 'const v8::Local<T>'
  477. #define NanReturnValue(value) { info.GetReturnValue().Set(value); return; }
  478. ^
  479. ../src/ursaNative.cc:628:5: note: in expansion of macro 'NanReturnValue'
  480. NanReturnValue(bioToBuffer(bio));
  481. ^
  482. In file included from ../node_modules/nan/nan_callbacks.h:85:0,
  483. from ../node_modules/nan/nan.h:150,
  484. from ../src/ursaNative.h:10,
  485. from ../src/ursaNative.cc:3:
  486. ../node_modules/nan/nan_callbacks_pre_12_inl.h:39:37: note: template<class S> void Nan::ReturnValue<T>::Set(const Nan::Global<S>&) [with S = S; T = v8::Value]
  487. template <typename S> inline void Set(const Global<S> &handle) {
  488. ^
  489. ../node_modules/nan/nan_callbacks_pre_12_inl.h:39:37: note: template argument deduction/substitution failed:
  490. ../src/ursaNative.cc:45:64: note: 'v8::Handle<v8::Value>' is not derived from 'const Nan::Global<S>'
  491. #define NanReturnValue(value) { info.GetReturnValue().Set(value); return; }
  492. ^
  493. ../src/ursaNative.cc:628:5: note: in expansion of macro 'NanReturnValue'
  494. NanReturnValue(bioToBuffer(bio));
  495. ^
  496. In file included from ../node_modules/nan/nan_callbacks.h:85:0,
  497. from ../node_modules/nan/nan.h:150,
  498. from ../src/ursaNative.h:10,
  499. from ../src/ursaNative.cc:3:
  500. ../node_modules/nan/nan_callbacks_pre_12_inl.h:47:15: note: void Nan::ReturnValue<T>::Set(bool) [with T = v8::Value]
  501. inline void Set(bool value) {
  502. ^
  503. ../node_modules/nan/nan_callbacks_pre_12_inl.h:47:15: note: no known conversion for argument 1 from 'v8::Handle<v8::Value>' to 'bool'
  504. ../node_modules/nan/nan_callbacks_pre_12_inl.h:53:15: note: void Nan::ReturnValue<T>::Set(double) [with T = v8::Value]
  505. inline void Set(double i) {
  506. ^
  507. ../node_modules/nan/nan_callbacks_pre_12_inl.h:53:15: note: no known conversion for argument 1 from 'v8::Handle<v8::Value>' to 'double'
  508. ../node_modules/nan/nan_callbacks_pre_12_inl.h:59:15: note: void Nan::ReturnValue<T>::Set(int32_t) [with T = v8::Value; int32_t = int]
  509. inline void Set(int32_t i) {
  510. ^
  511. ../node_modules/nan/nan_callbacks_pre_12_inl.h:59:15: note: no known conversion for argument 1 from 'v8::Handle<v8::Value>' to 'int32_t {aka int}'
  512. ../node_modules/nan/nan_callbacks_pre_12_inl.h:65:15: note: void Nan::ReturnValue<T>::Set(uint32_t) [with T = v8::Value; uint32_t = unsigned int]
  513. inline void Set(uint32_t i) {
  514. ^
  515. ../node_modules/nan/nan_callbacks_pre_12_inl.h:65:15: note: no known conversion for argument 1 from 'v8::Handle<v8::Value>' to 'uint32_t {aka unsigned int}'
  516. ../node_modules/nan/nan_callbacks_pre_12_inl.h:97:15: note: template<class S> void Nan::ReturnValue<T>::Set(S*) [with S = S; T = v8::Value]
  517. inline void Set(S *whatever) { TYPE_CHECK(S*, v8::Primitive); }
  518. ^
  519. ../node_modules/nan/nan_callbacks_pre_12_inl.h:97:15: note: template argument deduction/substitution failed:
  520. ../src/ursaNative.cc:45:64: note: mismatched types 'S*' and 'v8::Handle<v8::Value>'
  521. #define NanReturnValue(value) { info.GetReturnValue().Set(value); return; }
  522. ^
  523. ../src/ursaNative.cc:628:5: note: in expansion of macro 'NanReturnValue'
  524. NanReturnValue(bioToBuffer(bio));
  525. ^
  526. ../src/ursaNative.cc: In static member function 'static Nan::NAN_METHOD_RETURN_TYPE RsaWrap::GetPublicKeyPem(Nan::NAN_METHOD_ARGS_TYPE)':
  527. ../src/ursaNative.cc:45:64: error: no matching function for call to 'Nan::ReturnValue<v8::Value>::Set(v8::Handle<v8::Value>)'
  528. #define NanReturnValue(value) { info.GetReturnValue().Set(value); return; }
  529. ^
  530. ../src/ursaNative.cc:655:5: note: in expansion of macro 'NanReturnValue'
  531. NanReturnValue(bioToBuffer(bio));
  532. ^
  533. ../src/ursaNative.cc:45:64: note: candidates are:
  534. #define NanReturnValue(value) { info.GetReturnValue().Set(value); return; }
  535. ^
  536. ../src/ursaNative.cc:655:5: note: in expansion of macro 'NanReturnValue'
  537. NanReturnValue(bioToBuffer(bio));
  538. ^
  539. In file included from ../node_modules/nan/nan_callbacks.h:85:0,
  540. from ../node_modules/nan/nan.h:150,
  541. from ../src/ursaNative.h:10,
  542. from ../src/ursaNative.cc:3:
  543. ../node_modules/nan/nan_callbacks_pre_12_inl.h:33:37: note: template<class S> void Nan::ReturnValue<T>::Set(const v8::Local<S>&) [with S = S; T = v8::Value]
  544. template <typename S> inline void Set(const v8::Local<S> &handle) {
  545. ^
  546. ../node_modules/nan/nan_callbacks_pre_12_inl.h:33:37: note: template argument deduction/substitution failed:
  547. ../src/ursaNative.cc:45:64: note: 'v8::Handle<v8::Value>' is not derived from 'const v8::Local<T>'
  548. #define NanReturnValue(value) { info.GetReturnValue().Set(value); return; }
  549. ^
  550. ../src/ursaNative.cc:655:5: note: in expansion of macro 'NanReturnValue'
  551. NanReturnValue(bioToBuffer(bio));
  552. ^
  553. In file included from ../node_modules/nan/nan_callbacks.h:85:0,
  554. from ../node_modules/nan/nan.h:150,
  555. from ../src/ursaNative.h:10,
  556. from ../src/ursaNative.cc:3:
  557. ../node_modules/nan/nan_callbacks_pre_12_inl.h:39:37: note: template<class S> void Nan::ReturnValue<T>::Set(const Nan::Global<S>&) [with S = S; T = v8::Value]
  558. template <typename S> inline void Set(const Global<S> &handle) {
  559. ^
  560. ../node_modules/nan/nan_callbacks_pre_12_inl.h:39:37: note: template argument deduction/substitution failed:
  561. ../src/ursaNative.cc:45:64: note: 'v8::Handle<v8::Value>' is not derived from 'const Nan::Global<S>'
  562. #define NanReturnValue(value) { info.GetReturnValue().Set(value); return; }
  563. ^
  564. ../src/ursaNative.cc:655:5: note: in expansion of macro 'NanReturnValue'
  565. NanReturnValue(bioToBuffer(bio));
  566. ^
  567. In file included from ../node_modules/nan/nan_callbacks.h:85:0,
  568. from ../node_modules/nan/nan.h:150,
  569. from ../src/ursaNative.h:10,
  570. from ../src/ursaNative.cc:3:
  571. ../node_modules/nan/nan_callbacks_pre_12_inl.h:47:15: note: void Nan::ReturnValue<T>::Set(bool) [with T = v8::Value]
  572. inline void Set(bool value) {
  573. ^
  574. ../node_modules/nan/nan_callbacks_pre_12_inl.h:47:15: note: no known conversion for argument 1 from 'v8::Handle<v8::Value>' to 'bool'
  575. ../node_modules/nan/nan_callbacks_pre_12_inl.h:53:15: note: void Nan::ReturnValue<T>::Set(double) [with T = v8::Value]
  576. inline void Set(double i) {
  577. ^
  578. ../node_modules/nan/nan_callbacks_pre_12_inl.h:53:15: note: no known conversion for argument 1 from 'v8::Handle<v8::Value>' to 'double'
  579. ../node_modules/nan/nan_callbacks_pre_12_inl.h:59:15: note: void Nan::ReturnValue<T>::Set(int32_t) [with T = v8::Value; int32_t = int]
  580. inline void Set(int32_t i) {
  581. ^
  582. ../node_modules/nan/nan_callbacks_pre_12_inl.h:59:15: note: no known conversion for argument 1 from 'v8::Handle<v8::Value>' to 'int32_t {aka int}'
  583. ../node_modules/nan/nan_callbacks_pre_12_inl.h:65:15: note: void Nan::ReturnValue<T>::Set(uint32_t) [with T = v8::Value; uint32_t = unsigned int]
  584. inline void Set(uint32_t i) {
  585. ^
  586. ../node_modules/nan/nan_callbacks_pre_12_inl.h:65:15: note: no known conversion for argument 1 from 'v8::Handle<v8::Value>' to 'uint32_t {aka unsigned int}'
  587. ../node_modules/nan/nan_callbacks_pre_12_inl.h:97:15: note: template<class S> void Nan::ReturnValue<T>::Set(S*) [with S = S; T = v8::Value]
  588. inline void Set(S *whatever) { TYPE_CHECK(S*, v8::Primitive); }
  589. ^
  590. ../node_modules/nan/nan_callbacks_pre_12_inl.h:97:15: note: template argument deduction/substitution failed:
  591. ../src/ursaNative.cc:45:64: note: mismatched types 'S*' and 'v8::Handle<v8::Value>'
  592. #define NanReturnValue(value) { info.GetReturnValue().Set(value); return; }
  593. ^
  594. ../src/ursaNative.cc:655:5: note: in expansion of macro 'NanReturnValue'
  595. NanReturnValue(bioToBuffer(bio));
  596. ^
  597. make: *** [Release/obj.target/ursaNative/src/ursaNative.o] Error 1
  598. make: Leaving directory `/usr/local/lib/node_modules/ursa/build'
  599. gyp ERR! build error
  600. gyp ERR! stack Error: `make` failed with exit code: 2
  601. gyp ERR! stack at ChildProcess.onExit (/usr/share/node-gyp/lib/build.js:267:23)
  602. gyp ERR! stack at ChildProcess.EventEmitter.emit (events.js:98:17)
  603. gyp ERR! stack at Process.ChildProcess._handle.onexit (child_process.js:797:12)
  604. gyp ERR! System Linux 3.13.0-58-generic
  605. gyp ERR! command "nodejs" "/usr/bin/node-gyp" "rebuild"
  606. gyp ERR! cwd /usr/local/lib/node_modules/ursa
  607. gyp ERR! node -v v0.10.25
  608. gyp ERR! node-gyp -v v0.10.10
  609. gyp ERR! not ok
  610. npm WARN This failure might be due to the use of legacy binary "node"
  611. npm WARN For further explanations, please read
  612. /usr/share/doc/nodejs/README.Debian
  613.  
  614. npm ERR! weird error 1
  615. npm http 200 https://registry.npmjs.org/verror/1.3.3
  616. npm http GET https://registry.npmjs.org/verror/-/verror-1.3.3.tgz
  617. npm http 200 https://registry.npmjs.org/verror/-/verror-1.3.3.tgz
  618. npm http 200 https://registry.npmjs.org/json-schema/0.2.2
  619. npm http GET https://registry.npmjs.org/json-schema/-/json-schema-0.2.2.tgz
  620. npm http 200 https://registry.npmjs.org/json-schema/-/json-schema-0.2.2.tgz
  621. npm http 200 https://registry.npmjs.org/extsprintf/1.0.0
  622. npm http GET https://registry.npmjs.org/extsprintf/-/extsprintf-1.0.0.tgz
  623. npm http 200 https://registry.npmjs.org/extsprintf/-/extsprintf-1.0.0.tgz
  624. npm http GET https://registry.npmjs.org/nan/-/nan-2.0.9.tgz
  625. npm http 200 https://registry.npmjs.org/nan/-/nan-2.0.9.tgz
  626. /usr/local/bin/ldapjs-add -> /usr/local/lib/node_modules/ldapjs/bin/ldapjs-add
  627. /usr/local/bin/ldapjs-compare -> /usr/local/lib/node_modules/ldapjs/bin/ldapjs-compare
  628. /usr/local/bin/ldapjs-delete -> /usr/local/lib/node_modules/ldapjs/bin/ldapjs-delete
  629. /usr/local/bin/ldapjs-modify -> /usr/local/lib/node_modules/ldapjs/bin/ldapjs-modify
  630. /usr/local/bin/ldapjs-search -> /usr/local/lib/node_modules/ldapjs/bin/ldapjs-search
  631.  
  632. > iconv@2.1.11 install /usr/local/lib/node_modules/iconv
  633. > node-gyp rebuild
  634.  
  635. make: Entering directory `/usr/local/lib/node_modules/iconv/build'
  636. CC(target) Release/obj.target/libiconv/deps/libiconv/lib/iconv.o
  637. AR(target) Release/obj.target/iconv.a
  638. COPY Release/iconv.a
  639. CXX(target) Release/obj.target/iconv/src/binding.o
  640. SOLINK_MODULE(target) Release/obj.target/iconv.node
  641. SOLINK_MODULE(target) Release/obj.target/iconv.node: Finished
  642. COPY Release/iconv.node
  643. make: Leaving directory `/usr/local/lib/node_modules/iconv/build'
  644. npm ERR! not ok code 0
  645. The command '/bin/sh -c /usr/bin/npm install -g ursa simplesmtp rai nodemailer ldapjs iconv nodemailer-smtp-transport mailparser html-to-text tweetnacl intl-messageformat intl' returned a non-zero code: 1
  646. make: *** [build] Error 1
Advertisement
Add Comment
Please, Sign In to add comment
Advertisement