Advertisement
vliaskov

python crash piglit build on rpi3 b+

Apr 28th, 2020
103
Never
Not a member of Pastebin yet? Sign Up, it unlocks many cool features!
  1. [ 0%] Built target static-vkrunner-tests
  2. [ 0%] Built target generate-vulkan-xml
  3. [ 0%] Built target gen-vulkan-xml
  4. [ 0%] Built target generate-opengl-xml
  5. [ 0%] Generating builtin_uniform_tests.list
  6. /bin/sh: line 1: 14194 Illegal instruction (core dumped) /usr/bin/python3.8 /root/piglit/generated_tests/gen_builtin_uniform_tests.py > builtin_uniform_tests.list
  7. make[2]: *** [generated_tests/CMakeFiles/gen-gl-tests.dir/build.make:135: generated_tests/builtin_uniform_tests.list] Error 132
  8. make[2]: *** Deleting file 'generated_tests/builtin_uniform_tests.list'
  9. make[1]: *** [CMakeFiles/Makefile2:83760: generated_tests/CMakeFiles/gen-gl-tests.dir/all] Error 2
  10. make: *** [Makefile:172: all] Error 2
Advertisement
Advertisement
Advertisement
RAW Paste Data Copied
Advertisement