SHARE
TWEET

Untitled

a guest Jun 19th, 2017 50 Never
Not a member of Pastebin yet? Sign Up, it unlocks many cool features!
  1. plates/SharedTangibleObjectTemplate.o -MD -MP -MF $depbase.Tpo -c -o server/zone/templates/SharedTangibleObjectTemplate.o ../../../src/server/zone/templates/SharedTangibleObjectTemplate.cpp &&\
  2.     mv -f $depbase.Tpo $depbase.Po
  3. ../../../src/server/zone/managers/templates/TemplateManager.cpp: In member function ‘void TemplateManager::registerTemplateObjects()’:
  4. ../../../src/server/zone/managers/templates/TemplateManager.cpp:166: error: ‘LIGHTSABERCRYSTAL’ is not a member of ‘server::zone::templates::SharedObjectTemplate’
  5. ../../../src/server/zone/managers/templates/TemplateManager.cpp: In member function ‘void TemplateManager::registerGlobals()’:
  6. ../../../src/server/zone/managers/templates/TemplateManager.cpp:324: error: ‘LIGHTSABERCRYSTAL’ is not a member of ‘server::zone::templates::SharedObjectTemplate’
  7. ../../../src/server/zone/managers/combat/CombatManager.cpp: In member function ‘bool CombatManager::applySpecialAttackCost(server::zone::objects::creature::CreatureObject*, CombatQueueCommand*)’:
  8. ../../../src/server/zone/managers/combat/CombatManager.cpp:930: error: ‘class server::zone::objects::tangible::weapon::WeaponObject’ has no member named ‘getForceCost’
  9. make[3]: *** [server/zone/managers/templates/TemplateManager.o] Error 1
  10. make[3]: *** Waiting for unfinished jobs....
  11. make[3]: *** [server/zone/managers/combat/CombatManager.o] Error 1
  12. make[3]: Leaving directory `/home/swgemu/workspace/MMOCoreORB-Testing/build/unix/src'
  13. make[2]: *** [all-recursive] Error 1
  14. make[2]: Leaving directory `/home/swgemu/workspace/MMOCoreORB-Testing/build/unix'
  15. make[1]: *** [all] Error 2
  16. make[1]: Leaving directory `/home/swgemu/workspace/MMOCoreORB-Testing/build/unix'
  17. make: *** [all] Error 2
  18. swgemu@ubuntu:~/workspace/MMOCoreORB-Testing$
RAW Paste Data
Top