david_david

log.kio-afc

Aug 16th, 2013
227
0
Never
Not a member of Pastebin yet? Sign Up, it unlocks many cool features!
text 3.81 KB | None | 0 0
  1. + umask 022
  2. + cd /home/david/rpmbuild/BUILD
  3. + '[' 1 -eq 1 ']'
  4. + '[' 1 -eq 1 ']'
  5. + '[' 1 -eq 1 ']'
  6. + cd /home/david/rpmbuild/BUILD
  7. + rm -rf kio_afc-master
  8. + /usr/bin/tar -xf -
  9. + /usr/bin/gzip -dc /home/david/rpmbuild/SOURCES/kio-afc-2010.04.22.tar.gz
  10. + STATUS=0
  11. + '[' 0 -ne 0 ']'
  12. + cd kio_afc-master
  13. + /usr/bin/chmod -Rf a+rX,u+w,g-w,o-w .
  14. + exit 0
  15. + umask 022
  16. + cd /home/david/rpmbuild/BUILD
  17. + cd kio_afc-master
  18. + '[' 1 -eq 1 ']'
  19. + '[' 1 -eq 1 ']'
  20. + QTDIR=/usr/lib64/qt4
  21. + export QTDIR
  22. + PATH=/usr/lib64/qt4/bin:/usr/local/bin:/usr/bin:/usr/games:/usr/lib64/qt4/bin:/home/david/bin
  23. + export PATH
  24. + CFLAGS='-O2 -g -pipe -Wformat -Werror=format-security -Wp,-D_FORTIFY_SOURCE=2 -fstack-protector --param=ssp-buffer-size=4 -fPIC'
  25. + export CFLAGS
  26. + CXXFLAGS='-O2 -g -pipe -Wformat -Werror=format-security -Wp,-D_FORTIFY_SOURCE=2 -fstack-protector --param=ssp-buffer-size=4 -fPIC'
  27. + export CXXFLAGS
  28. + FFLAGS='-O2 -g -pipe -Wformat -Werror=format-security -Wp,-D_FORTIFY_SOURCE=2 -fstack-protector --param=ssp-buffer-size=4 -fPIC'
  29. + export FFLAGS
  30. + LDFLAGS=' -Wl,--as-needed -Wl,--no-undefined -Wl,-z,relro -Wl,-O1 -Wl,--build-id -Wl,--enable-new-dtags'
  31. + export LDFLAGS
  32. + mkdir -p build
  33. + cd build
  34. + /usr/bin/cmake .. -DCMAKE_INSTALL_PREFIX:PATH=/usr -DCMAKE_INSTALL_LIBDIR:PATH=/usr/lib64 -DCMAKE_INSTALL_LIBEXECDIR:PATH=/usr/libexec -DINCLUDE_INSTALL_DIR:PATH=/usr/include -DLIB_INSTALL_DIR:PATH=/usr/lib64 -DSYSCONF_INSTALL_DIR:PATH=/etc -DSHARE_INSTALL_PREFIX:PATH=/usr/share -DCMAKE_BUILD_TYPE=release -DLIB_SUFFIX=64 -DCMAKE_SKIP_RPATH:BOOL=ON -DBUILD_SHARED_LIBS:BOOL=ON -DBUILD_STATIC_LIBS:BOOL=OFF '-DCMAKE_MODULE_LINKER_FLAGS=-Wl,--as-needed -Wl,-z,relro -Wl,-O1 -Wl,--build-id -Wl,--enable-new-dtags' -DKDE4_ENABLE_FPIE=ON -DCMAKE_INSTALL_PREFIX=/usr -DCMAKE_BUILD_TYPE=Release -DKDE_DEFAULT_HOME=.kde4 '-DKDE_DISTRIBUTION_TEXT=Mageia release 3 (Official) for x86_64' -DKDE4_USE_ALWAYS_FULL_RPATH=OFF -DKDE4_DATA_DIR=/usr/share/apps -DENABLE_FAM=ON -DPHONON_INCLUDE_DIR=/usr/include -DDBUS_SERVICES_INSTALL_DIR=/usr/share/dbus-1/services -DDBUS_INTERFACES_INSTALL_DIR=/usr/share/dbus-1/interfaces
  35. CMake Warning:
  36. Manually-specified variables were not used by the project:
  37.  
  38. BUILD_STATIC_LIBS
  39. CMAKE_INSTALL_LIBDIR
  40. CMAKE_INSTALL_LIBEXECDIR
  41. ENABLE_FAM
  42. KDE4_USE_ALWAYS_FULL_RPATH
  43. KDE_DISTRIBUTION_TEXT
  44.  
  45.  
  46. + make -j4
  47. /home/david/rpmbuild/BUILD/kio_afc-master/kio_afc.cpp: In member function ‘void AfcProtocol::ProcessEvent(const idevice_event_t*)’:
  48. /home/david/rpmbuild/BUILD/kio_afc-master/kio_afc.cpp:117:49: erreur: ‘const struct idevice_event_t’ has no member named ‘uuid’
  49. /home/david/rpmbuild/BUILD/kio_afc-master/kio_afc.cpp:120:45: erreur: ‘const struct idevice_event_t’ has no member named ‘uuid’
  50. /home/david/rpmbuild/BUILD/kio_afc-master/kio_afc.cpp:129:50: erreur: ‘const struct idevice_event_t’ has no member named ‘uuid’
  51. /home/david/rpmbuild/BUILD/kio_afc-master/kio_afc.cpp:131:40: erreur: ‘const struct idevice_event_t’ has no member named ‘uuid’
  52. /home/david/rpmbuild/BUILD/kio_afc-master/kio_afc.cpp: At global scope:
  53. /home/david/rpmbuild/BUILD/kio_afc-master/kio_afc.cpp:197:6: attention : unused parameter ‘_mode’ [-Wunused-parameter]
  54. /home/david/rpmbuild/BUILD/kio_afc-master/kio_afc.cpp:407:6: attention : unused parameter ‘permissions’ [-Wunused-parameter]
  55. /home/david/rpmbuild/BUILD/kio_afc-master/kio_afc.cpp:457:6: attention : unused parameter ‘isfile’ [-Wunused-parameter]
  56. make[2]: *** [CMakeFiles/kio_afc.dir/kio_afc.o] Erreur 1
  57. make[2]: *** Attente des tâches non terminées....
  58. make[1]: *** [CMakeFiles/kio_afc.dir/all] Erreur 2
  59. make: *** [all] Erreur 2
  60. erreur : Mauvais statut de sortie pour /home/david/rpmbuild/BUILDROOT/rpm-tmp.cmWgk6 (%build)
  61. Mauvais statut de sortie pour /home/david/rpmbuild/BUILDROOT/rpm-tmp.cmWgk6 (%build)
Advertisement
Add Comment
Please, Sign In to add comment