Advertisement
Guest User

Untitled

a guest
Dec 7th, 2017
66
0
Never
Not a member of Pastebin yet? Sign Up, it unlocks many cool features!
text 29.53 KB | None | 0 0
  1. [ 29%] Built target Box2D
  2. [ 38%] Built target WebP
  3. [ 50%] Built target Bullet
  4. [ 50%] Built target tolua++
  5. [ 50%] Building CXX object Source/Urho3D/CMakeFiles/Urho3D.dir/Graphics/OpenGL/OGLGraphics.cpp.o
  6. /home/linaro/dev/urho/Urho3D/Source/Urho3D/Graphics/OpenGL/OGLGraphics.cpp: In function ‘bool Urho3D::CheckExtension(const Urho3D::String&)’:
  7. /home/linaro/dev/urho/Urho3D/Source/Urho3D/Graphics/OpenGL/OGLGraphics.cpp:180:60: error: ‘glGetString’ was not declared in this scope
  8. extensions = (const char*)glGetString(GL_EXTENSIONS);
  9. ^
  10. /home/linaro/dev/urho/Urho3D/Source/Urho3D/Graphics/OpenGL/OGLGraphics.cpp: In member function ‘void Urho3D::Graphics::SetDither(bool)’:
  11. /home/linaro/dev/urho/Urho3D/Source/Urho3D/Graphics/OpenGL/OGLGraphics.cpp:578:27: error: ‘glEnable’ was not declared in this scope
  12. glEnable(GL_DITHER);
  13. ^
  14. /home/linaro/dev/urho/Urho3D/Source/Urho3D/Graphics/OpenGL/OGLGraphics.cpp:580:28: error: ‘glDisable’ was not declared in this scope
  15. glDisable(GL_DITHER);
  16. ^
  17. /home/linaro/dev/urho/Urho3D/Source/Urho3D/Graphics/OpenGL/OGLGraphics.cpp: In member function ‘bool Urho3D::Graphics::TakeScreenShot(Urho3D::Image&)’:
  18. /home/linaro/dev/urho/Urho3D/Source/Urho3D/Graphics/OpenGL/OGLGraphics.cpp:629:87: error: ‘glReadPixels’ was not declared in this scope
  19. Pixels(0, 0, width_, height_, GL_RGBA, GL_UNSIGNED_BYTE, destImage.GetData());
  20. ^
  21. /home/linaro/dev/urho/Urho3D/Source/Urho3D/Graphics/OpenGL/OGLGraphics.cpp: In member function ‘bool Urho3D::Graphics::BeginFrame()’:
  22. /home/linaro/dev/urho/Urho3D/Source/Urho3D/Graphics/OpenGL/OGLGraphics.cpp:654:27: error: ‘glEnable’ was not declared in this scope
  23. glEnable(GL_DEPTH_TEST);
  24. ^
  25. /home/linaro/dev/urho/Urho3D/Source/Urho3D/Graphics/OpenGL/OGLGraphics.cpp:655:42: error: ‘glDepthFunc’ was not declared in this scope
  26. glDepthFunc(glCmpFunc[depthTestMode_]);
  27. ^
  28. /home/linaro/dev/urho/Urho3D/Source/Urho3D/Graphics/OpenGL/OGLGraphics.cpp: In member function ‘void Urho3D::Graphics::Clear(unsigned int, const Urho3D::Color&, float, unsigned int)’:
  29. /home/linaro/dev/urho/Urho3D/Source/Urho3D/Graphics/OpenGL/OGLGraphics.cpp:707:37: error: ‘glStencilMask’ was not declared in this scope
  30. glStencilMask(M_MAX_UNSIGNED);
  31. ^
  32. /home/linaro/dev/urho/Urho3D/Source/Urho3D/Graphics/OpenGL/OGLGraphics.cpp:713:60: error: ‘glClearColor’ was not declared in this scope
  33. glClearColor(color.r_, color.g_, color.b_, color.a_);
  34. ^
  35. /home/linaro/dev/urho/Urho3D/Source/Urho3D/Graphics/OpenGL/OGLGraphics.cpp:718:27: error: ‘glClearDepthf’ was not declared in this scope
  36. glClearDepth(depth);
  37. ^
  38. /home/linaro/dev/urho/Urho3D/Source/Urho3D/Graphics/OpenGL/OGLGraphics.cpp:723:31: error: ‘glClearStencil’ was not declared in this scope
  39. glClearStencil(stencil);
  40. ^
  41. /home/linaro/dev/urho/Urho3D/Source/Urho3D/Graphics/OpenGL/OGLGraphics.cpp:734:20: error: ‘glClear’ was not declared in this scope
  42. glClear(glFlags);
  43. ^
  44. /home/linaro/dev/urho/Urho3D/Source/Urho3D/Graphics/OpenGL/OGLGraphics.cpp:740:40: error: ‘glStencilMask’ was not declared in this scope
  45. glStencilMask(stencilWriteMask_);
  46. ^
  47. /home/linaro/dev/urho/Urho3D/Source/Urho3D/Graphics/OpenGL/OGLGraphics.cpp: In member function ‘bool Urho3D::Graphics::ResolveToTexture(Urho3D::Texture2D*, const Urho3D::IntRect&)’:
  48. /home/linaro/dev/urho/Urho3D/Source/Urho3D/Graphics/OpenGL/OGLGraphics.cpp:765:120: error: ‘glCopyTexSubImage2D’ was not declared in this scope
  49. , 0, vpCopy.left_, height_ - vpCopy.bottom_, vpCopy.Width(), vpCopy.Height());
  50. ^
  51. /home/linaro/dev/urho/Urho3D/Source/Urho3D/Graphics/OpenGL/OGLGraphics.cpp: In member function ‘void Urho3D::Graphics::Draw(Urho3D::PrimitiveType, unsigned int, unsigned int)’:
  52. /home/linaro/dev/urho/Urho3D/Source/Urho3D/Graphics/OpenGL/OGLGraphics.cpp:906:59: error: ‘glDrawArrays’ was not declared in this scope
  53. glDrawArrays(glPrimitiveType, vertexStart, vertexCount);
  54. ^
  55. /home/linaro/dev/urho/Urho3D/Source/Urho3D/Graphics/OpenGL/OGLGraphics.cpp: In member function ‘void Urho3D::Graphics::Draw(Urho3D::PrimitiveType, unsigned int, unsigned int, unsigned int, unsigned int)’:
  56. /home/linaro/dev/urho/Urho3D/Source/Urho3D/Graphics/OpenGL/OGLGraphics.cpp:925:115: error: ‘glDrawElements’ was not declared in this scope
  57. dexCount, indexType, reinterpret_cast<const GLvoid*>(indexStart * indexSize));
  58. ^
  59. /home/linaro/dev/urho/Urho3D/Source/Urho3D/Graphics/OpenGL/OGLGraphics.cpp: In member function ‘void Urho3D::Graphics::SetIndexBuffer(Urho3D::IndexBuffer*)’:
  60. /home/linaro/dev/urho/Urho3D/Source/Urho3D/Graphics/OpenGL/OGLGraphics.cpp:1059:82: error: ‘glBindBuffer’ was not declared in this scope
  61. lBindBuffer(GL_ELEMENT_ARRAY_BUFFER, buffer ? buffer->GetGPUObjectName() : 0);
  62. ^
  63. /home/linaro/dev/urho/Urho3D/Source/Urho3D/Graphics/OpenGL/OGLGraphics.cpp: In member function ‘void Urho3D::Graphics::SetShaders(Urho3D::ShaderVariation*, Urho3D::ShaderVariation*)’:
  64. /home/linaro/dev/urho/Urho3D/Source/Urho3D/Graphics/OpenGL/OGLGraphics.cpp:1109:23: error: ‘glUseProgram’ was not declared in this scope
  65. glUseProgram(0);
  66. ^
  67. /home/linaro/dev/urho/Urho3D/Source/Urho3D/Graphics/OpenGL/OGLGraphics.cpp:1127:60: error: ‘glUseProgram’ was not declared in this scope
  68. glUseProgram(i->second_->GetGPUObjectName());
  69. ^
  70. /home/linaro/dev/urho/Urho3D/Source/Urho3D/Graphics/OpenGL/OGLGraphics.cpp:1132:31: error: ‘glUseProgram’ was not declared in this scope
  71. glUseProgram(0);
  72. ^
  73. /home/linaro/dev/urho/Urho3D/Source/Urho3D/Graphics/OpenGL/OGLGraphics.cpp:1153:31: error: ‘glUseProgram’ was not declared in this scope
  74. glUseProgram(0);
  75. ^
  76. /home/linaro/dev/urho/Urho3D/Source/Urho3D/Graphics/OpenGL/OGLGraphics.cpp: In member function ‘void Urho3D::Graphics::SetShaderParameter(Urho3D::StringHash, const float*, unsigned int)’:
  77. /home/linaro/dev/urho/Urho3D/Source/Urho3D/Graphics/OpenGL/OGLGraphics.cpp:1221:58: error: ‘glUniform1fv’ was not declared in this scope
  78. glUniform1fv(info->location_, count, data);
  79. ^
  80. /home/linaro/dev/urho/Urho3D/Source/Urho3D/Graphics/OpenGL/OGLGraphics.cpp:1225:62: error: ‘glUniform2fv’ was not declared in this scope
  81. glUniform2fv(info->location_, count / 2, data);
  82. ^
  83. /home/linaro/dev/urho/Urho3D/Source/Urho3D/Graphics/OpenGL/OGLGraphics.cpp:1229:62: error: ‘glUniform3fv’ was not declared in this scope
  84. glUniform3fv(info->location_, count / 3, data);
  85. ^
  86. /home/linaro/dev/urho/Urho3D/Source/Urho3D/Graphics/OpenGL/OGLGraphics.cpp:1233:62: error: ‘glUniform4fv’ was not declared in this scope
  87. glUniform4fv(info->location_, count / 4, data);
  88. ^
  89. /home/linaro/dev/urho/Urho3D/Source/Urho3D/Graphics/OpenGL/OGLGraphics.cpp:1237:78: error: ‘glUniformMatrix3fv’ was not declared in this scope
  90. glUniformMatrix3fv(info->location_, count / 9, GL_FALSE, data);
  91. ^
  92. /home/linaro/dev/urho/Urho3D/Source/Urho3D/Graphics/OpenGL/OGLGraphics.cpp:1241:79: error: ‘glUniformMatrix4fv’ was not declared in this scope
  93. glUniformMatrix4fv(info->location_, count / 16, GL_FALSE, data);
  94. ^
  95. /home/linaro/dev/urho/Urho3D/Source/Urho3D/Graphics/OpenGL/OGLGraphics.cpp: In member function ‘void Urho3D::Graphics::SetShaderParameter(Urho3D::StringHash, float)’:
  96. /home/linaro/dev/urho/Urho3D/Source/Urho3D/Graphics/OpenGL/OGLGraphics.cpp:1266:52: error: ‘glUniform1fv’ was not declared in this scope
  97. glUniform1fv(info->location_, 1, &value);
  98. ^
  99. /home/linaro/dev/urho/Urho3D/Source/Urho3D/Graphics/OpenGL/OGLGraphics.cpp: In member function ‘void Urho3D::Graphics::SetShaderParameter(Urho3D::StringHash, int)’:
  100. /home/linaro/dev/urho/Urho3D/Source/Urho3D/Graphics/OpenGL/OGLGraphics.cpp:1287:47: error: ‘glUniform1i’ was not declared in this scope
  101. glUniform1i(info->location_, value);
  102. ^
  103. /home/linaro/dev/urho/Urho3D/Source/Urho3D/Graphics/OpenGL/OGLGraphics.cpp: In member function ‘void Urho3D::Graphics::SetShaderParameter(Urho3D::StringHash, bool)’:
  104. /home/linaro/dev/urho/Urho3D/Source/Urho3D/Graphics/OpenGL/OGLGraphics.cpp:1309:52: error: ‘glUniform1i’ was not declared in this scope
  105. glUniform1i(info->location_, (int)value);
  106. ^
  107. /home/linaro/dev/urho/Urho3D/Source/Urho3D/Graphics/OpenGL/OGLGraphics.cpp: In member function ‘void Urho3D::Graphics::SetShaderParameter(Urho3D::StringHash, const Urho3D::Vector2&)’:
  108. /home/linaro/dev/urho/Urho3D/Source/Urho3D/Graphics/OpenGL/OGLGraphics.cpp:1339:63: error: ‘glUniform1fv’ was not declared in this scope
  109. glUniform1fv(info->location_, 1, vector.Data());
  110. ^
  111. /home/linaro/dev/urho/Urho3D/Source/Urho3D/Graphics/OpenGL/OGLGraphics.cpp:1343:63: error: ‘glUniform2fv’ was not declared in this scope
  112. glUniform2fv(info->location_, 1, vector.Data());
  113. ^
  114. /home/linaro/dev/urho/Urho3D/Source/Urho3D/Graphics/OpenGL/OGLGraphics.cpp: In member function ‘void Urho3D::Graphics::SetShaderParameter(Urho3D::StringHash, const Urho3D::Matrix3&)’:
  115. /home/linaro/dev/urho/Urho3D/Source/Urho3D/Graphics/OpenGL/OGLGraphics.cpp:1368:75: error: ‘glUniformMatrix3fv’ was not declared in this scope
  116. glUniformMatrix3fv(info->location_, 1, GL_FALSE, matrix.Data());
  117. ^
  118. /home/linaro/dev/urho/Urho3D/Source/Urho3D/Graphics/OpenGL/OGLGraphics.cpp: In member function ‘void Urho3D::Graphics::SetShaderParameter(Urho3D::StringHash, const Urho3D::Vector3&)’:
  119. /home/linaro/dev/urho/Urho3D/Source/Urho3D/Graphics/OpenGL/OGLGraphics.cpp:1393:63: error: ‘glUniform1fv’ was not declared in this scope
  120. glUniform1fv(info->location_, 1, vector.Data());
  121. ^
  122. /home/linaro/dev/urho/Urho3D/Source/Urho3D/Graphics/OpenGL/OGLGraphics.cpp:1397:63: error: ‘glUniform2fv’ was not declared in this scope
  123. glUniform2fv(info->location_, 1, vector.Data());
  124. ^
  125. /home/linaro/dev/urho/Urho3D/Source/Urho3D/Graphics/OpenGL/OGLGraphics.cpp:1401:63: error: ‘glUniform3fv’ was not declared in this scope
  126. glUniform3fv(info->location_, 1, vector.Data());
  127. ^
  128. /home/linaro/dev/urho/Urho3D/Source/Urho3D/Graphics/OpenGL/OGLGraphics.cpp: In member function ‘void Urho3D::Graphics::SetShaderParameter(Urho3D::StringHash, const Urho3D::Matrix4&)’:
  129. /home/linaro/dev/urho/Urho3D/Source/Urho3D/Graphics/OpenGL/OGLGraphics.cpp:1426:75: error: ‘glUniformMatrix4fv’ was not declared in this scope
  130. glUniformMatrix4fv(info->location_, 1, GL_FALSE, matrix.Data());
  131. ^
  132. /home/linaro/dev/urho/Urho3D/Source/Urho3D/Graphics/OpenGL/OGLGraphics.cpp: In member function ‘void Urho3D::Graphics::SetShaderParameter(Urho3D::StringHash, const Urho3D::Vector4&)’:
  133. /home/linaro/dev/urho/Urho3D/Source/Urho3D/Graphics/OpenGL/OGLGraphics.cpp:1451:63: error: ‘glUniform1fv’ was not declared in this scope
  134. glUniform1fv(info->location_, 1, vector.Data());
  135. ^
  136. /home/linaro/dev/urho/Urho3D/Source/Urho3D/Graphics/OpenGL/OGLGraphics.cpp:1455:63: error: ‘glUniform2fv’ was not declared in this scope
  137. glUniform2fv(info->location_, 1, vector.Data());
  138. ^
  139. /home/linaro/dev/urho/Urho3D/Source/Urho3D/Graphics/OpenGL/OGLGraphics.cpp:1459:63: error: ‘glUniform3fv’ was not declared in this scope
  140. glUniform3fv(info->location_, 1, vector.Data());
  141. ^
  142. /home/linaro/dev/urho/Urho3D/Source/Urho3D/Graphics/OpenGL/OGLGraphics.cpp:1463:63: error: ‘glUniform4fv’ was not declared in this scope
  143. glUniform4fv(info->location_, 1, vector.Data());
  144. ^
  145. /home/linaro/dev/urho/Urho3D/Source/Urho3D/Graphics/OpenGL/OGLGraphics.cpp: In member function ‘void Urho3D::Graphics::SetShaderParameter(Urho3D::StringHash, const Urho3D::Matrix3x4&)’:
  146. /home/linaro/dev/urho/Urho3D/Source/Urho3D/Graphics/OpenGL/OGLGraphics.cpp:1503:79: error: ‘glUniformMatrix4fv’ was not declared in this scope
  147. glUniformMatrix4fv(info->location_, 1, GL_FALSE, fullMatrix.Data());
  148. ^
  149. /home/linaro/dev/urho/Urho3D/Source/Urho3D/Graphics/OpenGL/OGLGraphics.cpp: In member function ‘void Urho3D::Graphics::SetTexture(unsigned int, Urho3D::Texture*)’:
  150. /home/linaro/dev/urho/Urho3D/Source/Urho3D/Graphics/OpenGL/OGLGraphics.cpp:1570:48: error: ‘glActiveTexture’ was not declared in this scope
  151. glActiveTexture(GL_TEXTURE0 + index);
  152. ^
  153. /home/linaro/dev/urho/Urho3D/Source/Urho3D/Graphics/OpenGL/OGLGraphics.cpp:1579:61: error: ‘glBindTexture’ was not declared in this scope
  154. glBindTexture(impl_->textureTypes_[index], 0);
  155. ^
  156. /home/linaro/dev/urho/Urho3D/Source/Urho3D/Graphics/OpenGL/OGLGraphics.cpp:1580:62: error: ‘glBindTexture’ was not declared in this scope
  157. glBindTexture(glType, texture->GetGPUObjectName());
  158. ^
  159. /home/linaro/dev/urho/Urho3D/Source/Urho3D/Graphics/OpenGL/OGLGraphics.cpp:1590:57: error: ‘glBindTexture’ was not declared in this scope
  160. glBindTexture(impl_->textureTypes_[index], 0);
  161. ^
  162. /home/linaro/dev/urho/Urho3D/Source/Urho3D/Graphics/OpenGL/OGLGraphics.cpp:1602:52: error: ‘glActiveTexture’ was not declared in this scope
  163. glActiveTexture(GL_TEXTURE0 + index);
  164. ^
  165. /home/linaro/dev/urho/Urho3D/Source/Urho3D/Graphics/OpenGL/OGLGraphics.cpp:1606:76: error: ‘glBindTexture’ was not declared in this scope
  166. glBindTexture(texture->GetTarget(), texture->GetGPUObjectName());
  167. ^
  168. /home/linaro/dev/urho/Urho3D/Source/Urho3D/Graphics/OpenGL/OGLGraphics.cpp: In member function ‘void Urho3D::Graphics::SetTextureForUpdate(Urho3D::Texture*)’:
  169. /home/linaro/dev/urho/Urho3D/Source/Urho3D/Graphics/OpenGL/OGLGraphics.cpp:1619:36: error: ‘glActiveTexture’ was not declared in this scope
  170. glActiveTexture(GL_TEXTURE0);
  171. ^
  172. /home/linaro/dev/urho/Urho3D/Source/Urho3D/Graphics/OpenGL/OGLGraphics.cpp:1626:49: error: ‘glBindTexture’ was not declared in this scope
  173. glBindTexture(impl_->textureTypes_[0], 0);
  174. ^
  175. /home/linaro/dev/urho/Urho3D/Source/Urho3D/Graphics/OpenGL/OGLGraphics.cpp:1627:54: error: ‘glBindTexture’ was not declared in this scope
  176. glBindTexture(glType, texture->GetGPUObjectName());
  177. ^
  178. /home/linaro/dev/urho/Urho3D/Source/Urho3D/Graphics/OpenGL/OGLGraphics.cpp: In member function ‘void Urho3D::Graphics::SetViewport(const Urho3D::IntRect&)’:
  179. /home/linaro/dev/urho/Urho3D/Source/Urho3D/Graphics/OpenGL/OGLGraphics.cpp:1790:97: error: ‘glViewport’ was not declared in this scope
  180. opy.left_, rtSize.y_ - rectCopy.bottom_, rectCopy.Width(), rectCopy.Height());
  181. ^
  182. /home/linaro/dev/urho/Urho3D/Source/Urho3D/Graphics/OpenGL/OGLGraphics.cpp: In member function ‘void Urho3D::Graphics::SetBlendMode(Urho3D::BlendMode, bool)’:
  183. /home/linaro/dev/urho/Urho3D/Source/Urho3D/Graphics/OpenGL/OGLGraphics.cpp:1802:31: error: ‘glDisable’ was not declared in this scope
  184. glDisable(GL_BLEND);
  185. ^
  186. /home/linaro/dev/urho/Urho3D/Source/Urho3D/Graphics/OpenGL/OGLGraphics.cpp:1805:30: error: ‘glEnable’ was not declared in this scope
  187. glEnable(GL_BLEND);
  188. ^
  189. /home/linaro/dev/urho/Urho3D/Source/Urho3D/Graphics/OpenGL/OGLGraphics.cpp:1806:60: error: ‘glBlendFunc’ was not declared in this scope
  190. glBlendFunc(glSrcBlend[mode], glDestBlend[mode]);
  191. ^
  192. /home/linaro/dev/urho/Urho3D/Source/Urho3D/Graphics/OpenGL/OGLGraphics.cpp:1807:44: error: ‘glBlendEquation’ was not declared in this scope
  193. glBlendEquation(glBlendOp[mode]);
  194. ^
  195. /home/linaro/dev/urho/Urho3D/Source/Urho3D/Graphics/OpenGL/OGLGraphics.cpp:1816:49: error: ‘glEnable’ was not declared in this scope
  196. glEnable(GL_SAMPLE_ALPHA_TO_COVERAGE);
  197. ^
  198. /home/linaro/dev/urho/Urho3D/Source/Urho3D/Graphics/OpenGL/OGLGraphics.cpp:1818:50: error: ‘glDisable’ was not declared in this scope
  199. glDisable(GL_SAMPLE_ALPHA_TO_COVERAGE);
  200. ^
  201. /home/linaro/dev/urho/Urho3D/Source/Urho3D/Graphics/OpenGL/OGLGraphics.cpp: In member function ‘void Urho3D::Graphics::SetColorWrite(bool)’:
  202. /home/linaro/dev/urho/Urho3D/Source/Urho3D/Graphics/OpenGL/OGLGraphics.cpp:1829:59: error: ‘glColorMask’ was not declared in this scope
  203. glColorMask(GL_TRUE, GL_TRUE, GL_TRUE, GL_TRUE);
  204. ^
  205. /home/linaro/dev/urho/Urho3D/Source/Urho3D/Graphics/OpenGL/OGLGraphics.cpp:1831:63: error: ‘glColorMask’ was not declared in this scope
  206. glColorMask(GL_FALSE, GL_FALSE, GL_FALSE, GL_FALSE);
  207. ^
  208. /home/linaro/dev/urho/Urho3D/Source/Urho3D/Graphics/OpenGL/OGLGraphics.cpp: In member function ‘void Urho3D::Graphics::SetCullMode(Urho3D::CullMode)’:
  209. /home/linaro/dev/urho/Urho3D/Source/Urho3D/Graphics/OpenGL/OGLGraphics.cpp:1842:35: error: ‘glDisable’ was not declared in this scope
  210. glDisable(GL_CULL_FACE);
  211. ^
  212. /home/linaro/dev/urho/Urho3D/Source/Urho3D/Graphics/OpenGL/OGLGraphics.cpp:1846:34: error: ‘glEnable’ was not declared in this scope
  213. glEnable(GL_CULL_FACE);
  214. ^
  215. /home/linaro/dev/urho/Urho3D/Source/Urho3D/Graphics/OpenGL/OGLGraphics.cpp:1847:61: error: ‘glCullFace’ was not declared in this scope
  216. glCullFace(mode == CULL_CCW ? GL_FRONT : GL_BACK);
  217. ^
  218. /home/linaro/dev/urho/Urho3D/Source/Urho3D/Graphics/OpenGL/OGLGraphics.cpp: In member function ‘void Urho3D::Graphics::SetDepthTest(Urho3D::CompareMode)’:
  219. /home/linaro/dev/urho/Urho3D/Source/Urho3D/Graphics/OpenGL/OGLGraphics.cpp:1880:36: error: ‘glDepthFunc’ was not declared in this scope
  220. glDepthFunc(glCmpFunc[mode]);
  221. ^
  222. /home/linaro/dev/urho/Urho3D/Source/Urho3D/Graphics/OpenGL/OGLGraphics.cpp: In member function ‘void Urho3D::Graphics::SetDepthWrite(bool)’:
  223. /home/linaro/dev/urho/Urho3D/Source/Urho3D/Graphics/OpenGL/OGLGraphics.cpp:1889:48: error: ‘glDepthMask’ was not declared in this scope
  224. glDepthMask(enable ? GL_TRUE : GL_FALSE);
  225. ^
  226. /home/linaro/dev/urho/Urho3D/Source/Urho3D/Graphics/OpenGL/OGLGraphics.cpp: In member function ‘void Urho3D::Graphics::SetScissorTest(bool, const Urho3D::Rect&, bool)’:
  227. /home/linaro/dev/urho/Urho3D/Source/Urho3D/Graphics/OpenGL/OGLGraphics.cpp:1950:100: error: ‘glScissor’ was not declared in this scope
  228. ntRect.left_, rtSize.y_ - intRect.bottom_, intRect.Width(), intRect.Height());
  229. ^
  230. /home/linaro/dev/urho/Urho3D/Source/Urho3D/Graphics/OpenGL/OGLGraphics.cpp:1960:37: error: ‘glEnable’ was not declared in this scope
  231. glEnable(GL_SCISSOR_TEST);
  232. ^
  233. /home/linaro/dev/urho/Urho3D/Source/Urho3D/Graphics/OpenGL/OGLGraphics.cpp:1962:38: error: ‘glDisable’ was not declared in this scope
  234. glDisable(GL_SCISSOR_TEST);
  235. ^
  236. /home/linaro/dev/urho/Urho3D/Source/Urho3D/Graphics/OpenGL/OGLGraphics.cpp: In member function ‘void Urho3D::Graphics::SetScissorTest(bool, const Urho3D::IntRect&)’:
  237. /home/linaro/dev/urho/Urho3D/Source/Urho3D/Graphics/OpenGL/OGLGraphics.cpp:1991:100: error: ‘glScissor’ was not declared in this scope
  238. ntRect.left_, rtSize.y_ - intRect.bottom_, intRect.Width(), intRect.Height());
  239. ^
  240. /home/linaro/dev/urho/Urho3D/Source/Urho3D/Graphics/OpenGL/OGLGraphics.cpp:2001:37: error: ‘glEnable’ was not declared in this scope
  241. glEnable(GL_SCISSOR_TEST);
  242. ^
  243. /home/linaro/dev/urho/Urho3D/Source/Urho3D/Graphics/OpenGL/OGLGraphics.cpp:2003:38: error: ‘glDisable’ was not declared in this scope
  244. glDisable(GL_SCISSOR_TEST);
  245. ^
  246. /home/linaro/dev/urho/Urho3D/Source/Urho3D/Graphics/OpenGL/OGLGraphics.cpp: In member function ‘bool Urho3D::Graphics::GetDither() const’:
  247. /home/linaro/dev/urho/Urho3D/Source/Urho3D/Graphics/OpenGL/OGLGraphics.cpp:2085:33: error: ‘glIsEnabled’ was not declared in this scope
  248. return glIsEnabled(GL_DITHER) ? true : false;
  249. ^
  250. /home/linaro/dev/urho/Urho3D/Source/Urho3D/Graphics/OpenGL/OGLGraphics.cpp: In member function ‘void Urho3D::Graphics::Restore()’:
  251. /home/linaro/dev/urho/Urho3D/Source/Urho3D/Graphics/OpenGL/OGLGraphics.cpp:2546:43: error: ‘glPixelStorei’ was not declared in this scope
  252. glPixelStorei(GL_PACK_ALIGNMENT, 1);
  253. ^
  254. /home/linaro/dev/urho/Urho3D/Source/Urho3D/Graphics/OpenGL/OGLGraphics.cpp: In member function ‘void Urho3D::Graphics::SetVBO(unsigned int)’:
  255. /home/linaro/dev/urho/Urho3D/Source/Urho3D/Graphics/OpenGL/OGLGraphics.cpp:2571:49: error: ‘glBindBuffer’ was not declared in this scope
  256. glBindBuffer(GL_ARRAY_BUFFER, object);
  257. ^
  258. /home/linaro/dev/urho/Urho3D/Source/Urho3D/Graphics/OpenGL/OGLGraphics.cpp: In member function ‘void Urho3D::Graphics::PrepareDraw()’:
  259. /home/linaro/dev/urho/Urho3D/Source/Urho3D/Graphics/OpenGL/OGLGraphics.cpp:3126:59: error: ‘glEnableVertexAttribArray’ was not declared in this scope
  260. glEnableVertexAttribArray(location);
  261. ^
  262. /home/linaro/dev/urho/Urho3D/Source/Urho3D/Graphics/OpenGL/OGLGraphics.cpp:3153:56: error: ‘glVertexAttribPointer’ was not declared in this scope
  263. (const void *)(size_t)dataStart);
  264. ^
  265. /home/linaro/dev/urho/Urho3D/Source/Urho3D/Graphics/OpenGL/OGLGraphics.cpp:3165:52: error: ‘glDisableVertexAttribArray’ was not declared in this scope
  266. glDisableVertexAttribArray(location);
  267. ^
  268. /home/linaro/dev/urho/Urho3D/Source/Urho3D/Graphics/OpenGL/OGLGraphics.cpp: In member function ‘void Urho3D::Graphics::ResetCachedState()’:
  269. /home/linaro/dev/urho/Urho3D/Source/Urho3D/Graphics/OpenGL/OGLGraphics.cpp:3257:31: error: ‘glEnable’ was not declared in this scope
  270. glEnable(GL_DEPTH_TEST);
  271. ^
  272. /home/linaro/dev/urho/Urho3D/Source/Urho3D/Graphics/OpenGL/OGLGraphics.cpp: In member function ‘unsigned int Urho3D::Graphics::CreateFramebuffer()’:
  273. /home/linaro/dev/urho/Urho3D/Source/Urho3D/Graphics/OpenGL/OGLGraphics.cpp:3302:37: error: ‘glGenFramebuffers’ was not declared in this scope
  274. glGenFramebuffers(1, &newFbo);
  275. ^
  276. /home/linaro/dev/urho/Urho3D/Source/Urho3D/Graphics/OpenGL/OGLGraphics.cpp: In member function ‘void Urho3D::Graphics::DeleteFramebuffer(unsigned int)’:
  277. /home/linaro/dev/urho/Urho3D/Source/Urho3D/Graphics/OpenGL/OGLGraphics.cpp:3313:37: error: ‘glDeleteFramebuffers’ was not declared in this scope
  278. glDeleteFramebuffers(1, &fbo);
  279. ^
  280. /home/linaro/dev/urho/Urho3D/Source/Urho3D/Graphics/OpenGL/OGLGraphics.cpp: In member function ‘void Urho3D::Graphics::BindFramebuffer(unsigned int)’:
  281. /home/linaro/dev/urho/Urho3D/Source/Urho3D/Graphics/OpenGL/OGLGraphics.cpp:3323:46: error: ‘glBindFramebuffer’ was not declared in this scope
  282. glBindFramebuffer(GL_FRAMEBUFFER, fbo);
  283. ^
  284. /home/linaro/dev/urho/Urho3D/Source/Urho3D/Graphics/OpenGL/OGLGraphics.cpp: In member function ‘void Urho3D::Graphics::BindColorAttachment(unsigned int, unsigned int, unsigned int, bool)’:
  285. /home/linaro/dev/urho/Urho3D/Source/Urho3D/Graphics/OpenGL/OGLGraphics.cpp:3343:99: error: ‘glFramebufferTexture2D’ was not declared in this scope
  286. ferTexture2D(GL_FRAMEBUFFER, GL_COLOR_ATTACHMENT0 + index, target, object, 0);
  287. ^
  288. /home/linaro/dev/urho/Urho3D/Source/Urho3D/Graphics/OpenGL/OGLGraphics.cpp:3345:108: error: ‘glFramebufferRenderbuffer’ was not declared in this scope
  289. buffer(GL_FRAMEBUFFER, GL_COLOR_ATTACHMENT0 + index, GL_RENDERBUFFER, object);
  290. ^
  291. /home/linaro/dev/urho/Urho3D/Source/Urho3D/Graphics/OpenGL/OGLGraphics.cpp: In member function ‘void Urho3D::Graphics::BindDepthAttachment(unsigned int, bool)’:
  292. /home/linaro/dev/urho/Urho3D/Source/Urho3D/Graphics/OpenGL/OGLGraphics.cpp:3366:97: error: ‘glFramebufferTexture2D’ was not declared in this scope
  293. ufferTexture2D(GL_FRAMEBUFFER, GL_DEPTH_ATTACHMENT, GL_TEXTURE_2D, object, 0);
  294. ^
  295. /home/linaro/dev/urho/Urho3D/Source/Urho3D/Graphics/OpenGL/OGLGraphics.cpp:3368:99: error: ‘glFramebufferRenderbuffer’ was not declared in this scope
  296. ferRenderbuffer(GL_FRAMEBUFFER, GL_DEPTH_ATTACHMENT, GL_RENDERBUFFER, object);
  297. ^
  298. /home/linaro/dev/urho/Urho3D/Source/Urho3D/Graphics/OpenGL/OGLGraphics.cpp: In member function ‘void Urho3D::Graphics::BindStencilAttachment(unsigned int, bool)’:
  299. /home/linaro/dev/urho/Urho3D/Source/Urho3D/Graphics/OpenGL/OGLGraphics.cpp:3389:99: error: ‘glFramebufferTexture2D’ was not declared in this scope
  300. ferTexture2D(GL_FRAMEBUFFER, GL_STENCIL_ATTACHMENT, GL_TEXTURE_2D, object, 0);
  301. ^
  302. /home/linaro/dev/urho/Urho3D/Source/Urho3D/Graphics/OpenGL/OGLGraphics.cpp:3391:101: error: ‘glFramebufferRenderbuffer’ was not declared in this scope
  303. rRenderbuffer(GL_FRAMEBUFFER, GL_STENCIL_ATTACHMENT, GL_RENDERBUFFER, object);
  304. ^
  305. /home/linaro/dev/urho/Urho3D/Source/Urho3D/Graphics/OpenGL/OGLGraphics.cpp: In member function ‘bool Urho3D::Graphics::CheckFramebuffer()’:
  306. /home/linaro/dev/urho/Urho3D/Source/Urho3D/Graphics/OpenGL/OGLGraphics.cpp:3402:55: error: ‘glCheckFramebufferStatus’ was not declared in this scope
  307. return glCheckFramebufferStatus(GL_FRAMEBUFFER) == GL_FRAMEBUFFER_COMPLETE;
  308. ^
  309. Source/Urho3D/CMakeFiles/Urho3D.dir/build.make:2253: recipe for target 'Source/Urho3D/CMakeFiles/Urho3D.dir/Graphics/OpenGL/OGLGraphics.cpp.o' failed
  310. make[2]: *** [Source/Urho3D/CMakeFiles/Urho3D.dir/Graphics/OpenGL/OGLGraphics.cpp.o] Error 1
  311. CMakeFiles/Makefile2:1428: recipe for target 'Source/Urho3D/CMakeFiles/Urho3D.dir/all' failed
  312. make[1]: *** [Source/Urho3D/CMakeFiles/Urho3D.dir/all] Error 2
  313. Makefile:149: recipe for target 'all' failed
  314. make: *** [all] Error 2
  315. linaro@linaro-alip:~/dev/urho/Urho3D$
Advertisement
Add Comment
Please, Sign In to add comment
Advertisement