Advertisement
Guest User

Untitled

a guest
Sep 5th, 2022
16
0
Never
Not a member of Pastebin yet? Sign Up, it unlocks many cool features!
text 55.38 KB | None | 0 0
  1. Script started on 2022-09-05 19:32:42+02:00 [TERM="xterm-256color" TTY="/dev/pts/1" COLUMNS="93" LINES="48"]
  2. host:zig/build>
  3. -- The C compiler identification is GNU 12.2.0KE_PREFIX_PATH=/usr/lib/llvm/14/ ..D_-D
  4. -- The CXX compiler identification is GNU 12.2.0
  5. -- Detecting C compiler ABI info
  6. -- Detecting C compiler ABI info - done
  7. -- Check for working C compiler: /usr/bin/cc - skipped
  8. -- Detecting C compile features
  9. -- Detecting C compile features - done
  10. -- Detecting CXX compiler ABI info
  11. -- Detecting CXX compiler ABI info - done
  12. -- Check for working CXX compiler: /usr/bin/c++ - skipped
  13. -- Detecting CXX compile features
  14. -- Detecting CXX compile features - done
  15. -- Configuring zig version 0.10.0-dev.3880+e2bb92b2e
  16. -- Found llvm: -lLLVM-14 (Required is at least version "14")
  17. -- Found clang: /usr/lib/llvm/14/lib64/libclang-cpp.so.14 (Required is at least version "14")
  18. -- Found lld: /usr/lib64/liblldMinGW.so;/usr/lib64/liblldELF.so;/usr/lib64/liblldCOFF.so;/usr/lib64/liblldWasm.so;/usr/lib64/liblldMachO.so;/usr/lib64/liblldCommon.so (Required is at least version "14")
  19. -- Performing Test CMAKE_HAVE_LIBC_PTHREAD
  20. -- Performing Test CMAKE_HAVE_LIBC_PTHREAD - Success
  21. -- Found Threads: TRUE
  22. -- Configuring done
  23. -- Generating done
  24. -- Build files have been written to: /home/user/data/pools/pool00/CVS-Archive/ZIG/zig/build
  25. host:zig/build>,al,make
  26. [ 0%] Building C object CMakeFiles/embedded_softfloat.dir/deps/SoftFloat-3e/source/8086/f128M_isSignalingNaN.c.o
  27. [ 1%] Building C object CMakeFiles/embedded_softfloat.dir/deps/SoftFloat-3e/source/8086/extF80M_isSignalingNaN.c.o
  28. [ 1%] Building C object CMakeFiles/embedded_softfloat.dir/deps/SoftFloat-3e/source/8086/s_commonNaNToF128M.c.o
  29. [ 2%] Building C object CMakeFiles/embedded_softfloat.dir/deps/SoftFloat-3e/source/8086/s_commonNaNToExtF80M.c.o
  30. [ 2%] Building C object CMakeFiles/embedded_softfloat.dir/deps/SoftFloat-3e/source/8086/s_commonNaNToF16UI.c.o
  31. [ 3%] Building C object CMakeFiles/embedded_softfloat.dir/deps/SoftFloat-3e/source/8086/s_commonNaNToF32UI.c.o
  32. [ 3%] Building C object CMakeFiles/embedded_softfloat.dir/deps/SoftFloat-3e/source/8086/s_commonNaNToF64UI.c.o
  33. [ 4%] Building C object CMakeFiles/embedded_softfloat.dir/deps/SoftFloat-3e/source/8086/s_f128MToCommonNaN.c.o
  34. [ 4%] Building C object CMakeFiles/embedded_softfloat.dir/deps/SoftFloat-3e/source/8086/s_extF80MToCommonNaN.c.o
  35. [ 5%] Building C object CMakeFiles/embedded_softfloat.dir/deps/SoftFloat-3e/source/8086/s_f16UIToCommonNaN.c.o
  36. [ 5%] Building C object CMakeFiles/embedded_softfloat.dir/deps/SoftFloat-3e/source/8086/s_f32UIToCommonNaN.c.o
  37. [ 6%] Building C object CMakeFiles/embedded_softfloat.dir/deps/SoftFloat-3e/source/8086/s_f64UIToCommonNaN.c.o
  38. [ 6%] Building C object CMakeFiles/embedded_softfloat.dir/deps/SoftFloat-3e/source/8086/s_propagateNaNF128M.c.o
  39. [ 7%] Building C object CMakeFiles/embedded_softfloat.dir/deps/SoftFloat-3e/source/8086/s_propagateNaNExtF80M.c.o
  40. [ 7%] Building C object CMakeFiles/embedded_softfloat.dir/deps/SoftFloat-3e/source/8086/s_propagateNaNF16UI.c.o
  41. [ 8%] Building C object CMakeFiles/embedded_softfloat.dir/deps/SoftFloat-3e/source/8086/softfloat_raiseFlags.c.o
  42. [ 8%] Building C object CMakeFiles/embedded_softfloat.dir/deps/SoftFloat-3e/source/f128M_add.c.o
  43. [ 9%] Building C object CMakeFiles/embedded_softfloat.dir/deps/SoftFloat-3e/source/f128M_div.c.o
  44. [ 9%] Building C object CMakeFiles/embedded_softfloat.dir/deps/SoftFloat-3e/source/f128M_eq.c.o
  45. [ 10%] Building C object CMakeFiles/embedded_softfloat.dir/deps/SoftFloat-3e/source/f128M_eq_signaling.c.o
  46. [ 10%] Building C object CMakeFiles/embedded_softfloat.dir/deps/SoftFloat-3e/source/f128M_le.c.o
  47. [ 11%] Building C object CMakeFiles/embedded_softfloat.dir/deps/SoftFloat-3e/source/f128M_le_quiet.c.o
  48. [ 11%] Building C object CMakeFiles/embedded_softfloat.dir/deps/SoftFloat-3e/source/f128M_lt.c.o
  49. [ 12%] Building C object CMakeFiles/embedded_softfloat.dir/deps/SoftFloat-3e/source/f128M_lt_quiet.c.o
  50. [ 12%] Building C object CMakeFiles/embedded_softfloat.dir/deps/SoftFloat-3e/source/f128M_mul.c.o
  51. [ 13%] Building C object CMakeFiles/embedded_softfloat.dir/deps/SoftFloat-3e/source/f128M_mulAdd.c.o
  52. [ 13%] Building C object CMakeFiles/embedded_softfloat.dir/deps/SoftFloat-3e/source/f128M_rem.c.o
  53. [ 14%] Building C object CMakeFiles/embedded_softfloat.dir/deps/SoftFloat-3e/source/f128M_roundToInt.c.o
  54. [ 14%] Building C object CMakeFiles/embedded_softfloat.dir/deps/SoftFloat-3e/source/f128M_sqrt.c.o
  55. [ 15%] Building C object CMakeFiles/embedded_softfloat.dir/deps/SoftFloat-3e/source/f128M_sub.c.o
  56. [ 15%] Building C object CMakeFiles/embedded_softfloat.dir/deps/SoftFloat-3e/source/f128M_to_f16.c.o
  57. [ 16%] Building C object CMakeFiles/embedded_softfloat.dir/deps/SoftFloat-3e/source/f128M_to_f32.c.o
  58. [ 16%] Building C object CMakeFiles/embedded_softfloat.dir/deps/SoftFloat-3e/source/f128M_to_f64.c.o
  59. [ 17%] Building C object CMakeFiles/embedded_softfloat.dir/deps/SoftFloat-3e/source/f128M_to_extF80M.c.o
  60. [ 17%] Building C object CMakeFiles/embedded_softfloat.dir/deps/SoftFloat-3e/source/f128M_to_i32.c.o
  61. [ 18%] Building C object CMakeFiles/embedded_softfloat.dir/deps/SoftFloat-3e/source/f128M_to_i32_r_minMag.c.o
  62. [ 18%] Building C object CMakeFiles/embedded_softfloat.dir/deps/SoftFloat-3e/source/f128M_to_i64.c.o
  63. [ 19%] Building C object CMakeFiles/embedded_softfloat.dir/deps/SoftFloat-3e/source/f128M_to_i64_r_minMag.c.o
  64. [ 20%] Building C object CMakeFiles/embedded_softfloat.dir/deps/SoftFloat-3e/source/f128M_to_ui32.c.o
  65. [ 20%] Building C object CMakeFiles/embedded_softfloat.dir/deps/SoftFloat-3e/source/f128M_to_ui32_r_minMag.c.o
  66. [ 21%] Building C object CMakeFiles/embedded_softfloat.dir/deps/SoftFloat-3e/source/f128M_to_ui64.c.o
  67. [ 21%] Building C object CMakeFiles/embedded_softfloat.dir/deps/SoftFloat-3e/source/f128M_to_ui64_r_minMag.c.o
  68. [ 22%] Building C object CMakeFiles/embedded_softfloat.dir/deps/SoftFloat-3e/source/extF80M_add.c.o
  69. [ 22%] Building C object CMakeFiles/embedded_softfloat.dir/deps/SoftFloat-3e/source/extF80M_div.c.o
  70. [ 23%] Building C object CMakeFiles/embedded_softfloat.dir/deps/SoftFloat-3e/source/extF80M_eq.c.o
  71. [ 23%] Building C object CMakeFiles/embedded_softfloat.dir/deps/SoftFloat-3e/source/extF80M_le.c.o
  72. [ 24%] Building C object CMakeFiles/embedded_softfloat.dir/deps/SoftFloat-3e/source/extF80M_lt.c.o
  73. [ 24%] Building C object CMakeFiles/embedded_softfloat.dir/deps/SoftFloat-3e/source/extF80M_mul.c.o
  74. [ 25%] Building C object CMakeFiles/embedded_softfloat.dir/deps/SoftFloat-3e/source/extF80M_rem.c.o
  75. [ 25%] Building C object CMakeFiles/embedded_softfloat.dir/deps/SoftFloat-3e/source/extF80M_roundToInt.c.o
  76. [ 26%] Building C object CMakeFiles/embedded_softfloat.dir/deps/SoftFloat-3e/source/extF80M_sqrt.c.o
  77. [ 26%] Building C object CMakeFiles/embedded_softfloat.dir/deps/SoftFloat-3e/source/extF80M_sub.c.o
  78. [ 27%] Building C object CMakeFiles/embedded_softfloat.dir/deps/SoftFloat-3e/source/extF80M_to_f16.c.o
  79. [ 27%] Building C object CMakeFiles/embedded_softfloat.dir/deps/SoftFloat-3e/source/extF80M_to_f32.c.o
  80. [ 28%] Building C object CMakeFiles/embedded_softfloat.dir/deps/SoftFloat-3e/source/extF80M_to_f64.c.o
  81. [ 28%] Building C object CMakeFiles/embedded_softfloat.dir/deps/SoftFloat-3e/source/extF80M_to_f128M.c.o
  82. [ 29%] Building C object CMakeFiles/embedded_softfloat.dir/deps/SoftFloat-3e/source/f16_add.c.o
  83. [ 29%] Building C object CMakeFiles/embedded_softfloat.dir/deps/SoftFloat-3e/source/f16_div.c.o
  84. [ 30%] Building C object CMakeFiles/embedded_softfloat.dir/deps/SoftFloat-3e/source/f16_eq.c.o
  85. [ 30%] Building C object CMakeFiles/embedded_softfloat.dir/deps/SoftFloat-3e/source/f16_isSignalingNaN.c.o
  86. [ 31%] Building C object CMakeFiles/embedded_softfloat.dir/deps/SoftFloat-3e/source/f16_lt.c.o
  87. [ 31%] Building C object CMakeFiles/embedded_softfloat.dir/deps/SoftFloat-3e/source/f16_mul.c.o
  88. [ 32%] Building C object CMakeFiles/embedded_softfloat.dir/deps/SoftFloat-3e/source/f16_rem.c.o
  89. [ 32%] Building C object CMakeFiles/embedded_softfloat.dir/deps/SoftFloat-3e/source/f16_roundToInt.c.o
  90. [ 33%] Building C object CMakeFiles/embedded_softfloat.dir/deps/SoftFloat-3e/source/f16_sqrt.c.o
  91. [ 33%] Building C object CMakeFiles/embedded_softfloat.dir/deps/SoftFloat-3e/source/f16_sub.c.o
  92. [ 34%] Building C object CMakeFiles/embedded_softfloat.dir/deps/SoftFloat-3e/source/f16_to_extF80M.c.o
  93. [ 34%] Building C object CMakeFiles/embedded_softfloat.dir/deps/SoftFloat-3e/source/f16_to_f128M.c.o
  94. [ 35%] Building C object CMakeFiles/embedded_softfloat.dir/deps/SoftFloat-3e/source/f16_to_f64.c.o
  95. [ 35%] Building C object CMakeFiles/embedded_softfloat.dir/deps/SoftFloat-3e/source/f32_to_extF80M.c.o
  96. [ 36%] Building C object CMakeFiles/embedded_softfloat.dir/deps/SoftFloat-3e/source/f32_to_f128M.c.o
  97. [ 36%] Building C object CMakeFiles/embedded_softfloat.dir/deps/SoftFloat-3e/source/f64_to_extF80M.c.o
  98. [ 37%] Building C object CMakeFiles/embedded_softfloat.dir/deps/SoftFloat-3e/source/f64_to_f128M.c.o
  99. [ 37%] Building C object CMakeFiles/embedded_softfloat.dir/deps/SoftFloat-3e/source/f64_to_f16.c.o
  100. [ 38%] Building C object CMakeFiles/embedded_softfloat.dir/deps/SoftFloat-3e/source/i32_to_f128M.c.o
  101. [ 38%] Building C object CMakeFiles/embedded_softfloat.dir/deps/SoftFloat-3e/source/s_add256M.c.o
  102. [ 39%] Building C object CMakeFiles/embedded_softfloat.dir/deps/SoftFloat-3e/source/s_addCarryM.c.o
  103. [ 40%] Building C object CMakeFiles/embedded_softfloat.dir/deps/SoftFloat-3e/source/s_addComplCarryM.c.o
  104. [ 40%] Building C object CMakeFiles/embedded_softfloat.dir/deps/SoftFloat-3e/source/s_addF128M.c.o
  105. [ 41%] Building C object CMakeFiles/embedded_softfloat.dir/deps/SoftFloat-3e/source/s_addExtF80M.c.o
  106. [ 41%] Building C object CMakeFiles/embedded_softfloat.dir/deps/SoftFloat-3e/source/s_addM.c.o
  107. [ 42%] Building C object CMakeFiles/embedded_softfloat.dir/deps/SoftFloat-3e/source/s_addMagsF16.c.o
  108. [ 42%] Building C object CMakeFiles/embedded_softfloat.dir/deps/SoftFloat-3e/source/s_addMagsF32.c.o
  109. [ 43%] Building C object CMakeFiles/embedded_softfloat.dir/deps/SoftFloat-3e/source/s_addMagsF64.c.o
  110. [ 43%] Building C object CMakeFiles/embedded_softfloat.dir/deps/SoftFloat-3e/source/s_approxRecip32_1.c.o
  111. [ 44%] Building C object CMakeFiles/embedded_softfloat.dir/deps/SoftFloat-3e/source/s_approxRecipSqrt32_1.c.o
  112. [ 44%] Building C object CMakeFiles/embedded_softfloat.dir/deps/SoftFloat-3e/source/s_approxRecipSqrt_1Ks.c.o
  113. [ 45%] Building C object CMakeFiles/embedded_softfloat.dir/deps/SoftFloat-3e/source/s_approxRecip_1Ks.c.o
  114. [ 45%] Building C object CMakeFiles/embedded_softfloat.dir/deps/SoftFloat-3e/source/s_compare128M.c.o
  115. [ 46%] Building C object CMakeFiles/embedded_softfloat.dir/deps/SoftFloat-3e/source/s_compare96M.c.o
  116. [ 46%] Building C object CMakeFiles/embedded_softfloat.dir/deps/SoftFloat-3e/source/s_compareNonnormExtF80M.c.o
  117. [ 47%] Building C object CMakeFiles/embedded_softfloat.dir/deps/SoftFloat-3e/source/s_countLeadingZeros16.c.o
  118. [ 47%] Building C object CMakeFiles/embedded_softfloat.dir/deps/SoftFloat-3e/source/s_countLeadingZeros32.c.o
  119. [ 48%] Building C object CMakeFiles/embedded_softfloat.dir/deps/SoftFloat-3e/source/s_countLeadingZeros64.c.o
  120. [ 48%] Building C object CMakeFiles/embedded_softfloat.dir/deps/SoftFloat-3e/source/s_countLeadingZeros8.c.o
  121. [ 49%] Building C object CMakeFiles/embedded_softfloat.dir/deps/SoftFloat-3e/source/s_eq128.c.o
  122. [ 49%] Building C object CMakeFiles/embedded_softfloat.dir/deps/SoftFloat-3e/source/s_invalidF128M.c.o
  123. [ 50%] Building C object CMakeFiles/embedded_softfloat.dir/deps/SoftFloat-3e/source/s_invalidExtF80M.c.o
  124. [ 50%] Building C object CMakeFiles/embedded_softfloat.dir/deps/SoftFloat-3e/source/s_isNaNF128M.c.o
  125. [ 51%] Building C object CMakeFiles/embedded_softfloat.dir/deps/SoftFloat-3e/source/s_le128.c.o
  126. [ 51%] Building C object CMakeFiles/embedded_softfloat.dir/deps/SoftFloat-3e/source/s_lt128.c.o
  127. [ 52%] Building C object CMakeFiles/embedded_softfloat.dir/deps/SoftFloat-3e/source/s_mul128MTo256M.c.o
  128. [ 52%] Building C object CMakeFiles/embedded_softfloat.dir/deps/SoftFloat-3e/source/s_mul64To128M.c.o
  129. [ 53%] Building C object CMakeFiles/embedded_softfloat.dir/deps/SoftFloat-3e/source/s_mulAddF128M.c.o
  130. [ 53%] Building C object CMakeFiles/embedded_softfloat.dir/deps/SoftFloat-3e/source/s_mulAddF16.c.o
  131. [ 54%] Building C object CMakeFiles/embedded_softfloat.dir/deps/SoftFloat-3e/source/s_mulAddF32.c.o
  132. [ 54%] Building C object CMakeFiles/embedded_softfloat.dir/deps/SoftFloat-3e/source/s_mulAddF64.c.o
  133. [ 55%] Building C object CMakeFiles/embedded_softfloat.dir/deps/SoftFloat-3e/source/s_negXM.c.o
  134. [ 55%] Building C object CMakeFiles/embedded_softfloat.dir/deps/SoftFloat-3e/source/s_normExtF80SigM.c.o
  135. [ 56%] Building C object CMakeFiles/embedded_softfloat.dir/deps/SoftFloat-3e/source/s_normRoundPackMToF128M.c.o
  136. [ 56%] Building C object CMakeFiles/embedded_softfloat.dir/deps/SoftFloat-3e/source/s_normRoundPackMToExtF80M.c.o
  137. [ 57%] Building C object CMakeFiles/embedded_softfloat.dir/deps/SoftFloat-3e/source/s_normRoundPackToF16.c.o
  138. [ 57%] Building C object CMakeFiles/embedded_softfloat.dir/deps/SoftFloat-3e/source/s_normRoundPackToF32.c.o
  139. [ 58%] Building C object CMakeFiles/embedded_softfloat.dir/deps/SoftFloat-3e/source/s_normRoundPackToF64.c.o
  140. [ 58%] Building C object CMakeFiles/embedded_softfloat.dir/deps/SoftFloat-3e/source/s_normSubnormalF128SigM.c.o
  141. [ 59%] Building C object CMakeFiles/embedded_softfloat.dir/deps/SoftFloat-3e/source/s_normSubnormalF16Sig.c.o
  142. [ 60%] Building C object CMakeFiles/embedded_softfloat.dir/deps/SoftFloat-3e/source/s_normSubnormalF32Sig.c.o
  143. [ 60%] Building C object CMakeFiles/embedded_softfloat.dir/deps/SoftFloat-3e/source/s_normSubnormalF64Sig.c.o
  144. [ 61%] Building C object CMakeFiles/embedded_softfloat.dir/deps/SoftFloat-3e/source/s_remStepMBy32.c.o
  145. [ 61%] Building C object CMakeFiles/embedded_softfloat.dir/deps/SoftFloat-3e/source/s_roundMToI64.c.o
  146. [ 62%] Building C object CMakeFiles/embedded_softfloat.dir/deps/SoftFloat-3e/source/s_roundMToUI64.c.o
  147. [ 62%] Building C object CMakeFiles/embedded_softfloat.dir/deps/SoftFloat-3e/source/s_roundPackMToExtF80M.c.o
  148. [ 63%] Building C object CMakeFiles/embedded_softfloat.dir/deps/SoftFloat-3e/source/s_roundPackMToF128M.c.o
  149. [ 63%] Building C object CMakeFiles/embedded_softfloat.dir/deps/SoftFloat-3e/source/s_roundPackToF16.c.o
  150. [ 64%] Building C object CMakeFiles/embedded_softfloat.dir/deps/SoftFloat-3e/source/s_roundPackToF32.c.o
  151. [ 64%] Building C object CMakeFiles/embedded_softfloat.dir/deps/SoftFloat-3e/source/s_roundPackToF64.c.o
  152. [ 65%] Building C object CMakeFiles/embedded_softfloat.dir/deps/SoftFloat-3e/source/s_roundToI32.c.o
  153. [ 65%] Building C object CMakeFiles/embedded_softfloat.dir/deps/SoftFloat-3e/source/s_roundToI64.c.o
  154. [ 66%] Building C object CMakeFiles/embedded_softfloat.dir/deps/SoftFloat-3e/source/s_roundToUI32.c.o
  155. [ 66%] Building C object CMakeFiles/embedded_softfloat.dir/deps/SoftFloat-3e/source/s_roundToUI64.c.o
  156. [ 67%] Building C object CMakeFiles/embedded_softfloat.dir/deps/SoftFloat-3e/source/s_shiftLeftM.c.o
  157. [ 67%] Building C object CMakeFiles/embedded_softfloat.dir/deps/SoftFloat-3e/source/s_shiftNormSigF128M.c.o
  158. [ 68%] Building C object CMakeFiles/embedded_softfloat.dir/deps/SoftFloat-3e/source/s_shiftRightJam256M.c.o
  159. [ 68%] Building C object CMakeFiles/embedded_softfloat.dir/deps/SoftFloat-3e/source/s_shiftRightJam32.c.o
  160. [ 69%] Building C object CMakeFiles/embedded_softfloat.dir/deps/SoftFloat-3e/source/s_shiftRightJam64.c.o
  161. [ 69%] Building C object CMakeFiles/embedded_softfloat.dir/deps/SoftFloat-3e/source/s_shiftRightJamM.c.o
  162. [ 70%] Building C object CMakeFiles/embedded_softfloat.dir/deps/SoftFloat-3e/source/s_shiftRightM.c.o
  163. [ 70%] Building C object CMakeFiles/embedded_softfloat.dir/deps/SoftFloat-3e/source/s_shortShiftLeft64To96M.c.o
  164. [ 71%] Building C object CMakeFiles/embedded_softfloat.dir/deps/SoftFloat-3e/source/s_shortShiftLeftM.c.o
  165. [ 71%] Building C object CMakeFiles/embedded_softfloat.dir/deps/SoftFloat-3e/source/s_shortShiftRightExtendM.c.o
  166. [ 72%] Building C object CMakeFiles/embedded_softfloat.dir/deps/SoftFloat-3e/source/s_shortShiftRightJam64.c.o
  167. [ 72%] Building C object CMakeFiles/embedded_softfloat.dir/deps/SoftFloat-3e/source/s_shortShiftRightJamM.c.o
  168. [ 73%] Building C object CMakeFiles/embedded_softfloat.dir/deps/SoftFloat-3e/source/s_shortShiftRightM.c.o
  169. [ 73%] Building C object CMakeFiles/embedded_softfloat.dir/deps/SoftFloat-3e/source/s_sub1XM.c.o
  170. [ 74%] Building C object CMakeFiles/embedded_softfloat.dir/deps/SoftFloat-3e/source/s_sub256M.c.o
  171. [ 74%] Building C object CMakeFiles/embedded_softfloat.dir/deps/SoftFloat-3e/source/s_subM.c.o
  172. [ 75%] Building C object CMakeFiles/embedded_softfloat.dir/deps/SoftFloat-3e/source/s_subMagsF16.c.o
  173. [ 75%] Building C object CMakeFiles/embedded_softfloat.dir/deps/SoftFloat-3e/source/s_subMagsF32.c.o
  174. [ 76%] Building C object CMakeFiles/embedded_softfloat.dir/deps/SoftFloat-3e/source/s_subMagsF64.c.o
  175. [ 76%] Building C object CMakeFiles/embedded_softfloat.dir/deps/SoftFloat-3e/source/s_tryPropagateNaNF128M.c.o
  176. [ 77%] Building C object CMakeFiles/embedded_softfloat.dir/deps/SoftFloat-3e/source/s_tryPropagateNaNExtF80M.c.o
  177. [ 77%] Building C object CMakeFiles/embedded_softfloat.dir/deps/SoftFloat-3e/source/f16_mulAdd.c.o
  178. [ 78%] Building C object CMakeFiles/embedded_softfloat.dir/deps/SoftFloat-3e/source/softfloat_state.c.o
  179. [ 78%] Building C object CMakeFiles/embedded_softfloat.dir/deps/SoftFloat-3e/source/ui32_to_f128M.c.o
  180. [ 79%] Building C object CMakeFiles/embedded_softfloat.dir/deps/SoftFloat-3e/source/ui64_to_f128M.c.o
  181. [ 80%] Building C object CMakeFiles/embedded_softfloat.dir/deps/SoftFloat-3e/source/ui32_to_extF80M.c.o
  182. [ 80%] Building C object CMakeFiles/embedded_softfloat.dir/deps/SoftFloat-3e/source/ui64_to_extF80M.c.o
  183. [ 81%] Linking C static library zigcpp/libembedded_softfloat.a
  184. [ 81%] Built target embedded_softfloat
  185. [ 81%] Building CXX object CMakeFiles/zigcpp.dir/src/zig_llvm.cpp.o
  186. [ 82%] Building CXX object CMakeFiles/zigcpp.dir/src/zig_llvm-ar.cpp.o
  187. [ 82%] Building CXX object CMakeFiles/zigcpp.dir/src/zig_clang.cpp.o
  188. [ 83%] Building CXX object CMakeFiles/zigcpp.dir/src/zig_clang_driver.cpp.o
  189. [ 83%] Building CXX object CMakeFiles/zigcpp.dir/src/zig_clang_cc1_main.cpp.o
  190. [ 84%] Building CXX object CMakeFiles/zigcpp.dir/src/zig_clang_cc1as_main.cpp.o
  191. [ 84%] Building CXX object CMakeFiles/zigcpp.dir/src/windows_sdk.cpp.o
  192. [ 85%] Linking CXX static library zigcpp/libzigcpp.a
  193. [ 85%] Built target zigcpp
  194. [ 85%] Building C object CMakeFiles/opt_c_util.dir/src/stage1/parse_f128.c.o
  195. [ 86%] Linking C static library zigcpp/libopt_c_util.a
  196. [ 86%] Built target opt_c_util
  197. [ 86%] Building CXX object CMakeFiles/zigstage1.dir/src/stage1/analyze.cpp.o
  198. [ 87%] Building CXX object CMakeFiles/zigstage1.dir/src/stage1/astgen.cpp.o
  199. [ 87%] Building CXX object CMakeFiles/zigstage1.dir/src/stage1/bigfloat.cpp.o
  200. [ 88%] Building CXX object CMakeFiles/zigstage1.dir/src/stage1/bigint.cpp.o
  201. [ 88%] Building CXX object CMakeFiles/zigstage1.dir/src/stage1/buffer.cpp.o
  202. [ 89%] Building CXX object CMakeFiles/zigstage1.dir/src/stage1/codegen.cpp.o
  203. [ 89%] Building CXX object CMakeFiles/zigstage1.dir/src/stage1/errmsg.cpp.o
  204. [ 90%] Building CXX object CMakeFiles/zigstage1.dir/src/stage1/error.cpp.o
  205. [ 90%] Building CXX object CMakeFiles/zigstage1.dir/src/stage1/heap.cpp.o
  206. [ 91%] Building CXX object CMakeFiles/zigstage1.dir/src/stage1/ir.cpp.o
  207. [ 91%] Building CXX object CMakeFiles/zigstage1.dir/src/stage1/ir_print.cpp.o
  208. [ 92%] Building CXX object CMakeFiles/zigstage1.dir/src/stage1/mem.cpp.o
  209. [ 92%] Building CXX object CMakeFiles/zigstage1.dir/src/stage1/os.cpp.o
  210. [ 93%] Building CXX object CMakeFiles/zigstage1.dir/src/stage1/parser.cpp.o
  211. [ 93%] Building CXX object CMakeFiles/zigstage1.dir/src/stage1/range_set.cpp.o
  212. [ 94%] Building CXX object CMakeFiles/zigstage1.dir/src/stage1/softfloat_ext.cpp.o
  213. [ 94%] Building CXX object CMakeFiles/zigstage1.dir/src/stage1/stage1.cpp.o
  214. [ 95%] Building CXX object CMakeFiles/zigstage1.dir/src/stage1/target.cpp.o
  215. [ 95%] Building CXX object CMakeFiles/zigstage1.dir/src/stage1/tokenizer.cpp.o
  216. [ 96%] Building CXX object CMakeFiles/zigstage1.dir/src/stage1/util.cpp.o
  217. [ 97%] Linking CXX static library zigcpp/libzigstage1.a
  218. [ 97%] Built target zigstage1
  219. [ 98%] Building CXX object CMakeFiles/zig1.dir/src/stage1/zig0.cpp.o
  220. [ 98%] Linking CXX executable zig1
  221. [ 98%] Built target zig1
  222. [ 99%] Building stage2 object /home/user/data/pools/pool00/CVS-Archive/ZIG/zig/build/zig2.o
  223. [ 99%] Building CXX object CMakeFiles/zig2.dir/src/stage1/empty.cpp.o
  224. [100%] Linking CXX executable zig2
  225. [100%] Built target zig2
  226. [100%] Building stage3
  227. AST Lowering [61] pdb.zig... AST Lowering [70] rand/Pcg.zig... AST Lowering [82] os/posix_spawn.zig... AST Lowering [93] mem/Allocator.zig... AST Lowering [98] os/windows/win32error.zig... AST Lowering [122] math/complex/abs.zig... AST Lowering [132] math/asinh.zig... AST Lowering [134] math/log10.zig... AST Lowering [141] math/atan2.zig... AST Lowering [150] math/scalbn.zig... AST Lowering [155] math/copysign.zig... AST Lowering [168] json.zig... AST Lowering [174] os/uefi/protocols.zig... AST Lowering [181] os/linux/errno/generic.zig... AST Lowering [186] io/test.zig... AST Lowering [201] fs/test.zig... AST Lowering [216] io/fixed_buffer_stream.zig... AST Lowering [227] os/uefi/protocols/ip6_protocol.zig... AST Lowering [245] os/uefi/protocols/rng_protocol.zig... AST Lowering [257] os/linux/seccomp.zig... AST Lowering [266] os/linux/riscv64.zig... AST Lowering [274] os/linux/bpf/btf.zig... AST Lowering [284] dwarf.zig... AST Lowering [289] fmt/parse_float.zig... AST Lowering [292] event/rwlocked.zig... AST Lowering [297] event/locked.zig... AST Lowering [307] crypto/ecdsa.zig... AST Lowering [319] crypto/bcrypt.zig... AST Lowering [329] crypto/argon2.zig... AST Lowering [336] crypto/sha2.zig... AST Lowering [344] crypto/pcurves/tests/secp256k1.zig... AST Lowering [356] crypto/pcurves/p384/p384_scalar_64.zig... AST Lowering [365] crypto/pcurves/p256/p256_64.zig... AST Lowering [375] crypto/chacha20.zig... AST Lowering [382] compress/deflate/bits_utils.zig... AST Lowering [390] coff.zig... AST Lowering [397] c/minix.zig... AST Lowering [403] fmt/errol/lookup.zig... AST Lowering [412] build/RunStep.zig... AST Lowering [419] c/linux.zig... AST Lowering [421] bit_set.zig... AST Lowering [427] Thread.zig... AST Lowering [433] c/darwin/x86_64.zig... AST Lowering [436] atomic/stack.zig... AST Lowering [442] target/s390x.zig... AST Lowering [443] target/spirv.zig... AST Lowering [449] target/mips.zig... AST Lowering [453] target/avr.zig... AST Lowering [455] target/amdgpu.zig... AST Lowering [456] target/arc.zig... AST Lowering [468] Thread/Futex.zig... Semantic Analysis... comptime_0... Semantic Analysis [391] init... Semantic Analysis [645] hash... Semantic Analysis [916] getObjectFormat... Semantic Analysis [1066] OpenError... Semantic Analysis [1232] ensureUnusedCapacity... Semantic Analysis [1378] ensureTotalCapacity... Semantic Analysis [1478] getOrPutContextAdapted... Semantic Analysis [1527] installArtifact... Semantic Analysis [1607] Semantic Analysis [1632] get... Semantic Analysis [1636] get... Semantic Analysis [1641] Semantic Analysis [1737] lenAsc... Semantic Analysis [1739] lenAsc... Semantic Analysis [1742] get... Semantic Analysis [1844] eql... Semantic Analysis [1959] read... Semantic Analysis [2095] Semantic Analysis [2123] Semantic Analysis [2151] Semantic Analysis [2167] Semantic Analysis [2194] native_endian... Semantic Analysis [2227] get... Semantic Analysis [2233] get... Semantic Analysis [2404] atmega8a... Semantic Analysis [2550] hexagonv67t... Semantic Analysis [2615] arch11... Semantic Analysis [2655] cortex_a65ae... Semantic Analysis [2737] a2... Semantic Analysis [2810] supersparc... Semantic Analysis [2840] cascadelake... Semantic Analysis [2866] lakemont... Semantic Analysis [2890] tremont... Semantic Analysis [2939] addInstallArtifact... Semantic Analysis [2981] addOne... Semantic Analysis [2998] add... Semantic Analysis [3088] close... Semantic Analysis [3142] math... Semantic Analysis [3157] pread... Semantic Analysis [3184] getOrPutContext... Semantic Analysis [3229] io... Semantic Analysis [3278] format... Semantic Analysis [3306] addSystemCommand... Semantic Analysis [3371] mum... Semantic Analysis [3395] getOrPutContextAdapted... Semantic Analysis [3479] writeFileAll... Semantic Analysis [3529] truncateFile... Semantic Analysis [3561] ensureTotalCapacityPrecise... Semantic Analysis [3573] NONBLOCK... Semantic Analysis [3624] usize_bits... Semantic Analysis [3627] growIfNeeded... Semantic Analysis [3641] iterator... Semantic Analysis [3706] getOutputPdbSource... Semantic Analysis [3707] debug... Semantic Analysis [3740] deallocate... Semantic Analysis [3756] mem... Semantic Analysis [3821] keywords... Semantic Analysis [3828] printInvocation... Semantic Analysis [3841] slot_tombstone... Semantic Analysis [3846] F_OK... Semantic Analysis [3881] mem... Semantic Analysis [3901] deallocate... Semantic Analysis [3911] math... Semantic Analysis [3913] ensureTotalCapacityPrecise... Semantic Analysis [3931] stripOptionalOrErrorUnionSpec... Semantic Analysis [3936] LLVM Emit Object... LLVM Emit Object... LLD Link... LLD Link... Compile C Objects [141/157] s_commonNaNToF32UI.c... Compile C Objects [16/21] analyze.cpp... AST Lowering [420] Autodoc.zig... AST Lowering [434] Liveness.zig... AST Lowering [456] tracy.zig... AST Lowering [525] arch/arm/CodeGen.zig... AST Lowering [553] link/strtab.zig... AST Lowering [574] link/tapi/parse.zig... AST Lowering [576] RangeSet.zig... Semantic Analysis [267] destroy... Semantic Analysis [858] assert... Semantic Analysis [1077] alloc... Semantic Analysis [1155] contains... Semantic Analysis [1182] appendAssumeCapacity... Semantic Analysis [1373] clangMain... Semantic Analysis [1739] AT... Semantic Analysis [1828] Semantic Analysis [1849] Semantic Analysis [1870] Compile C Objects [19/21] analyze.cpp... Semantic Analysis [1912] print... Semantic Analysis [2018] allocatedSlice... Semantic Analysis [2052] Shuffle... Semantic Analysis [2083] ContainerInitDot... Semantic Analysis [2090] allocatedSlice... Semantic Analysis [2189] exit... Semantic Analysis [2331] m... Semantic Analysis [2335] jspd1... Semantic Analysis [2344] endsWith... Semantic Analysis [2430] resolve... Semantic Analysis [2561] Dylib... Semantic Analysis [2824] getSectionMaxAlignment... Semantic Analysis [2907] createEmpty... Semantic Analysis [3165] openPath... Semantic Analysis [3256] openPath... Semantic Analysis [3371] zigTriple... Semantic Analysis [3527] finalizeNewArena... Semantic Analysis [3698] directEnumArrayDefault... Semantic Analysis [3837] deinit... Semantic Analysis [4076] parseInputFiles... Semantic Analysis [4223] resolveSymbolsInArchives... Semantic Analysis [4358] popOrNull... Semantic Analysis [4442] writeByteNTimes... Semantic Analysis [4554] emitDebugSection... Semantic Analysis [4622] iterator... Semantic Analysis [4723] trace... Semantic Analysis [4778] build_options... Semantic Analysis [4930] Cache... Semantic Analysis [5101] insertAllEntriesIntoNewHeader... Semantic Analysis [5175] allocateSpecialSymbols... Semantic Analysis [5285] BIND_OPCODE_SET_DYLIB_ORDINAL_IMM... Semantic Analysis [5439] deinit... Semantic Analysis [5498] writeDylinkerLC... Semantic Analysis [5619] writeSegmentHeaders... Semantic Analysis [5653] get_libc_crt_file... Semantic Analysis [5705] linkWithLLD... Semantic Analysis [5712] init... Semantic Analysis [5780] Semantic Analysis [5863] mark... Semantic Analysis [5909] linkWithLLD... Semantic Analysis [5931] errorFlags... Semantic Analysis [6052] findLineColumn... Semantic Analysis [6137] allocatedSlice... Semantic Analysis [6180] generate... Semantic Analysis [6267] usage_ast_check... Semantic Analysis [6361] ANY... Semantic Analysis [6425] ensureTotalCapacityPrecise... Semantic Analysis [6442] indexes... Semantic Analysis [6529] getSlotByKey... Semantic Analysis [6590] addOneAssumeCapacity... Semantic Analysis [6611] page_size... Semantic Analysis [6726] setColor... Semantic Analysis [6800] lenAsc... Semantic Analysis [6822] lenAsc... Semantic Analysis [6827] get... Semantic Analysis [6999] atmega8a... Semantic Analysis [7146] hexagonv68... Semantic Analysis [7210] arch11... Semantic Analysis [7267] cortex_a710... Semantic Analysis [7335] apple_s5... Semantic Analysis [7412] Semantic Analysis [7483] ma2080... Semantic Analysis [7532] btver2... Semantic Analysis [7557] k6_3... Semantic Analysis [7584] skylake_avx512... Semantic Analysis [7624] orderedRemoveAtContext... Semantic Analysis [7680] getrlimit... Semantic Analysis [7965] plan9Ext... Semantic Analysis [8162] getIndexWithHeaderGeneric... Semantic Analysis [8262] updateOsVersionRange... Semantic Analysis [8365] processOutdatedAndDeletedDecls... Semantic Analysis [8445] buildSharedLib... Semantic Analysis [8493] end... Semantic Analysis [8536] end... Semantic Analysis [8568] end... Semantic Analysis [8611] count... Semantic Analysis [8686] addOneAssumeCapacity... Semantic Analysis [8811] resolveLlvmFunction... Semantic Analysis [8978] shrinkTextBlock... Semantic Analysis [9008] updateDeclExports... Semantic Analysis [9112] capacityInBytes... Semantic Analysis [9175] updateDeclExports... Semantic Analysis [9249] sizes... Semantic Analysis [9350] UnNode... Semantic Analysis [9358] write... Semantic Analysis [9384] builtin_types... Semantic Analysis [9595] getContext... Semantic Analysis [9663] Semantic Analysis [9744] base_tag... Semantic Analysis [9801] addOneAssumeCapacity... Semantic Analysis [9824] insertAllEntriesIntoNewHeaderGeneric... Semantic Analysis [9854] capacity... Semantic Analysis [9960] Field... Semantic Analysis [10004] writeOperand... Semantic Analysis [10022] operandsSize... Semantic Analysis [10049] airArg... Semantic Analysis [10074] resolveSourceFileName... Semantic Analysis [10187] log... Semantic Analysis [10246] addOneAssumeCapacity... Semantic Analysis [10303] write... Semantic Analysis [10350] ref8... Semantic Analysis [10405] symlinkat... Semantic Analysis [10447] discard... Semantic Analysis [10473] addOne... Semantic Analysis [10574] toSpan... Semantic Analysis [10592] fullIf... Semantic Analysis [10633] AstGen... Semantic Analysis [10699] LdInfo... Semantic Analysis [10723] Writer... Semantic Analysis [10780] openat64... Semantic Analysis [10819] Semantic Analysis [10828] isThisDeclarationADefinition... Semantic Analysis [11018] qualTypeIsBoolean... Semantic Analysis [11071] Semantic Analysis [11075] Semantic Analysis [11106] Semantic Analysis [11164] getOrPutContext... Semantic Analysis [11188] exeFileExtSimple... Semantic Analysis [11205] inf_loop_env_key... Semantic Analysis [11219] lessThan... Semantic Analysis [11253] destroy... Semantic Analysis [11366] autoHash... Semantic Analysis [11397] ensureTotalCapacityPrecise... Semantic Analysis [11418] deinit... Semantic Analysis [11467] Semantic Analysis [11503] reportRetryableCObjectError... Semantic Analysis [11624] typeHasRuntimeBits... Semantic Analysis [11641] print... Semantic Analysis [11658] musl... Semantic Analysis [11691] shelfCount... Semantic Analysis [11735] mem... Semantic Analysis [11792] ss... Semantic Analysis [11868] checkedHash... Semantic Analysis [11917] addOneAssumeCapacity... Semantic Analysis [11976] checkedEql... Semantic Analysis [12018] getOrPutAssumeCapacityContext... Semantic Analysis [12029] getSlotByKey... Semantic Analysis [12056] declIteratorInner... Semantic Analysis [12077] keywords... Semantic Analysis [12115] resolveTypeFields... Semantic Analysis [12144] getLayout... Semantic Analysis [12171] getSlotByKey... Semantic Analysis [12194] deinit... Semantic Analysis [12227] getPtrAdapted... Semantic Analysis [12262] ensureTotalCapacity... Semantic Analysis [12281] sizes... Semantic Analysis [12325] insertAllEntriesIntoNewHeaderGeneric... Semantic Analysis [12343] ref_start_index... Semantic Analysis [12350] ensureTotalCapacityPrecise... Semantic Analysis [12366] items... Semantic Analysis [12446] ensureTotalCapacity... Semantic Analysis [12476] ensureTotalCapacity... Semantic Analysis [12513] getAdapted... Semantic Analysis [12528] getAdapted... Semantic Analysis [12567] getAdapted... Semantic Analysis [12583] checkedHash... Semantic Analysis [12606] getOrPutContext... Semantic Analysis [12637] Semantic Analysis [12668] sendfile... Semantic Analysis [12771] ref_start_index... Semantic Analysis [12811] writeElemTypeIndex... Semantic Analysis [12875] writeUnreachable... Semantic Analysis [12910] writeBin... Semantic Analysis [12945] isatty... Semantic Analysis [12967] sizes... Semantic Analysis [13004] transCreateNodeNumber... Semantic Analysis [13057] deinit... Semantic Analysis [13103] containsContext... Semantic Analysis [13148] deallocate... Semantic Analysis [13174] deinit... Semantic Analysis [13259] minimal_capacity... Semantic Analysis [13321] ok... Semantic Analysis [13361] readableSliceMut... Semantic Analysis [13438] Value... Semantic Analysis [13569] GetOrPutResult... Semantic Analysis [13634] shallowElemType... Semantic Analysis [13656] ensureTotalCapacityContext... Semantic Analysis [13669] sizes... Semantic Analysis [13674] comptime_0... Semantic Analysis [13681] fetchRemoveAdapted... Semantic Analysis [13712] iterateStructOffsets... Semantic Analysis [13767] createStringAttribute... Semantic Analysis [13803] capacity... Semantic Analysis [13839] LazySrcLoc... Semantic Analysis [13861] slicePtr... Semantic Analysis [13887] base_tag... Semantic Analysis [13916] getOrPutContext... Semantic Analysis [13933] getOrPutContextAdapted... Semantic Analysis [13975] jsonStringify... Semantic Analysis [13976] jsonStringify... Semantic Analysis [14002] getSlotByKey... Semantic Analysis [14084] initCapacity... Semantic Analysis [14125] append... Semantic Analysis [14136] isFree... Semantic Analysis [14164] getOrPutContextAdapted... Semantic Analysis [14189] getIndex... Semantic Analysis [14223]writeExtendedUnion... Semantic Analysis [14228] containsContext... Semantic Analysis [14252] ensureTotalCapacity... Semantic Analysis [14304] ensureTotalCapacityPrecise... Semantic Analysis [14342] containsAdapted... Semantic Analysis [14378] ensureTotalCapacityPrecise... Semantic Analysis [14396] removeByKey... Semantic Analysis [14432] parsePayload... Semantic Analysis [14459] parsePtrModifiers... Semantic Analysis [14490] unstacked_top... Semantic Analysis [14568] structInitExpr... Semantic Analysis [14592] callbackC... Semantic Analysis [14600] src... Semantic Analysis [14603] ensureTotalCapacity... Semantic Analysis [14621] stripOptionalOrErrorUnionSpec... Semantic Analysis [14660] transBinaryOperator... Semantic Analysis [14736] getCanonicalType... Semantic Analysis [14770] ensureTotalCapacityPrecise... Semantic Analysis [14779] writeNoIndent... Semantic Analysis [14829] removeFromIndexByIndexGeneric... Semantic Analysis [14859] header... Semantic Analysis [14874] getIndex... Semantic Analysis [14898] getSlotByIndex... Semantic Analysis [14926] fetchRemoveByKey... Semantic Analysis [15104] tan... Semantic Analysis [15225] getBuiltin... Semantic Analysis [15375] buildNSWAdd... Semantic Analysis [15504] airMulAdd... Semantic Analysis [15522] buildFNeg... Semantic Analysis [15632] categorizeOperand... Semantic Analysis [15679] compilerRtIntAbbrev... Semantic Analysis [15739] airPrefetch... Semantic Analysis [15804] airDbgInlineEnd... Semantic Analysis [15875] airNeg... Semantic Analysis [15902] airLoad... Semantic Analysis [15938] airTryPtr... Semantic Analysis [15966] deinit... Semantic Analysis [16051] failWithInvalidComptimeFieldStore... Semantic Analysis [16074] coerceArrayLike... Semantic Analysis [16090] items... Semantic Analysis [16099] getOrPutAssumeCapacityAdapted... Semantic Analysis [16106] getOrPutAssumeCapacityAdapted... Semantic Analysis [16107] HashContext... Semantic Analysis [16155] BigIntMutable... Semantic Analysis [16195] growIfNeeded... Semantic Analysis [16244] getContext... Semantic Analysis [16247] reserved_idents... Semantic Analysis [16248] Semantic Analysis [16277] fetchRemoveContext... Semantic Analysis [16322] ensureTotalCapacityPrecise... Semantic Analysis [16343] maxInt... Semantic Analysis [16372] slot_free... Semantic Analysis [16414] checkedEql... Semantic Analysis [16434] Log2Word... Semantic Analysis [16443] containsAdapted... Semantic Analysis [16471] ensureTotalCapacityPrecise... Semantic Analysis [16539] ensureTotalCapacityPrecise... Semantic Analysis [16561] grow... Semantic Analysis [16574] getOrPutAssumeCapacityAdapted... Semantic Analysis [16598] allocatedBytes... Semantic Analysis [16634] align_rl... Semantic Analysis [16652] addInt... Semantic Analysis [16697] reachableExprComptime... Semantic Analysis [16711] Semantic Analysis [16744] labeledBlockExpr... Semantic Analysis [16754] arrayInitExprInner... Semantic Analysis [16793] ensureTotalCapacityPrecise... Semantic Analysis [16803] ZigClangAPInt_getLimitedValue... Semantic Analysis [16893] getCond... Semantic Analysis [17001] getOrPutContextAdapted... Semantic Analysis [17008] resetLine... Semantic Analysis [17036] slot_free... Semantic Analysis [17047] grow... Semantic Analysis [17055] grow... Semantic Analysis [17070] containsAdapted... Semantic Analysis [17073] containsAdapted... Semantic Analysis [17074] setEmpty... Semantic Analysis [17091] getSlotByKey... Semantic Analysis [17106] ensureTotalCapacityPrecise... Semantic Analysis [17144] addPtrElemPtr... Semantic Analysis [17169] finishCondBr... Semantic Analysis [17200] checkIntType... Semantic Analysis [17215] failWithExpectedOptionalType... Semantic Analysis [17284] resolveBlockBody... Semantic Analysis [17297] makeBool... Semantic Analysis [17309] log2IntType... Semantic Analysis [17325] one... Semantic Analysis [17358] add... Semantic Analysis [17388] failWithStructInitNotSupported... Semantic Analysis [17399] log10Scalar... Semantic Analysis [17417] intMod... Semantic Analysis [17436] shiftLeft... Semantic Analysis [17463] realpathAlloc... Semantic Analysis [17485] checkErrorSetType... Semantic Analysis [17507] getOrPut... Semantic Analysis [17527] putNoClobber... Semantic Analysis [17528] getContext... Semantic Analysis [17544] fieldValue... Semantic Analysis [17571] keyIterator... Semantic Analysis [17614] writeDbgVar... Semantic Analysis [17798] deinit... Semantic Analysis [18007] deinit... Semantic Analysis [18142] deinit... Semantic Analysis [18264] mirAddSubtractImmediate... Semantic Analysis [18357] mirNop... Semantic Analysis [18409] getParamBody... Semantic Analysis [18426] setCurrentDebugLocation... Semantic Analysis [18438] putNoClobberContext... Semantic Analysis [18440] putNoClobberContext... Semantic Analysis [18470] typePtrOrOptionalPtrTy... Semantic Analysis [18476] getIndexContext... Semantic Analysis [18483] getContext... Semantic Analysis [18498] checkedHash... Semantic Analysis [18509] slot_free... Semantic Analysis [18573] grow... Semantic Analysis [18603] getOrPutAssumeCapacityContext... Semantic Analysis [18645] isTombstone... Semantic Analysis [18690] insertAllEntriesIntoNewHeader... Semantic Analysis [18697] slot_free... Semantic Analysis [18703] slot_tombstone... Semantic Analysis [18710] tombstone... Semantic Analysis [18725] slot_tombstone... Semantic Analysis [18730] getSlotByKey... Semantic Analysis [18744] hashPointer... Semantic Analysis [18746] writeDoubleWord... Semantic Analysis [18768] header... Semantic Analysis [18787] Semantic Analysis [18816] slot_free... Semantic Analysis [18819] minimal_capacity... Semantic Analysis [18825] isTombstone... Semantic Analysis [18836] ensureTotalCapacityPrecise... Semantic Analysis [18848] fetchRemoveContext... Semantic Analysis [18864] tunnelThroughClosure... Semantic Analysis [18873] utf8Decode... Semantic Analysis [18881] addAllocExtended... Semantic Analysis [18893] std... Semantic Analysis [18900] minimal_capacity... Semantic Analysis [18937] getRHS... Semantic Analysis [18968] values... Semantic Analysis [18984] isContainerField... Semantic Analysis [18987] slot_tombstone... Semantic Analysis [18995] minimal_capacity... Semantic Analysis [19003] fetchRemoveByKey... Semantic Analysis [19023] sort... Semantic Analysis [19032] instantiateGenericCall... Semantic Analysis [19059] count... Semantic Analysis [19106] analyzePtrArithmetic... Semantic Analysis [19122] panicSentinelMismatch... Semantic Analysis [19146] ensureAddScalarCapacity... Semantic Analysis [19161] getOrPutContext... Semantic Analysis [19186] mulAddScalar... Semantic Analysis [19192] llshl... Semantic Analysis [19204] ensureTotalCapacity... Semantic Analysis [19211] TypeSet... Semantic Analysis [19233] isArrayOrVector... Semantic Analysis [19245] writeInstIndex... Semantic Analysis [19299] insertAllEntriesIntoNewHeader... Semantic Analysis [19374] airTrunc... Semantic Analysis [19446] airStructFieldPtrIndex... Semantic Analysis [19506] deinit... Semantic Analysis [19605] binOpRegister... Semantic Analysis [19651] airIntCast... Semantic Analysis [19690] airSliceElemVal... Semantic Analysis [19763] mirMembar... Semantic Analysis [19931] allocatedSlice... Semantic Analysis [20004] airShlSat... Semantic Analysis [20040] airArg... Semantic Analysis [20096] airLoad... Semantic Analysis [20144] airAtomicStore... Semantic Analysis [20178] isSet... Semantic Analysis [20264] ensureProcessDeathCapacity... Semantic Analysis [20320] airShlWithOverflow... Semantic Analysis [20368] airIsNonNull... Semantic Analysis [20419] airMulAdd... Semantic Analysis [20461] indexOfRegIntoTracked... Semantic Analysis [20534] Field... Semantic Analysis [20556] containsContext... Semantic Analysis [20577] containsContext... Semantic Analysis [20589] ensureUnusedCapacityContext... Semantic Analysis [20621] gcdLehmer... Semantic Analysis [20639] panicking... Semantic Analysis [20663] slot_free... Semantic Analysis [20678] minimal_capacity... Semantic Analysis [20712] grow... Semantic Analysis [20727] getIndexAdapted... Semantic Analysis [20734] removeByKeyGeneric... Semantic Analysis [20777] allocate... Semantic Analysis [20817] ensureTotalCapacityPrecise... Semantic Analysis [20827] minimal_capacity... Semantic Analysis [20842] containsContext... Semantic Analysis [20844] tombstone... Semantic Analysis [20870] getAdapted... Semantic Analysis [20872] removeSlot... Semantic Analysis [20874] slot_tombstone... Semantic Analysis [20895] fetchRemoveAdapted... Semantic Analysis [20906] parse... Semantic Analysis [20919] checkedHash... Semantic Analysis [20921] minimal_capacity... Semantic Analysis [20927] math... Semantic Analysis [20935] allocatedSlice... Semantic Analysis [20943] items... Semantic Analysis [20948] swapRemove... Semantic Analysis [20952] getSlotByIndex... Semantic Analysis [20968] GenericCallAdapter... Semantic Analysis [20984] runtimeBoolCmp... Semantic Analysis [21007] growIfNeeded... Semantic Analysis [21018] getOrPutContextAdapted... Semantic Analysis [21026] subCarry... Semantic Analysis [21031] checkedHash... Semantic Analysis [21037] getOrPutAssumeCapacityContext... Semantic Analysis [21041] getOrPutContext... Semantic Analysis [21057] removeByIndex... Semantic Analysis [21059] ensureTotalCapacity... Semantic Analysis [21091] putNoClobberContext... Semantic Analysis [21113] base_tag... Semantic Analysis [21115] rType... Semantic Analysis [21148] markRegAllocated... Semantic Analysis [21168] putContext... Semantic Analysis [21234] ImmPair... Semantic Analysis [21278] airAddSat... Semantic Analysis [21318] airArg... Semantic Analysis [21370] airIsNonErr... Semantic Analysis [21399] airClz... Semantic Analysis [21427] airSlicePtr... Semantic Analysis [21464] nop... Semantic Analysis [21508] math... Semantic Analysis [21535] isRegLocked... Semantic Analysis [21560] addOne... Semantic Analysis [21567] indexOfReg... Semantic Analysis [21603] tryAllocRegs... Semantic Analysis [21625] putNoClobberContext... Semantic Analysis [21631] getOrPutContext... Semantic Analysis [21751] putNoClobber... Semantic Analysis [21790] deinit... Semantic Analysis [21834] containsAdapted... Semantic Analysis [21858] getIndex... Semantic Analysis [21863] ensureUnusedCapacity... Semantic Analysis [21868] alloc... Semantic Analysis [21872] dumpStackTrace... Semantic Analysis [21881] containsContext... Semantic Analysis [21908] addOneAssumeCapacity... Semantic Analysis [21943] subMulLimbWithBorrow... Semantic Analysis [21964] getSlotByIndex... Semantic Analysis [21968] containsAdapted... Semantic Analysis [21972] firstIsDigit... Semantic Analysis [21981] containsAdapted... Semantic Analysis [22002] nan_f128... Semantic Analysis [22011] containsContext... Semantic Analysis [22016] minimal_capacity... Semantic Analysis [22034] sortContext... Semantic Analysis [22036] getOrPutContextAdapted... Semantic Analysis [22047] getAdapted... Semantic Analysis [22050] grow... Semantic Analysis [22071] growIfNeeded... Semantic Analysis [22080] llsubcarry... Semantic Analysis [22083] addOneAssumeCapacity... Semantic Analysis [22087] removeByKey... Semantic Analysis [22093] getOrPutContextAdapted... SemanticAnalysis [22105] remove... Semantic Analysis [22107] checkedHash... Semantic Analysis [22124] get... Semantic Analysis [22135] ensureTotalCapacityPrecise... Semantic Analysis [22147] getOrPutAssumeCapacityContext... Semantic Analysis [22172] ensureTotalCapacityPrecise... Semantic Analysis [22192] sizes... Semantic Analysis [22204] checkedEql... Semantic Analysis [22235] addOne... Semantic Analysis [22271] getVexEncoding... Semantic Analysis [22294] Value... Semantic Analysis [22303] lenAsc... Semantic Analysis [22327] getIndex... Semantic Analysis [22341] putAssumeCapacityNoClobberContext... Semantic Analysis [22348] get... Semantic Analysis [22370] header... Semantic Analysis [22405] load... Semantic Analysis [22438] isNull... Semantic Analysis [22442] structFieldPtr... Semantic Analysis [22456] getOrPut... Semantic Analysis [22476] minimal_capacity... Semantic Analysis [22485] slot_free... Semantic Analysis [22486] minimal_capacity... Semantic Analysis [22492] slot_free... Semantic Analysis [22497] print... Semantic Analysis [22507] minimal_capacity... Semantic Analysis [22520] containsContext...Semantic Analysis [22535] removeFromIndexByKey... Semantic Analysis [22551] addOneAssumeCapacity... Semantic Analysis [22553] containsAdapted... Semantic Analysis [22561] containsAdapted... Semantic Analysis [22579] containsAdapted... Semantic Analysis [22583] removeSlot... Semantic Analysis [22587] growIfNeeded... Semantic Analysis [22595] getIndex... Semantic Analysis [22603] minimal_capacity... Semantic Analysis [22613] grow... Semantic Analysis [22620] native_endian... Semantic Analysis [22622] llcmp... Semantic Analysis [22623] grow... Semantic Analysis [22626] orderedRemove... Semantic Analysis [22628] grow... Semantic Analysis [22633] remove... Semantic Analysis [22641] getSlotByKey... Semantic Analysis [22645] containsAdapted... Semantic Analysis [22667] containsAdapted... Semantic Analysis [22688] getOrPutContextAdapted... Semantic Analysis [22701] putAssumeCapacityNoClobberContext... Semantic Analysis [22711] get... Semantic Analysis [22728] containsAdapted... Semantic Analysis [22755] ensureTotalCapacity... Semantic Analysis [22767] ensureTotalCapacityPrecise... Semantic Analysis [22783]growIfNeeded... Semantic Analysis [22795] containsAdapted... Semantic Analysis [22810] growIfNeeded... Semantic Analysis [22823] getGlobalSymbol... Semantic Analysis [22833] init... Semantic Analysis [22863] grow... Semantic Analysis [22869] sliceContainsSlice... Semantic Analysis [22871] containsAdapted... Semantic Analysis [22888] containsAdapted... Semantic Analysis [22890] getSlotByKey... Semantic Analysis [22891] CHUNK_START... Semantic Analysis [22900] lessThan... Semantic Analysis [22902] grow... Semantic Analysis [22913] slot_free... Semantic Analysis [22916] containsContext... Semantic Analysis [22935] minimal_capacity... Semantic Analysis [22945] getAdapted... Semantic Analysis [22955] getIndex... Semantic Analysis [22968] containsAdapted... Semantic Analysis [22974] containsAdapted... Semantic Analysis [22989] ensureTotalCapacityPrecise... Semantic Analysis [22992] ensureTotalCapacityPrecise... Semantic Analysis [22993] lowerUnnamedConst... Semantic Analysis [23005] getIndex... Semantic Analysis [23025] getIndex... Semantic Analysis [23035] grow... Semantic Analysis [23041] getGlobalSymbol... Semantic Analysis [23046] getOrPutContextAdapted... Semantic Analysis [23071] containsAdapted... Semantic Analysis [23078] format... Semantic Analysis [23091] minimal_capacity... Semantic Analysis [23102] containsAdapted... Semantic Analysis [23118] values... Semantic Analysis [23121] removeFromIndexByKey... Semantic Analysis [23128] getIndex... Semantic Analysis [23138] getOrPutContext... Semantic Analysis [23143] minimal_capacity... Semantic Analysis [23158] minimal_capacity... Semantic Analysis [23164] values... Semantic Analysis [23165] getIndex... Semantic Analysis [23172] parseCMulExpr... Semantic Analysis [23196] items... Semantic Analysis [23197] removeSlot... Semantic Analysis [23208] getOrPutContextAdapted... Semantic Analysis [23210] removeSlot... Semantic Analysis [23214] removeSlot... Semantic Analysis [23217] items... Semantic Analysis [23220] containsAdapted... Semantic Analysis [23221] parseCCastExpr... Semantic Analysis [23226] getSlotByIndex... Semantic Analysis [23228] removeSlot... Semantic Analysis [23235] containsAdapted... Semantic Analysis [23239] slot_tombstone... Semantic Analysis [23242] parseCTypeName... Semantic Analysis [23248] getSlotByIndex... Semantic Analysis [23259] parseCSpecifierQualifierList... Semantic Analysis [23273] minimal_capacity... Semantic Analysis [23279] parseCNumericType... Semantic Analysis [23286] parseCNumLit... Semantic Analysis [23292] LLVM Emit Object... LLVM Emit Object... LLD Link... ld.lld: error: unable to find library -lLLVM-14
  228. LLD Link... error: FileNotFound
  229. /home/user/data/pools/pool00/CVS-Archive/ZIG/zig/lib/std/os.zig:2753:19: 0x2e8f5c in mkdiratZ (build)
  230. .EXIST => return error.PathAlreadyExists,
  231. ^
  232. /home/user/data/pools/pool00/CVS-Archive/ZIG/zig/lib/std/os.zig:2713:9: 0x2c721d in mkdirat (build)
  233. return mkdiratZ(dir_fd, &sub_dir_path_c, mode);
  234. ^
  235. /home/user/data/pools/pool00/CVS-Archive/ZIG/zig/lib/std/fs.zig:1361:9: 0x2c711b in makeDir (build)
  236. try os.mkdirat(self.fd, sub_path, default_new_dir_mode);
  237. ^
  238. /home/user/data/pools/pool00/CVS-Archive/ZIG/zig/lib/std/os.zig:1683:23: 0x348820 in openatZ (build)
  239. .NOENT => return error.FileNotFound,
  240. ^
  241. /home/user/data/pools/pool00/CVS-Archive/ZIG/zig/lib/std/fs.zig:1110:13: 0x32605c in openFileZ (build)
  242. try os.openatZ(self.fd, sub_path, os_flags, 0);
  243. ^
  244. /home/user/data/pools/pool00/CVS-Archive/ZIG/zig/lib/std/fs.zig:1037:9: 0x2f99de in openFile (build)
  245. return self.openFileZ(&path_c, flags);
  246. ^
  247. /home/user/data/pools/pool00/CVS-Archive/ZIG/zig/lib/std/os.zig:2753:19: 0x2e8f5c in mkdiratZ (build)
  248. .EXIST => return error.PathAlreadyExists,
  249. ^
  250. /home/user/data/pools/pool00/CVS-Archive/ZIG/zig/lib/std/os.zig:2713:9: 0x2c721d in mkdirat (build)
  251. return mkdiratZ(dir_fd, &sub_dir_path_c, mode);
  252. ^
  253. /home/user/data/pools/pool00/CVS-Archive/ZIG/zig/lib/std/fs.zig:1361:9: 0x2c711b in makeDir (build)
  254. try os.mkdirat(self.fd, sub_path, default_new_dir_mode);
  255. ^
  256. /home/user/data/pools/pool00/CVS-Archive/ZIG/zig/lib/std/build.zig:2116:13: 0x380072 in runPkgConfig (build)
  257. return error.PackageNotFound;
  258. ^
  259. /home/user/data/pools/pool00/CVS-Archive/ZIG/zig/lib/std/build.zig:2116:13: 0x380072 in runPkgConfig (build)
  260. return error.PackageNotFound;
  261. ^
  262. /home/user/data/pools/pool00/CVS-Archive/ZIG/zig/lib/std/os.zig:1683:23: 0x348820 in openatZ (build)
  263. .NOENT => return error.FileNotFound,
  264. ^
  265. /home/user/data/pools/pool00/CVS-Archive/ZIG/zig/lib/std/fs.zig:1110:13: 0x32605c in openFileZ (build)
  266. try os.openatZ(self.fd, sub_path, os_flags, 0);
  267. ^
  268. /home/user/data/pools/pool00/CVS-Archive/ZIG/zig/lib/std/fs.zig:1037:9: 0x2f99de in openFile (build)
  269. return self.openFileZ(&path_c, flags);
  270. ^
  271. /home/user/data/pools/pool00/CVS-Archive/ZIG/zig/lib/std/fs.zig:2250:24: 0x382630 in updateFile (build)
  272. var src_file = try source_dir.openFile(source_path, .{});
  273. ^
  274. /home/user/data/pools/pool00/CVS-Archive/ZIG/zig/lib/std/build.zig:1088:29: 0x38a5a7 in updateFile (build)
  275. const prev_status = try fs.Dir.updateFile(cwd, source_path, cwd, dest_path, .{});
  276. ^
  277. /home/user/data/pools/pool00/CVS-Archive/ZIG/zig/lib/std/build.zig:3420:9: 0x38aa77 in make (build)
  278. try builder.updateFile(self.artifact.getOutputSource().getPath(builder), full_dest_path);
  279. ^
  280. /home/user/data/pools/pool00/CVS-Archive/ZIG/zig/lib/std/build.zig:3655:9: 0x2e9357 in make (build)
  281. try self.makeFn(self);
  282. ^
  283. /home/user/data/pools/pool00/CVS-Archive/ZIG/zig/lib/std/build.zig:508:9: 0x2c7e2a in makeOneStep (build)
  284. try s.make();
  285. ^
  286. /home/user/data/pools/pool00/CVS-Archive/ZIG/zig/lib/std/build.zig:502:17: 0x2c7da2 in makeOneStep (build)
  287. return err;
  288. ^
  289. /home/user/data/pools/pool00/CVS-Archive/ZIG/zig/lib/std/build.zig:463:13: 0x2c7b08 in make (build)
  290. try self.makeOneStep(s);
  291. ^
  292. /home/user/data/pools/pool00/CVS-Archive/ZIG/zig/lib/build_runner.zig:213:21: 0x2ca94b in main (build)
  293. else => return err,
  294. ^
  295. /home/user/data/pools/pool00/CVS-Archive/ZIG/zig/lib/std/fs.zig:1361:9: 0x2c711b in makeDir (build)
  296. try os.mkdirat(self.fd, sub_path, default_new_dir_mode);
  297. ^
  298. /home/user/data/pools/pool00/CVS-Archive/ZIG/zig/lib/std/os.zig:1683:23: 0x348820 in openatZ (build)
  299. .NOENT => return error.FileNotFound,
  300. ^
  301. /home/user/data/pools/pool00/CVS-Archive/ZIG/zig/lib/std/fs.zig:1110:13: 0x32605c in openFileZ (build)
  302. try os.openatZ(self.fd, sub_path, os_flags, 0);
  303. ^
  304. /home/user/data/pools/pool00/CVS-Archive/ZIG/zig/lib/std/fs.zig:1037:9: 0x2f99de in openFile (build)
  305. return self.openFileZ(&path_c, flags);
  306. ^
  307. /home/user/data/pools/pool00/CVS-Archive/ZIG/zig/lib/std/os.zig:2753:19: 0x2e8f5c in mkdiratZ (build)
  308. .EXIST => return error.PathAlreadyExists,
  309. ^
  310. /home/user/data/pools/pool00/CVS-Archive/ZIG/zig/lib/std/os.zig:2713:9: 0x2c721d in mkdirat (build)
  311. return mkdiratZ(dir_fd, &sub_dir_path_c, mode);
  312. ^
  313. /home/user/data/pools/pool00/CVS-Archive/ZIG/zig/lib/std/fs.zig:1361:9: 0x2c711b in makeDir (build)
  314. try os.mkdirat(self.fd, sub_path, default_new_dir_mode);
  315. ^
  316. /home/user/data/pools/pool00/CVS-Archive/ZIG/zig/lib/std/os.zig:1683:23: 0x348820 in openatZ (build)
  317. .NOENT => return error.FileNotFound,
  318. ^
  319. /home/user/data/pools/pool00/CVS-Archive/ZIG/zig/lib/std/fs.zig:1110:13: 0x32605c in openFileZ (build)
  320. try os.openatZ(self.fd, sub_path, os_flags, 0);
  321. ^
  322. /home/user/data/pools/pool00/CVS-Archive/ZIG/zig/lib/std/fs.zig:1037:9: 0x2f99de in openFile (build)
  323. return self.openFileZ(&path_c, flags);
  324. ^
  325. error: the following build command failed with exit code 1:
  326. /home/user/data/pools/pool00/CVS-Archive/ZIG/zig/zig-cache/o/691d30e7ccc5491577a96cd4407e2737/build /home/user/data/pools/pool00/CVS-Archive/ZIG/zig/build/zig2 /home/user/data/pools/pool00/CVS-Archive/ZIG/zig /home/user/data/pools/pool00/CVS-Archive/ZIG/zig/zig-cache /home/user/.cache/zig --zig-lib-dir /home/user/data/pools/pool00/CVS-Archive/ZIG/zig/lib --prefix /home/user/data/pools/pool00/CVS-Archive/ZIG/zig/build/stage3 -Dconfig_h=/home/user/data/pools/pool00/CVS-Archive/ZIG/zig/build/config.h -Denable-llvm -Denable-stage1 -Dskip-install-lib-files=false -Dtarget=native -Dcpu=baseline
  327. make[2]: *** [CMakeFiles/stage3.dir/build.make:71: CMakeFiles/stage3] Error 1
  328. make[1]: *** [CMakeFiles/Makefile2:260: CMakeFiles/stage3.dir/all] Error 2
  329. make: *** [Makefile:136: all] Error 2
  330. [1] 5720 exit 2 make
  331. host:zig/build>
  332.  
  333. Script done on 2022-09-05 19:42:26+02:00 [COMMAND_EXIT_CODE="2"]
Advertisement
Add Comment
Please, Sign In to add comment
Advertisement