Advertisement
Centril

Untitled

Nov 19th, 2014
205
Never
Not a member of Pastebin yet? Sign Up, it unlocks many cool features!
  1. D:\Programming\gradle-plugin-robospock (v1.0)
  2. λ gradb --stacktrace
  3. Parallel execution is an incubating feature.
  4. :buildSrc:compileJava UP-TO-DATE
  5. :buildSrc:compileGroovy UP-TO-DATE
  6. :buildSrc:processResources UP-TO-DATE
  7. :buildSrc:classes UP-TO-DATE
  8. :buildSrc:jar UP-TO-DATE
  9. :buildSrc:assemble UP-TO-DATE
  10. :buildSrc:compileTestJava UP-TO-DATE
  11. :buildSrc:compileTestGroovy UP-TO-DATE
  12. :buildSrc:processTestResources UP-TO-DATE
  13. :buildSrc:testClasses UP-TO-DATE
  14. :buildSrc:test UP-TO-DATE
  15. :buildSrc:check UP-TO-DATE
  16. :buildSrc:build UP-TO-DATE
  17. robospock.afterConfigured says: task ':testing:appdynamic:appdynamic-test:robospock'
  18.  
  19. FAILURE: Build failed with an exception.
  20.  
  21. * What went wrong:
  22. A problem occurred configuring project ':testing:appdynamic:appdynamic-test'.
  23. > Cannot increment beyond the total of: 10
  24.  
  25. * Try:
  26. Run with --info or --debug option to get more log output.
  27.  
  28. * Exception is:
  29. org.gradle.api.ProjectConfigurationException: A problem occurred configuring project ':testing:appdynamic:appdynamic-test'.
  30.         at org.gradle.configuration.project.LifecycleProjectEvaluator.addConfigurationFailure(LifecycleProjectEvaluator.java:91)
  31.         at org.gradle.configuration.project.LifecycleProjectEvaluator.notifyAfterEvaluate(LifecycleProjectEvaluator.java:86)
  32.         at org.gradle.configuration.project.LifecycleProjectEvaluator.evaluate(LifecycleProjectEvaluator.java:65)
  33.         at org.gradle.api.internal.project.AbstractProject.evaluate(AbstractProject.java:504)
  34.         at org.gradle.api.internal.project.AbstractProject.evaluate(AbstractProject.java:83)
  35.         at org.gradle.execution.TaskPathProjectEvaluator.configureHierarchy(TaskPathProjectEvaluator.java:47)
  36.         at org.gradle.execution.TaskSelector.getSelection(TaskSelector.java:85)
  37.         at org.gradle.execution.TaskSelector.getSelection(TaskSelector.java:76)
  38.         at org.gradle.execution.commandline.CommandLineTaskParser.parseTasks(CommandLineTaskParser.java:42)
  39.         at org.gradle.execution.TaskNameResolvingBuildConfigurationAction.configure(TaskNameResolvingBuildConfigurationAction.java:44)
  40.         at org.gradle.execution.DefaultBuildExecuter.configure(DefaultBuildExecuter.java:42)
  41.         at org.gradle.execution.DefaultBuildExecuter.access$100(DefaultBuildExecuter.java:23)
  42.         at org.gradle.execution.DefaultBuildExecuter$1.proceed(DefaultBuildExecuter.java:48)
  43.         at org.gradle.execution.ExcludedTaskFilteringBuildConfigurationAction.configure(ExcludedTaskFilteringBuildConfigurationAction.java:47)
  44.         at org.gradle.execution.DefaultBuildExecuter.configure(DefaultBuildExecuter.java:42)
  45.         at org.gradle.execution.DefaultBuildExecuter.access$100(DefaultBuildExecuter.java:23)
  46.         at org.gradle.execution.DefaultBuildExecuter$1.proceed(DefaultBuildExecuter.java:48)
  47.         at org.gradle.execution.DefaultTasksBuildExecutionAction.configure(DefaultTasksBuildExecutionAction.java:44)
  48.         at org.gradle.execution.DefaultBuildExecuter.configure(DefaultBuildExecuter.java:42)
  49.         at org.gradle.execution.DefaultBuildExecuter.select(DefaultBuildExecuter.java:35)
  50.         at org.gradle.initialization.DefaultGradleLauncher.doBuildStages(DefaultGradleLauncher.java:142)
  51.         at org.gradle.initialization.DefaultGradleLauncher.doBuild(DefaultGradleLauncher.java:106)
  52.         at org.gradle.initialization.DefaultGradleLauncher.run(DefaultGradleLauncher.java:86)
  53.         at org.gradle.launcher.exec.InProcessBuildActionExecuter$DefaultBuildController.run(InProcessBuildActionExecuter.java:80)
  54.         at org.gradle.launcher.cli.ExecuteBuildAction.run(ExecuteBuildAction.java:33)
  55.         at org.gradle.launcher.cli.ExecuteBuildAction.run(ExecuteBuildAction.java:24)
  56.         at org.gradle.launcher.exec.InProcessBuildActionExecuter.execute(InProcessBuildActionExecuter.java:36)
  57.         at org.gradle.launcher.exec.InProcessBuildActionExecuter.execute(InProcessBuildActionExecuter.java:26)
  58.         at org.gradle.launcher.daemon.server.exec.ExecuteBuild.doBuild(ExecuteBuild.java:47)
  59.         at org.gradle.launcher.daemon.server.exec.BuildCommandOnly.execute(BuildCommandOnly.java:34)
  60.         at org.gradle.launcher.daemon.server.exec.DaemonCommandExecution.proceed(DaemonCommandExecution.java:119)
  61.         at org.gradle.launcher.daemon.server.exec.WatchForDisconnection.execute(WatchForDisconnection.java:35)
  62.         at org.gradle.launcher.daemon.server.exec.DaemonCommandExecution.proceed(DaemonCommandExecution.java:119)
  63.         at org.gradle.launcher.daemon.server.exec.ResetDeprecationLogger.execute(ResetDeprecationLogger.java:24)
  64.         at org.gradle.launcher.daemon.server.exec.DaemonCommandExecution.proceed(DaemonCommandExecution.java:119)
  65.         at org.gradle.launcher.daemon.server.exec.StartStopIfBuildAndStop.execute(StartStopIfBuildAndStop.java:33)
  66.         at org.gradle.launcher.daemon.server.exec.DaemonCommandExecution.proceed(DaemonCommandExecution.java:119)
  67.         at org.gradle.launcher.daemon.server.exec.ForwardClientInput$2.call(ForwardClientInput.java:71)
  68.         at org.gradle.launcher.daemon.server.exec.ForwardClientInput$2.call(ForwardClientInput.java:69)
  69.         at org.gradle.util.Swapper.swap(Swapper.java:38)
  70.         at org.gradle.launcher.daemon.server.exec.ForwardClientInput.execute(ForwardClientInput.java:69)
  71.         at org.gradle.launcher.daemon.server.exec.DaemonCommandExecution.proceed(DaemonCommandExecution.java:119)
  72.         at org.gradle.launcher.daemon.server.exec.LogToClient.doBuild(LogToClient.java:60)
  73.         at org.gradle.launcher.daemon.server.exec.BuildCommandOnly.execute(BuildCommandOnly.java:34)
  74.         at org.gradle.launcher.daemon.server.exec.DaemonCommandExecution.proceed(DaemonCommandExecution.java:119)
  75.         at org.gradle.launcher.daemon.server.exec.EstablishBuildEnvironment.doBuild(EstablishBuildEnvironment.java:70)
  76.         at org.gradle.launcher.daemon.server.exec.BuildCommandOnly.execute(BuildCommandOnly.java:34)
  77.         at org.gradle.launcher.daemon.server.exec.DaemonCommandExecution.proceed(DaemonCommandExecution.java:119)
  78.         at org.gradle.launcher.daemon.server.exec.DaemonHygieneAction.execute(DaemonHygieneAction.java:39)
  79.         at org.gradle.launcher.daemon.server.exec.DaemonCommandExecution.proceed(DaemonCommandExecution.java:119)
  80.         at org.gradle.launcher.daemon.server.exec.StartBuildOrRespondWithBusy$1.run(StartBuildOrRespondWithBusy.java:46)
  81.         at org.gradle.launcher.daemon.server.DaemonStateCoordinator$1.run(DaemonStateCoordinator.java:246)
  82.         at org.gradle.internal.concurrent.DefaultExecutorFactory$StoppableExecutorImpl$1.run(DefaultExecutorFactory.java:64)
  83. Caused by: java.lang.IllegalStateException: Cannot increment beyond the total of: 10
  84.         at org.gradle.internal.progress.SimpleProgressFormatter.incrementAndGetProgress(SimpleProgressFormatter.java:30)
  85.         at org.gradle.internal.progress.BuildProgressLogger.afterEvaluate(BuildProgressLogger.java:98)
  86.         at org.gradle.internal.progress.BuildProgressFilter.afterEvaluate(BuildProgressFilter.java:74)
  87.         at org.gradle.messaging.dispatch.ReflectionDispatch.dispatch(ReflectionDispatch.java:35)
  88.         at org.gradle.messaging.dispatch.ReflectionDispatch.dispatch(ReflectionDispatch.java:24)
  89.         at org.gradle.listener.BroadcastDispatch.dispatch(BroadcastDispatch.java:83)
  90.         at org.gradle.listener.BroadcastDispatch.dispatch(BroadcastDispatch.java:31)
  91.         at org.gradle.listener.BroadcastDispatch.dispatch(BroadcastDispatch.java:83)
  92.         at org.gradle.listener.BroadcastDispatch.dispatch(BroadcastDispatch.java:31)
  93.         at org.gradle.messaging.dispatch.ProxyDispatchAdapter$DispatchingInvocationHandler.invoke(ProxyDispatchAdapter.java:93)
  94.         at com.sun.proxy.$Proxy13.afterEvaluate(Unknown Source)
  95.         at org.gradle.messaging.dispatch.ReflectionDispatch.dispatch(ReflectionDispatch.java:35)
  96.         at org.gradle.messaging.dispatch.ReflectionDispatch.dispatch(ReflectionDispatch.java:24)
  97.         at org.gradle.listener.BroadcastDispatch.dispatch(BroadcastDispatch.java:83)
  98.         at org.gradle.listener.BroadcastDispatch.dispatch(BroadcastDispatch.java:31)
  99.         at org.gradle.messaging.dispatch.ProxyDispatchAdapter$DispatchingInvocationHandler.invoke(ProxyDispatchAdapter.java:93)
  100.         at com.sun.proxy.$Proxy13.afterEvaluate(Unknown Source)
  101.         at org.gradle.messaging.dispatch.ReflectionDispatch.dispatch(ReflectionDispatch.java:35)
  102.         at org.gradle.messaging.dispatch.ReflectionDispatch.dispatch(ReflectionDispatch.java:24)
  103.         at org.gradle.listener.BroadcastDispatch.dispatch(BroadcastDispatch.java:83)
  104.         at org.gradle.listener.BroadcastDispatch.dispatch(BroadcastDispatch.java:31)
  105.         at org.gradle.messaging.dispatch.ProxyDispatchAdapter$DispatchingInvocationHandler.invoke(ProxyDispatchAdapter.java:93)
  106.         at com.sun.proxy.$Proxy13.afterEvaluate(Unknown Source)
  107.         at org.gradle.configuration.project.LifecycleProjectEvaluator.notifyAfterEvaluate(LifecycleProjectEvaluator.java:79)
  108.         ... 51 more
  109.  
  110. BUILD FAILED
  111.  
  112. Total time: 3.744 secs
Advertisement
RAW Paste Data Copied
Advertisement