Not a member of Pastebin yet?
Sign Up,
it unlocks many cool features!
- [DEBUG] waiting....
- [INFO] ------------------------------------------------------------------------
- [INFO] Reactor Summary for MaryTTS 5.2:
- [INFO]
- [INFO] MaryTTS ............................................ SUCCESS [ 2.592 s]
- [INFO] marytts-common ..................................... SUCCESS [ 8.895 s]
- [INFO] marytts-signalproc ................................. SUCCESS [ 8.351 s]
- [INFO] marytts-runtime .................................... SUCCESS [ 26.664 s]
- [INFO] marytts-lang-de .................................... SUCCESS [ 3.809 s]
- [INFO] marytts-lang-en .................................... SUCCESS [ 9.460 s]
- [INFO] marytts-lang-te .................................... SUCCESS [ 2.338 s]
- [INFO] marytts-lang-tr .................................... SUCCESS [ 2.360 s]
- [INFO] marytts-lang-ru .................................... SUCCESS [ 2.315 s]
- [INFO] marytts-lang-it .................................... SUCCESS [ 3.908 s]
- [INFO] marytts-lang-fr .................................... SUCCESS [ 4.119 s]
- [INFO] marytts-lang-sv .................................... SUCCESS [ 2.298 s]
- [INFO] marytts-lang-lb .................................... SUCCESS [ 8.311 s]
- [INFO] marytts-languages .................................. SUCCESS [ 0.165 s]
- [INFO] voice-cmu-slt-hsmm ................................. SUCCESS [ 7.356 s]
- [INFO] marytts-client ..................................... SUCCESS [ 6.471 s]
- [INFO] marytts-builder .................................... SUCCESS [ 25.950 s]
- [INFO] marytts-redstart ................................... SUCCESS [ 1.520 s]
- [INFO] marytts-transcription .............................. SUCCESS [ 1.335 s]
- [INFO] marytts-assembly-builder ........................... SUCCESS [ 0.685 s]
- [INFO] marytts-assembly-runtime ........................... FAILURE [ 0.288 s]
- [INFO] marytts-assembly ................................... SKIPPED
- [INFO] ------------------------------------------------------------------------
- [INFO] BUILD FAILURE
- [INFO] ------------------------------------------------------------------------
- [INFO] Total time: 02:10 min
- [INFO] Finished at: 2020-02-07T09:31:51Z
- [INFO] ------------------------------------------------------------------------
- [ERROR] Failed to execute goal org.fortasoft:gradle-maven-plugin:1.0.7:invoke (default) on project marytts-assembly-runtime: org.gradle.tooling.GradleConnectionException: Could not install Gradle distribution from 'http://services.gradle.org/distributions/gradle-2.11-bin.zip'. -> [Help 1]
- org.apache.maven.lifecycle.LifecycleExecutionException: Failed to execute goal org.fortasoft:gradle-maven-plugin:1.0.7:invoke (default) on project marytts-assembly-runtime: org.gradle.tooling.GradleConnectionException: Could not install Gradle distribution from 'http://services.gradle.org/distributions/gradle-2.11-bin.zip'.
- at org.apache.maven.lifecycle.internal.MojoExecutor.execute (MojoExecutor.java:215)
- at org.apache.maven.lifecycle.internal.MojoExecutor.execute (MojoExecutor.java:156)
- at org.apache.maven.lifecycle.internal.MojoExecutor.execute (MojoExecutor.java:148)
- at org.apache.maven.lifecycle.internal.LifecycleModuleBuilder.buildProject (LifecycleModuleBuilder.java:117)
- at org.apache.maven.lifecycle.internal.LifecycleModuleBuilder.buildProject (LifecycleModuleBuilder.java:81)
- at org.apache.maven.lifecycle.internal.builder.singlethreaded.SingleThreadedBuilder.build (SingleThreadedBuilder.java:56)
- at org.apache.maven.lifecycle.internal.LifecycleStarter.execute (LifecycleStarter.java:128)
- at org.apache.maven.DefaultMaven.doExecute (DefaultMaven.java:305)
- at org.apache.maven.DefaultMaven.doExecute (DefaultMaven.java:192)
- at org.apache.maven.DefaultMaven.execute (DefaultMaven.java:105)
- at org.apache.maven.cli.MavenCli.execute (MavenCli.java:956)
- at org.apache.maven.cli.MavenCli.doMain (MavenCli.java:288)
- at org.apache.maven.cli.MavenCli.main (MavenCli.java:192)
- at sun.reflect.NativeMethodAccessorImpl.invoke0 (Native Method)
- at sun.reflect.NativeMethodAccessorImpl.invoke (NativeMethodAccessorImpl.java:62)
- at sun.reflect.DelegatingMethodAccessorImpl.invoke (DelegatingMethodAccessorImpl.java:43)
- at java.lang.reflect.Method.invoke (Method.java:498)
- at org.codehaus.plexus.classworlds.launcher.Launcher.launchEnhanced (Launcher.java:282)
- at org.codehaus.plexus.classworlds.launcher.Launcher.launch (Launcher.java:225)
- at org.codehaus.plexus.classworlds.launcher.Launcher.mainWithExitCode (Launcher.java:406)
- at org.codehaus.plexus.classworlds.launcher.Launcher.main (Launcher.java:347)
- Caused by: org.apache.maven.plugin.MojoFailureException: org.gradle.tooling.GradleConnectionException: Could not install Gradle distribution from 'http://services.gradle.org/distributions/gradle-2.11-bin.zip'.
- at org.fortasoft.maven.plugin.gradle.GradleMojo.execute (GradleMojo.java:254)
- at org.apache.maven.plugin.DefaultBuildPluginManager.executeMojo (DefaultBuildPluginManager.java:137)
- at org.apache.maven.lifecycle.internal.MojoExecutor.execute (MojoExecutor.java:210)
- at org.apache.maven.lifecycle.internal.MojoExecutor.execute (MojoExecutor.java:156)
- at org.apache.maven.lifecycle.internal.MojoExecutor.execute (MojoExecutor.java:148)
- at org.apache.maven.lifecycle.internal.LifecycleModuleBuilder.buildProject (LifecycleModuleBuilder.java:117)
- at org.apache.maven.lifecycle.internal.LifecycleModuleBuilder.buildProject (LifecycleModuleBuilder.java:81)
- at org.apache.maven.lifecycle.internal.builder.singlethreaded.SingleThreadedBuilder.build (SingleThreadedBuilder.java:56)
- at org.apache.maven.lifecycle.internal.LifecycleStarter.execute (LifecycleStarter.java:128)
- at org.apache.maven.DefaultMaven.doExecute (DefaultMaven.java:305)
- at org.apache.maven.DefaultMaven.doExecute (DefaultMaven.java:192)
- at org.apache.maven.DefaultMaven.execute (DefaultMaven.java:105)
- at org.apache.maven.cli.MavenCli.execute (MavenCli.java:956)
- at org.apache.maven.cli.MavenCli.doMain (MavenCli.java:288)
- at org.apache.maven.cli.MavenCli.main (MavenCli.java:192)
- at sun.reflect.NativeMethodAccessorImpl.invoke0 (Native Method)
- at sun.reflect.NativeMethodAccessorImpl.invoke (NativeMethodAccessorImpl.java:62)
- at sun.reflect.DelegatingMethodAccessorImpl.invoke (DelegatingMethodAccessorImpl.java:43)
- at java.lang.reflect.Method.invoke (Method.java:498)
- at org.codehaus.plexus.classworlds.launcher.Launcher.launchEnhanced (Launcher.java:282)
- at org.codehaus.plexus.classworlds.launcher.Launcher.launch (Launcher.java:225)
- at org.codehaus.plexus.classworlds.launcher.Launcher.mainWithExitCode (Launcher.java:406)
- at org.codehaus.plexus.classworlds.launcher.Launcher.main (Launcher.java:347)
- [ERROR]
- [ERROR]
- [ERROR] For more information about the errors and possible solutions, please read the following articles:
- [ERROR] [Help 1] http://cwiki.apache.org/confluence/display/MAVEN/MojoFailureException
- [ERROR]
- [ERROR] After correcting the problems, you can resume the build with the command
- [ERROR] mvn <goals> -rf :marytts-assembly-runtime
Advertisement
Add Comment
Please, Sign In to add comment